FailedOk

th/SRPMS[OK]
th/x32[OK]
th/i686[OK]
th/x86_64[OK]

ac/SRPMS[OK]
ac/i386[OK]
ac/i586[OK]
ac/i686[OK]
ac/alpha[OK]
ac/amd64[OK]
ac/athlon[OK]
ac/ppc[OK]
ac/sparc[OK]
ac/sparc64[OK]

Advanced Search
main()
Powered by PLD Linux
(c) 2002-2020 PLD Team
$Revision: 1.37 $
Powered by bogon.
Your IP: 3.89.87.12

php-pecl-xmlrpc 81217a71-84cd-45b6-984d-735b41008b5b

Status:OK
Source URL:https://buildlogs.pld-linux.org/pld/th/x86_64/OK/php-pecl-xmlrpc,81217a71-84cd-45b6-984d-735b41008b5b.bz2
text/plain URL:View!
full text:View!
rpm -qa of builder:View!
Date:2020/10/15 00:53:48
Runtime:0:00:06.257661

Toc:

  • error 1
  • rpm: error: Failed build dependencies:
  • error 2
  • rpm: error: Failed build dependencies:
  • prep
  • Executing(%prep): /bin/sh -e /tmp/B.MrVBeM/BUILD/tmp/rpm-tmp.97480
  • build
  • Executing(%build): /bin/sh -e /tmp/B.MrVBeM/BUILD/tmp/rpm-tmp.97480
  • error 3
  • 011+ Warning: xmlrpc_server_call_method(): XML parse error: [line 0, column 1, message: syntax error] Unable to add introspection data returned from bar::test() in /tmp/B.MrVBeM/BUILD/php80-pecl-xmlrpc-1.0.0/tests/bug45556.php on line 21
  • error 4
  • 003- Warning: xmlrpc_server_call_method(): XML parse error: [line 1, column 1, message: Invalid document end] Unable to add introspection data returned from bar::test() in %s on line %d
  • install
  • Executing(%install): /bin/sh -e /tmp/B.MrVBeM/BUILD/tmp/rpm-tmp.59848
  • files php80-pecl-xmlrpc
  • Processing files: php80-pecl-xmlrpc-1.0.0-0.1.1ed83f2.x86_64
  • doc
  • Executing(%doc): /bin/sh -e /tmp/B.MrVBeM/BUILD/tmp/rpm-tmp.48784
  • files php80-pecl-xmlrpc-debuginfo
  • Processing files: php80-pecl-xmlrpc-debuginfo-1.0.0-0.1.1ed83f2.x86_64
  • clean
  • Executing(%clean): /bin/sh -e /tmp/B.MrVBeM/BUILD/tmp/rpm-tmp.48784

Content:

checking if we should skip the build
started at: Thu Oct 15 00:53:19 2020
killing old processes on a builder
sending signal 9 to pid -1
Killed
cleaning up /tmp
fetching https://srcbuilder.pld-linux.org/th//srpms/81217a71-84cd-45b6-984d-735b41008b5b/php80-pecl-xmlrpc-1.0.0-0.1.1ed83f2.src.rpm
fetched 91653 bytes, 278.6 K/s
installing srpm: php80-pecl-xmlrpc-1.0.0-0.1.1ed83f2.src.rpm
+ install -d /tmp/B.MrVBeM/BUILD /tmp/B.MrVBeM/RPMS
+ LC_ALL=en_US.UTF-8
+ rpm -qp --changelog php80-pecl-xmlrpc-1.0.0-0.1.1ed83f2.src.rpm
* Wed Oct 14 2020 PLD Linux Team <feedback@pld-linux.org>
- For complete changelog see: http://git.pld-linux.org/?p=packages/php-pecl-xmlrpc.git;a=log;h=master
* Wed Oct 14 2020 Elan Ruusamäe <glen@pld-linux.org> 516fbba
- Update failing test list (investigate later) * Wed Oct 14 2020 Elan Ruusamäe <glen@pld-linux.org> 7eed6ba
- Update build hack with xmlrpc-epi from php.spec * Wed Oct 14 2020 Elan Ruusamäe <glen@pld-linux.org> 6909572
- new, pecl package for ext-xmlrpc + rpm -Uhv --nodeps --define '_topdir /tmp/B.MrVBeM' --define '_specdir %{_topdir}' --define '_sourcedir %{_specdir}' --define '_rpmdir %{_topdir}/RPMS' --define '_builddir %{_topdir}/BUILD' --define 'php_suffix 80' php80-pecl-xmlrpc-1.0.0-0.1.1ed83f2.src.rpm Preparing... ################################################## php80-pecl-xmlrpc ################################################## + rm -f php80-pecl-xmlrpc-1.0.0-0.1.1ed83f2.src.rpm + install -m 700 -d /tmp/B.MrVBeM/BUILD/tmp + TMPDIR=/tmp/B.MrVBeM/BUILD/tmp + exec nice -n 0 rpmbuild -bp --short-circuit --nodeps --define '_topdir /tmp/B.MrVBeM' --define '_specdir %{_topdir}' --define '_sourcedir %{_specdir}' --define '_rpmdir %{_topdir}/RPMS' --define '_builddir %{_topdir}/BUILD' --target x86_64-pld-linux --define 'php_suffix 80' --define 'prep exit 0' /tmp/B.MrVBeM/php-pecl-xmlrpc.spec sh: php-config: inaccessible or not found Building target platforms: x86_64-pld-linux checking BuildConflict-ing packages no BuildConflicts found checking BR rpm: sh: php-config: inaccessible or not found rpm: error: Failed build dependencies: rpm: php80-cli is needed by php80-pecl-xmlrpc-1.0.0-0.1.1ed83f2.src rpm: php80-devel >= 4:8.0.0 is needed by php80-pecl-xmlrpc-1.0.0-0.1.1ed83f2.src rpm: php80-pcre is needed by php80-pecl-xmlrpc-1.0.0-0.1.1ed83f2.src rpm: Building target platforms: x86_64-pld-linux updating poldek cache... ready is up to date th is up to date th is up to date th-ready is up to date th-ready is up to date Retrieving th-test::packages.ndir.diff.toc.gz..............................................done Retrieving diff::packages.ndir.2020.10.14-12.47.03.gz......................................done Loading [pndir]th-test... Applying packages.ndir.2020.10.14-12.47.03.gz... Retrieving diff::packages.ndir.2020.10.14-17.40.03.gz......................................done Applying packages.ndir.2020.10.14-17.40.03.gz... Writing /root/.poldek-cache/[...]/packages.ndir.gz... Retrieving th-test::packages.ndir.diff.toc.gz..............................................done Retrieving diff::packages.ndir.2020.10.14-17.26.01.gz......................................done Loading [pndir]th-test... Applying packages.ndir.2020.10.14-17.26.01.gz... Retrieving diff::packages.ndir.2020.10.14-17.40.03.gz......................................done Applying packages.ndir.2020.10.14-17.40.03.gz... Retrieving diff::packages.ndir.2020.10.14-17.41.02.gz......................................done Applying packages.ndir.2020.10.14-17.41.02.gz... Writing /root/.poldek-cache/[...]/packages.ndir.gz... checking conflicting packages in BRed packages poldek: Loading [pndir]ready... poldek: Loading [pndir]th-test... poldek: Loading [pndir]th-test... poldek: Loading [pndir]th-ready... poldek: Loading [pndir]th-ready... poldek: Loading [pndir]th... poldek: Loading [pndir]th... poldek: 31774 packages read poldek: Removed 3218 duplicate packages from available set poldek: Processing dependencies... poldek: There are 3 packages to install: poldek: A php80-cli-8.0.0-0.rc1.1.x86_64 php80-common-8.0.0-0.rc1.1.x86_64 poldek: A php80-devel-8.0.0-0.rc1.1.x86_64 poldek: This operation will use 10.1MB of disk space. poldek: Need to get 2.1MB of archives (2.1MB to download). poldek: poldek: Retrieving [1/3] th-test::php80-common-8.0.0-0.rc1.1.x86_64.rpm..............................done poldek: Retrieving [2/3] th-test::php80-cli-8.0.0-0.rc1.1.x86_64.rpm...............................done poldek: Retrieving [3/3] th-test::php80-devel-8.0.0-0.rc1.1.x86_64.rpm..............................done poldek: Executing pm-command.sh --upgrade -vh --test --root / --define _check_dirname_deps 1... poldek: Preparing... ################################################## no conflicts found checking BR rpm: sh: php-config: inaccessible or not found rpm: error: Failed build dependencies: rpm: php80-cli is needed by php80-pecl-xmlrpc-1.0.0-0.1.1ed83f2.src rpm: php80-devel >= 4:8.0.0 is needed by php80-pecl-xmlrpc-1.0.0-0.1.1ed83f2.src rpm: php80-pcre is needed by php80-pecl-xmlrpc-1.0.0-0.1.1ed83f2.src rpm: Building target platforms: x86_64-pld-linux installing BR: php80\-cli php80\-devel php80\-pcre + poldek --noask --caplookup -Q -v '--ignore=hhvm-*' '--ignore=php4-*' '--ignore=php52-*' '--ignore=php53-*' '--ignore=php54-*' '--ignore=php55-*' '--ignore=php56-*' '--ignore=php70-*' '--ignore=php71-*' '--ignore=php72-*' '--ignore=php73-*' '--ignore=php74-*' --upgrade php80-cli php80-devel php80-pcre Loading [pndir]ready... Loading [pndir]th-test... Loading [pndir]th-test... Loading [pndir]th-ready... Loading [pndir]th-ready... Loading [pndir]th... Loading [pndir]th... 31774 packages read Removed 3218 duplicate packages from available set Processing dependencies... There are 3 packages to install: A php80-cli-8.0.0-0.rc1.1.x86_64 php80-common-8.0.0-0.rc1.1.x86_64 A php80-devel-8.0.0-0.rc1.1.x86_64 This operation will use 10.1MB of disk space. Need to get 2.1MB of archives. Executing pm-command.sh --upgrade -vh --root / --define _check_dirname_deps 1... Preparing... ################################################## php80-common ################################################## php80-cli ################################################## php80-devel ################################################## building RPM using: set -ex; : build-id: 81217a71-84cd-45b6-984d-735b41008b5b; TMPDIR=/tmp/B.MrVBeM/BUILD/tmp exec nice -n 0 rpmbuild -bb --define '_smp_mflags -j9' --define '_make_opts -Otarget' --define '_pld_builder 1' --define '_topdir /tmp/B.MrVBeM' --define '_specdir %{_topdir}' --define '_sourcedir %{_specdir}' --define '_rpmdir %{_topdir}/RPMS' --define '_builddir %{_topdir}/BUILD' --target x86_64-pld-linux --define 'php_suffix 80' /tmp/B.MrVBeM/php-pecl-xmlrpc.spec + : build-id: 81217a71-84cd-45b6-984d-735b41008b5b + TMPDIR=/tmp/B.MrVBeM/BUILD/tmp + exec nice -n 0 rpmbuild -bb --define '_smp_mflags -j9' --define '_make_opts -Otarget' --define '_pld_builder 1' --define '_topdir /tmp/B.MrVBeM' --define '_specdir %{_topdir}' --define '_sourcedir %{_specdir}' --define '_rpmdir %{_topdir}/RPMS' --define '_builddir %{_topdir}/BUILD' --target x86_64-pld-linux --define 'php_suffix 80' /tmp/B.MrVBeM/php-pecl-xmlrpc.spec Building target platforms: x86_64-pld-linux Executing(%prep): /bin/sh -e /tmp/B.MrVBeM/BUILD/tmp/rpm-tmp.97480 + umask 022 + cd /tmp/B.MrVBeM/BUILD + cd /tmp/B.MrVBeM/BUILD + rm -rf php80-pecl-xmlrpc-1.0.0 + /bin/mkdir -p php80-pecl-xmlrpc-1.0.0 + cd php80-pecl-xmlrpc-1.0.0 + /bin/gzip -dc /tmp/B.MrVBeM/php-pecl-xmlrpc-1.0.0-1ed83f2.tar.gz + /bin/tar -xf - + STATUS=0 + '[' 0 -ne 0 ']' + /bin/id -u + '[' 1000 '=' 0 ']' + /bin/id -u + '[' 1000 '=' 0 ']' + /bin/chmod -Rf a+rX,u+w,g-w,o-w . + mv pecl-networking-xmlrpc-1ed83f27d1772fb67fa0f46c27a7e4e2920bed78/CREDITS pecl-networking-xmlrpc-1ed83f27d1772fb67fa0f46c27a7e4e2920bed78/EXPERIMENTAL pecl-networking-xmlrpc-1ed83f27d1772fb67fa0f46c27a7e4e2920bed78/LICENSE pecl-networking-xmlrpc-1ed83f27d1772fb67fa0f46c27a7e4e2920bed78/Makefile.frag pecl-networking-xmlrpc-1ed83f27d1772fb67fa0f46c27a7e4e2920bed78/config.m4 pecl-networking-xmlrpc-1ed83f27d1772fb67fa0f46c27a7e4e2920bed78/config.w32 pecl-networking-xmlrpc-1ed83f27d1772fb67fa0f46c27a7e4e2920bed78/libxmlrpc pecl-networking-xmlrpc-1ed83f27d1772fb67fa0f46c27a7e4e2920bed78/php_xmlrpc.h pecl-networking-xmlrpc-1ed83f27d1772fb67fa0f46c27a7e4e2920bed78/tests pecl-networking-xmlrpc-1ed83f27d1772fb67fa0f46c27a7e4e2920bed78/xmlrpc-epi-php.c pecl-networking-xmlrpc-1ed83f27d1772fb67fa0f46c27a7e4e2920bed78/xmlrpc.stub.php pecl-networking-xmlrpc-1ed83f27d1772fb67fa0f46c27a7e4e2920bed78/xmlrpc_arginfo.h . + /bin/sed -i -e '/PHP_ADD_LIBRARY_WITH_PATH/s#xmlrpc,#xmlrpc-epi,#' config.m4 + <<"EOF" + >run-tests.sh + cat + chmod +x run-tests.sh + <<"EOF" + read line + t='tests/005.phpt]' + t=tests/005.phpt + xfail tests/005.phpt + typeset 't=tests/005.phpt' + test -f tests/005.phpt + >>tests/005.phpt + <<-EOF + cat + read line + t='tests/bug40576_64bit.phpt]' + t=tests/bug40576_64bit.phpt + xfail tests/bug40576_64bit.phpt + typeset 't=tests/bug40576_64bit.phpt' + test -f tests/bug40576_64bit.phpt + >>tests/bug40576_64bit.phpt + <<-EOF + cat + read line + t='tests/bug45555.phpt]' + t=tests/bug45555.phpt + xfail tests/bug45555.phpt + typeset 't=tests/bug45555.phpt' + test -f tests/bug45555.phpt + >>tests/bug45555.phpt + <<-EOF + cat + read line + t='tests/bug45556.phpt]' + t=tests/bug45556.phpt + xfail tests/bug45556.phpt + typeset 't=tests/bug45556.phpt' + test -f tests/bug45556.phpt + >>tests/bug45556.phpt + <<-EOF + cat + read line + t='tests/bug77242.phpt]' + t=tests/bug77242.phpt + xfail tests/bug77242.phpt + typeset 't=tests/bug77242.phpt' + test -f tests/bug77242.phpt + >>tests/bug77242.phpt + <<-EOF + cat + read line + exit 0 Executing(%build): /bin/sh -e /tmp/B.MrVBeM/BUILD/tmp/rpm-tmp.97480 TMP=/home/users/builder/tmp HOME=/home/users/builder PATH=/home/users/builder/GNUstep/Tools:/bin:/usr/bin:/usr/local/bin:/home/users/builder/bin TMPDIR=/tmp/B.MrVBeM/BUILD/tmp + umask 022 + cd /tmp/B.MrVBeM/BUILD + cd php80-pecl-xmlrpc-1.0.0 + export 'CPPFLAGS= -I/usr/include/xmlrpc-epi' + phpize Configuring for: PHP Api Version: 20200930 Zend Module Api No: 20200930 Zend Extension Api No: 420200930 + ./configure 'LDFLAGS=-Wl,--as-needed -Wl,--no-copy-dt-needed-entries -Wl,-z,relro -Wl,-z,combreloc ' 'CFLAGS=-O2 -fwrapv -pipe -Wformat -Werror=format-security -gdwarf-4 -fno-debug-types-section -fvar-tracking-assignments -g2 -Wp,-D_FORTIFY_SOURCE=2 -fstack-protector-strong --param=ssp-buffer-size=4 -Werror=trampolines -fPIC -march=x86-64 -gdwarf-4 -fno-debug-types-section -fvar-tracking-assignments -g2 ' 'CXXFLAGS=-O2 -fwrapv -pipe -Wformat -Werror=format-security -gdwarf-4 -fno-debug-types-section -fvar-tracking-assignments -g2 -Wp,-D_FORTIFY_SOURCE=2 -fstack-protector-strong --param=ssp-buffer-size=4 -Werror=trampolines -fPIC -march=x86-64 -gdwarf-4 -fno-debug-types-section -fvar-tracking-assignments -g2 ' 'FFLAGS=-O2 -fwrapv -pipe -Wformat -Werror=format-security -gdwarf-4 -fno-debug-types-section -fvar-tracking-assignments -g2 -Wp,-D_FORTIFY_SOURCE=2 -fstack-protector-strong --param=ssp-buffer-size=4 -Werror=trampolines -fPIC -march=x86-64 -gdwarf-4 -fno-debug-types-section -fvar-tracking-assignments -g2 ' 'FCFLAGS=-O2 -fwrapv -pipe -Wformat -Werror=format-security -gdwarf-4 -fno-debug-types-section -fvar-tracking-assignments -g2 -Wp,-D_FORTIFY_SOURCE=2 -fstack-protector-strong --param=ssp-buffer-size=4 -Werror=trampolines -fPIC -march=x86-64 -gdwarf-4 -fno-debug-types-section -fvar-tracking-assignments -g2 ' 'CPPFLAGS= -I/usr/include/xmlrpc-epi' 'CC=x86_64-pld-linux-gcc' 'CXX=x86_64-pld-linux-g++' '--host=x86_64-pld-linux' '--build=x86_64-pld-linux' '--prefix=/usr' '--exec-prefix=/usr' '--bindir=/usr/bin' '--sbindir=/usr/sbin' '--sysconfdir=/etc' '--datadir=/usr/share' '--includedir=/usr/include' '--libdir=/usr/lib64' '--libexecdir=/usr/libexec' '--localstatedir=/var' '--sharedstatedir=/var/lib' '--mandir=/usr/share/man' '--infodir=/usr/share/info' '--x-libraries=/usr/lib64' '--with-xmlrpc=shared,/usr' checking for grep that handles long lines and -e... /bin/grep checking for egrep... /bin/grep -E checking for a sed that does not truncate output... /bin/sed checking for x86_64-pld-linux-pkg-config... no checking for pkg-config... /usr/bin/pkg-config checking pkg-config is at least version 0.9.0... yes checking for x86_64-pld-linux-cc... x86_64-pld-linux-gcc checking whether the C compiler works... yes checking for C compiler default output file name... a.out checking for suffix of executables... checking whether we are cross compiling... no checking for suffix of object files... o checking whether we are using the GNU C compiler... yes checking whether x86_64-pld-linux-gcc accepts -g... yes checking for x86_64-pld-linux-gcc option to accept ISO C89... none needed checking how to run the C preprocessor... x86_64-pld-linux-gcc -E checking for icc... no checking for suncc... no checking for system library directory... lib checking if compiler supports -R... no checking if compiler supports -Wl,-rpath,... yes checking build system type... x86_64-pld-linux-gnu checking host system type... x86_64-pld-linux-gnu checking target system type... x86_64-pld-linux-gnu checking for PHP prefix... /usr checking for PHP includes... -I/usr/include/php -I/usr/include/php/main -I/usr/include/php/TSRM -I/usr/include/php/Zend -I/usr/include/php/ext -I/usr/include/php/ext/date/lib checking for PHP extension directory... /usr/lib64/php80 checking for PHP installed headers prefix... /usr/include/php checking if debug is enabled... no checking if zts is enabled... no checking for gawk... gawk checking whether to build with XMLRPC-EPI support... yes, shared checking whether to build with expat support... no checking iconv dir for XMLRPC-EPI... no checking for libxml-2.0 >= 2.9.0... yes checking how to print strings... print -r checking for a sed that does not truncate output... (cached) /bin/sed checking for fgrep... /bin/grep -F checking for ld used by x86_64-pld-linux-gcc... /usr/bin/ld checking if the linker (/usr/bin/ld) is GNU ld... yes checking for BSD- or MS-compatible name lister (nm)... /usr/bin/nm -B checking the name lister (/usr/bin/nm -B) interface... BSD nm checking whether ln -s works... yes checking the maximum length of command line arguments... 1572864 checking how to convert x86_64-pld-linux-gnu file names to x86_64-pld-linux-gnu format... func_convert_file_noop checking how to convert x86_64-pld-linux-gnu file names to toolchain format... func_convert_file_noop checking for /usr/bin/ld option to reload object files... -r checking for x86_64-pld-linux-objdump... no checking for objdump... objdump checking how to recognize dependent libraries... pass_all checking for x86_64-pld-linux-dlltool... no checking for dlltool... no checking how to associate runtime and link libraries... print -r -- checking for x86_64-pld-linux-ar... no checking for ar... ar checking for archiver @FILE support... @ checking for x86_64-pld-linux-strip... no checking for strip... strip checking for x86_64-pld-linux-ranlib... no checking for ranlib... ranlib checking for mawk... (cached) gawk checking command to parse /usr/bin/nm -B output from x86_64-pld-linux-gcc object... ok checking for sysroot... no checking for a working dd... /bin/dd checking how to truncate binary pipes... /bin/dd bs=4096 count=1 checking for x86_64-pld-linux-mt... no checking for mt... no checking if : is a manifest tool... no checking for ANSI C header files... yes checking for sys/types.h... yes checking for sys/stat.h... yes checking for stdlib.h... yes checking for string.h... yes checking for memory.h... yes checking for strings.h... yes checking for inttypes.h... yes checking for stdint.h... yes checking for unistd.h... yes checking for dlfcn.h... yes checking for objdir... .libs checking if x86_64-pld-linux-gcc supports -fno-rtti -fno-exceptions... no checking for x86_64-pld-linux-gcc option to produce PIC... -fPIC -DPIC checking if x86_64-pld-linux-gcc PIC flag -fPIC -DPIC works... yes checking if x86_64-pld-linux-gcc static flag -static works... yes checking if x86_64-pld-linux-gcc supports -c -o file.o... yes checking if x86_64-pld-linux-gcc supports -c -o file.o... (cached) yes checking whether the x86_64-pld-linux-gcc linker (/usr/bin/ld -m elf_x86_64) supports shared libraries... yes checking whether -lc should be explicitly linked in... no checking dynamic linker characteristics... GNU/Linux ld.so checking how to hardcode library paths into programs... immediate checking whether stripping libraries is possible... yes checking if libtool supports shared libraries... yes checking whether to build shared libraries... yes checking whether to build static libraries... no configure: patching config.h.in configure: creating ./config.status config.status: creating config.h config.status: executing libtool commands + /usr/bin/make -Otarget -j9 Makefile:231: warning: overriding recipe for target 'xmlrpc-epi-php.lo' Makefile:228: warning: ignoring old recipe for target 'xmlrpc-epi-php.lo' /bin/sh /tmp/B.MrVBeM/BUILD/php80-pecl-xmlrpc-1.0.0/libtool --mode=compile x86_64-pld-linux-gcc -I. -I/tmp/B.MrVBeM/BUILD/php80-pecl-xmlrpc-1.0.0 -I/tmp/B.MrVBeM/BUILD/php80-pecl-xmlrpc-1.0.0/include -I/tmp/B.MrVBeM/BUILD/php80-pecl-xmlrpc-1.0.0/main -I/tmp/B.MrVBeM/BUILD/php80-pecl-xmlrpc-1.0.0 -I/usr/include/php -I/usr/include/php/main -I/usr/include/php/TSRM -I/usr/include/php/Zend -I/usr/include/php/ext -I/usr/include/php/ext/date/lib -I/usr/include/libxml2 -I/usr/include/xmlrpc-epi -I/usr/include/xmlrpc-epi -DHAVE_CONFIG_H -O2 -fwrapv -pipe -Wformat -Werror=format-security -gdwarf-4 -fno-debug-types-section -fvar-tracking-assignments -g2 -Wp,-D_FORTIFY_SOURCE=2 -fstack-protector-strong --param=ssp-buffer-size=4 -Werror=trampolines -fPIC -march=x86-64 -gdwarf-4 -fno-debug-types-section -fvar-tracking-assignments -g2 -c /tmp/B.MrVBeM/BUILD/php80-pecl-xmlrpc-1.0.0/xmlrpc-epi-php.c -o xmlrpc-epi-php.lo libtool: compile: x86_64-pld-linux-gcc -I. -I/tmp/B.MrVBeM/BUILD/php80-pecl-xmlrpc-1.0.0 -I/tmp/B.MrVBeM/BUILD/php80-pecl-xmlrpc-1.0.0/include -I/tmp/B.MrVBeM/BUILD/php80-pecl-xmlrpc-1.0.0/main -I/tmp/B.MrVBeM/BUILD/php80-pecl-xmlrpc-1.0.0 -I/usr/include/php -I/usr/include/php/main -I/usr/include/php/TSRM -I/usr/include/php/Zend -I/usr/include/php/ext -I/usr/include/php/ext/date/lib -I/usr/include/libxml2 -I/usr/include/xmlrpc-epi -I/usr/include/xmlrpc-epi -DHAVE_CONFIG_H -O2 -fwrapv -pipe -Wformat -Werror=format-security -gdwarf-4 -fno-debug-types-section -fvar-tracking-assignments -g2 -Wp,-D_FORTIFY_SOURCE=2 -fstack-protector-strong --param=ssp-buffer-size=4 -Werror=trampolines -fPIC -march=x86-64 -gdwarf-4 -fno-debug-types-section -fvar-tracking-assignments -g2 -c /tmp/B.MrVBeM/BUILD/php80-pecl-xmlrpc-1.0.0/xmlrpc-epi-php.c -fPIC -DPIC -o .libs/xmlrpc-epi-php.o /bin/sh /tmp/B.MrVBeM/BUILD/php80-pecl-xmlrpc-1.0.0/libtool --mode=link x86_64-pld-linux-gcc -shared -I/tmp/B.MrVBeM/BUILD/php80-pecl-xmlrpc-1.0.0/include -I/tmp/B.MrVBeM/BUILD/php80-pecl-xmlrpc-1.0.0/main -I/tmp/B.MrVBeM/BUILD/php80-pecl-xmlrpc-1.0.0 -I/usr/include/php -I/usr/include/php/main -I/usr/include/php/TSRM -I/usr/include/php/Zend -I/usr/include/php/ext -I/usr/include/php/ext/date/lib -I/usr/include/libxml2 -I/usr/include/xmlrpc-epi -I/usr/include/xmlrpc-epi -DHAVE_CONFIG_H -O2 -fwrapv -pipe -Wformat -Werror=format-security -gdwarf-4 -fno-debug-types-section -fvar-tracking-assignments -g2 -Wp,-D_FORTIFY_SOURCE=2 -fstack-protector-strong --param=ssp-buffer-size=4 -Werror=trampolines -fPIC -march=x86-64 -gdwarf-4 -fno-debug-types-section -fvar-tracking-assignments -g2 -Wl,--as-needed -Wl,--no-copy-dt-needed-entries -Wl,-z,relro -Wl,-z,combreloc -o xmlrpc.la -export-dynamic -avoid-version -prefer-pic -module -rpath /tmp/B.MrVBeM/BUILD/php80-pecl-xmlrpc-1.0.0/modules xmlrpc-epi-php.lo -Wl,-rpath,/usr/include/xmlrpc-epi/lib -L/usr/include/xmlrpc-epi/lib -lxmlrpc-epi -lxml2 libtool: link: x86_64-pld-linux-gcc -shared -fPIC -DPIC -O2 -gdwarf-4 -g2 -fstack-protector-strong -march=x86-64 -gdwarf-4 -g2 -Wl,--as-needed -Wl,--no-copy-dt-needed-entries -Wl,-z -Wl,relro -Wl,-z -Wl,combreloc -Wl,-rpath -Wl,/usr/include/xmlrpc-epi/lib -pthread .libs/xmlrpc-epi-php.o -L/usr/include/xmlrpc-epi/lib /usr/lib64/libxmlrpc-epi.so -L/usr/lib64 /usr/lib64/libexpat.so /usr/lib64/libxml2.so -ldl -lz /usr/lib64/liblzma.so -lpthread -lm -Wl,-soname -Wl,xmlrpc.so -o .libs/xmlrpc.so libtool: link: ( cd ".libs" && rm -f "xmlrpc.la" && ln -s "../xmlrpc.la" "xmlrpc.la" ) /bin/sh /tmp/B.MrVBeM/BUILD/php80-pecl-xmlrpc-1.0.0/libtool --mode=install cp ./xmlrpc.la /tmp/B.MrVBeM/BUILD/php80-pecl-xmlrpc-1.0.0/modules libtool: install: cp ./.libs/xmlrpc.so /tmp/B.MrVBeM/BUILD/php80-pecl-xmlrpc-1.0.0/modules/xmlrpc.so libtool: install: cp ./.libs/xmlrpc.lai /tmp/B.MrVBeM/BUILD/php80-pecl-xmlrpc-1.0.0/modules/xmlrpc.la libtool: finish: PATH="/home/users/builder/GNUstep/Tools:/bin:/usr/bin:/usr/local/bin:/home/users/builder/bin:/sbin" ldconfig -n /tmp/B.MrVBeM/BUILD/php80-pecl-xmlrpc-1.0.0/modules ---------------------------------------------------------------------- Libraries have been installed in: /tmp/B.MrVBeM/BUILD/php80-pecl-xmlrpc-1.0.0/modules If you ever happen to want to link against installed libraries in a given directory, LIBDIR, you must either use libtool, and specify the full pathname of the library, or use the '-LLIBDIR' flag during linking and do at least one of the following: - add LIBDIR to the 'LD_LIBRARY_PATH' environment variable during execution - add LIBDIR to the 'LD_RUN_PATH' environment variable during linking - use the '-Wl,-rpath -Wl,LIBDIR' linker flag - have your system administrator add LIBDIR to '/etc/ld.so.conf' See any operating system documentation about shared libraries for more information, such as the ld(1) and ld.so(8) manual pages. ---------------------------------------------------------------------- Build complete. Don't forget to run 'make test'. + >modules.log + /usr/bin/php80 -n -q -d 'extension_dir=modules' -d 'extension=xmlrpc.so' -m + grep xmlrpc modules.log xmlrpc + ./run-tests.sh --show-diff Makefile:231: warning: overriding recipe for target 'xmlrpc-epi-php.lo' Makefile:228: warning: ignoring old recipe for target 'xmlrpc-epi-php.lo' Build complete. Don't forget to run 'make test'. ===================================================================== PHP : /usr/bin/php80 PHP_SAPI : cli PHP_VERSION : 8.0.0rc1 ZEND_VERSION: 4.0.0-dev PHP_OS : Linux - Linux ymir-builder 4.9.237-1 #1 SMP Thu Sep 24 09:41:56 CEST 2020 x86_64 INI actual : /tmp/B.MrVBeM/BUILD/php80-pecl-xmlrpc-1.0.0/tmp-php.ini More .INIs : CWD : /tmp/B.MrVBeM/BUILD/php80-pecl-xmlrpc-1.0.0 Extra dirs : VALGRIND : Not used ===================================================================== TIME START 2020-10-15 00:53:46 ===================================================================== TEST 1/35 [tests/001.phpt] PASS xmlrpc_encode_request() with wrong arguments [tests/001.phpt] TEST 2/35 [tests/002.phpt] PASS xmlrpc_encode_request() and various arguments [tests/002.phpt] TEST 3/35 [tests/003.phpt] PASS xmlrpc_encode() Simple test encode array [tests/003.phpt] TEST 4/35 [tests/004.phpt] PASS xmlrpc_encode() Simple test encode int [tests/004.phpt] TEST 5/35 [tests/005.phpt] ========DIFF======== <?xml version="1.0" encoding="utf-8"?> <params> <param> 005+ <double>3.242340</double> 006+ </value> 007+ </param> 008+ </params> 009+ <?xml version="1.0" encoding="utf-8"?> 010+ <params> 011+ <param> 012+ <value> 013+ <double>-3.242340</double> 005- <double>3.24234</double> </value> </param> </params> -- <params> <param> <value> 021+ <string>Is string</string> 013- <double>-3.24234</double> </value> </param> </params> 017- <?xml version="1.0" encoding="utf-8"?> 018- <params> 019- <param> 020- <value> 021- <string>Is string</string> 022- </value> 023- </param> 024- </params> ========DONE======== XFAIL xmlrpc_encode() Simple test encode type double and String [tests/005.phpt] XFAIL REASON: Skip TEST 6/35 [tests/006.phpt] PASS xmlrpc_decode() Simple test decode type string [tests/006.phpt] TEST 7/35 [tests/007.phpt] PASS xmlrpc_decode() Simple test decode type int [tests/007.phpt] TEST 8/35 [tests/bug18916.phpt] PASS Bug #18916 (xmlrpc_set_type() not working) [tests/bug18916.phpt] TEST 9/35 [tests/bug37057.phpt] PASS Bug #37057 (xmlrpc_decode() may produce arrays with numeric string keys which are unaccessible) [tests/bug37057.phpt] TEST 10/35 [tests/bug38431.phpt] PASS Bug #38431 (xmlrpc_get_type() crashes PHP on objects) [tests/bug38431.phpt] TEST 11/35 [tests/bug40576.phpt] SKIP Bug #40576 (double values are truncated to 6 decimal digits when encoding) [tests/bug40576.phpt] reason: this test is for 32bit platform only TEST 12/35 [tests/bug40576_64bit.phpt] ========DIFF======== 001+ string(122) "<?xml version="1.0" encoding="utf-8"?> 001- string(125) "<?xml version="1.0" encoding="utf-8"?> <params> <param> <value> 005+ <double>1.123457</double> 005- <double>1.123456789</double> </value> </param> </params> -- ========DONE======== XFAIL Bug #40576 (double values are truncated to 6 decimal digits when encoding) [tests/bug40576_64bit.phpt] XFAIL REASON: Skip TEST 13/35 [tests/bug42189.phpt] PASS Bug #42189 (xmlrpc_get_type() crashes PHP on invalid dates) [tests/bug42189.phpt] TEST 14/35 [tests/bug42736.phpt] PASS Bug #42736 (xmlrpc_server_call_method() crashes) [tests/bug42736.phpt] TEST 15/35 [tests/bug44996.phpt] PASS Bug #44996 (xmlrpc_decode() ignores time zone on iso8601.datetime) [tests/bug44996.phpt] TEST 16/35 [tests/bug45226.phpt] PASS Bug #45226 (xmlrpc_set_type() segfaults with valid ISO8601 date string) [tests/bug45226.phpt] TEST 17/35 [tests/bug45555.phpt] ========DIFF======== Warning: xmlrpc_server_call_method(): Invalid callback '1' passed in %s on line %d Warning: xmlrpc_server_call_method(): Invalid callback 'foo::bar' passed in %s on line %d 004+ xmlrpc: attempted to add key/val pair to vector of type array 005+ xmlrpc: attempted to add key/val pair to vector of type array 006+ xmlrpc: attempted to add key/val pair to vector of type array 007+ xmlrpc: attempted to add key/val pair to vector of type array 008+ xmlrpc: attempted to add key/val pair to vector of type array 009+ xmlrpc: attempted to add key/val pair to vector of type array ========DONE======== XFAIL Bug #45555 (Segfault with invalid non-string as register_introspection_callback) [tests/bug45555.phpt] XFAIL REASON: Skip TEST 18/35 [tests/bug45556.phpt] ========DIFF======== 002+ expat reports error code 2 003+ description: syntax error 004+ line: 1 005+ column: 0 006+ byte index: 0 007+ total bytes: 0 009+ data beginning 0 before byte index: foo 010+  011+ Warning: xmlrpc_server_call_method(): XML parse error: [line 0, column 1, message: syntax error] Unable to add introspection data returned from bar::test() in /tmp/B.MrVBeM/BUILD/php80-pecl-xmlrpc-1.0.0/tests/bug45556.php on line 21 003- Warning: xmlrpc_server_call_method(): XML parse error: [line 1, column 1, message: Invalid document end] Unable to add introspection data returned from bar::test() in %s on line %d Warning: xmlrpc_server_call_method(): Invalid callback 'foo::bar' passed in %s on line %d 014+ xmlrpc: attempted to add key/val pair to vector of type array 015+ xmlrpc: attempted to add key/val pair to vector of type array 016+ xmlrpc: attempted to add key/val pair to vector of type array 017+ xmlrpc: attempted to add key/val pair to vector of type array 018+ xmlrpc: attempted to add key/val pair to vector of type array 019+ xmlrpc: attempted to add key/val pair to vector of type array ========DONE======== XFAIL Bug #45556 (Return value from callback isn't freed) [tests/bug45556.phpt] XFAIL REASON: Skip TEST 19/35 [tests/bug47818.phpt] PASS Bug #47818 (Segfault due to bound callback param) [tests/bug47818.phpt] TEST 20/35 [tests/bug50282.phpt] PASS Bug #50282 (xmlrpc_encode_request() changes object into array in calling function) [tests/bug50282.phpt] TEST 21/35 [tests/bug50285.phpt] PASS Bug #50285 (xmlrpc does not preserve keys in encoded indexed arrays) [tests/bug50285.phpt] TEST 22/35 [tests/bug50761.phpt] PASS Bug #50761 (system.multiCall crashes) [tests/bug50761.phpt] TEST 23/35 [tests/bug51288.phpt] PASS Bug #51288 (CVE-2010-0397, NULL pointer deref when no <methodName> in request) [tests/bug51288.phpt] TEST 24/35 [tests/bug61097.phpt] PASS Bug #61097 (Memory leak in xmlrpc functions copying zvals) [tests/bug61097.phpt] TEST 25/35 [tests/bug61264.phpt] PASS Bug #61264: xmlrpc_parse_method_descriptions leaks temporary variable [tests/bug61264.phpt] TEST 26/35 [tests/bug68027.phpt] PASS Bug #68027 (buffer overflow in mkgmtime() function) [tests/bug68027.phpt] TEST 27/35 [tests/bug70526.phpt] PASS Bug #70526 (xmlrpc_set_type returns false on success) [tests/bug70526.phpt] TEST 28/35 [tests/bug70728.phpt] SKIP Bug #70728 (Type Confusion Vulnerability in PHP_to_XMLRPC_worker) [tests/bug70728.phpt] reason: this test is for 32bit platform only TEST 29/35 [tests/bug70728_64bit.phpt] PASS Bug #70728 (Type Confusion Vulnerability in PHP_to_XMLRPC_worker) [tests/bug70728_64bit.phpt] TEST 30/35 [tests/bug71501.phpt] PASS Bug #71501 (xmlrpc_encode_request ignores encoding option) [tests/bug71501.phpt] TEST 31/35 [tests/bug72155.phpt] PASS Bug #72155 (use-after-free caused by get_zval_xmlrpc_type) [tests/bug72155.phpt] TEST 32/35 [tests/bug72647.phpt] PASS Bug #72647 (xmlrpc_encode() unexpected output after referencing array elements) [tests/bug72647.phpt] TEST 33/35 [tests/bug74975.phpt] PASS Bug #74975 Different serialization for classes [tests/bug74975.phpt] TEST 34/35 [tests/bug77242.phpt] ========DIFF======== 001+ expat reports error code 4 001- NULL 002+ description: not well-formed (invalid token) 003+ line: 1 004+ column: 32 005+ byte index: 32 006+ total bytes: 0 007+  009+ NULL ========DONE======== XFAIL Bug #77242 (heap out of bounds read in xmlrpc_decode()) [tests/bug77242.phpt] XFAIL REASON: Skip TEST 35/35 [tests/bug77380.phpt] PASS Bug #77380 (Global out of bounds read in xmlrpc base64 code) [tests/bug77380.phpt] ===================================================================== TIME END 2020-10-15 00:53:47 ===================================================================== TEST RESULT SUMMARY --------------------------------------------------------------------- Exts skipped : 0 Exts tested : 10 --------------------------------------------------------------------- Number of tests : 35 33 Tests skipped : 2 ( 5.7%) -------- Tests warned : 0 ( 0.0%) ( 0.0%) Tests failed : 0 ( 0.0%) ( 0.0%) Expected fail : 5 ( 14.3%) ( 15.2%) Tests passed : 28 ( 80.0%) ( 84.8%) --------------------------------------------------------------------- Time taken : 1 seconds ===================================================================== ===================================================================== EXPECTED FAILED TEST SUMMARY --------------------------------------------------------------------- xmlrpc_encode() Simple test encode type double and String [tests/005.phpt] XFAIL REASON: Skip Bug #40576 (double values are truncated to 6 decimal digits when encoding) [tests/bug40576_64bit.phpt] XFAIL REASON: Skip Bug #45555 (Segfault with invalid non-string as register_introspection_callback) [tests/bug45555.phpt] XFAIL REASON: Skip Bug #45556 (Return value from callback isn't freed) [tests/bug45556.phpt] XFAIL REASON: Skip Bug #77242 (heap out of bounds read in xmlrpc_decode()) [tests/bug77242.phpt] XFAIL REASON: Skip ===================================================================== + exit 0 Executing(%install): /bin/sh -e /tmp/B.MrVBeM/BUILD/tmp/rpm-tmp.59848 TMP=/home/users/builder/tmp HOME=/home/users/builder PATH=/home/users/builder/GNUstep/Tools:/bin:/usr/bin:/usr/local/bin:/home/users/builder/bin TMPDIR=/tmp/B.MrVBeM/BUILD/tmp + umask 022 + cd /tmp/B.MrVBeM/BUILD + /bin/rm '--interactive=never' -rf /tmp/B.MrVBeM/BUILD/tmp/php80-pecl-xmlrpc-1.0.0-root-builder + /bin/mkdir -p /tmp/B.MrVBeM/BUILD/tmp/php80-pecl-xmlrpc-1.0.0-root-builder + cd php80-pecl-xmlrpc-1.0.0 + rm -rf /tmp/B.MrVBeM/BUILD/tmp/php80-pecl-xmlrpc-1.0.0-root-builder + /usr/bin/make -Otarget -j9 install 'EXTENSION_DIR=/usr/lib64/php80' 'INSTALL_ROOT=/tmp/B.MrVBeM/BUILD/tmp/php80-pecl-xmlrpc-1.0.0-root-builder' Makefile:231: warning: overriding recipe for target 'xmlrpc-epi-php.lo' Makefile:228: warning: ignoring old recipe for target 'xmlrpc-epi-php.lo' Installing shared extensions: /tmp/B.MrVBeM/BUILD/tmp/php80-pecl-xmlrpc-1.0.0-root-builder/usr/lib64/php80/ + install -d /tmp/B.MrVBeM/BUILD/tmp/php80-pecl-xmlrpc-1.0.0-root-builder/etc/php80/conf.d + <<"EOF" + >/tmp/B.MrVBeM/BUILD/tmp/php80-pecl-xmlrpc-1.0.0-root-builder/etc/php80/conf.d/xmlrpc.ini + cat + /usr/lib/rpm/find-debuginfo.sh /tmp/B.MrVBeM/BUILD/php80-pecl-xmlrpc-1.0.0 RPM_BUILD_DIR=/tmp/B.MrVBeM/BUILD extracting debug info from /tmp/B.MrVBeM/BUILD/tmp/php80-pecl-xmlrpc-1.0.0-root-builder/usr/lib64/php80/xmlrpc.so cpio: /tmp/B.fDKtQa/BUILD/glibc-2.32/csu: Cannot stat: No such file or directory 98 blocks + __spec_install_post_strip + set +x Stripping 1 ELF shared libraries...DONE + __spec_install_post_chrpath + set +x Remove RPATH/RUNPATH from 1 executable binaries and shared object files. + __spec_install_post_compress_modules + set +x + __spec_install_post_check_so + set +x Searching for shared objects with unresolved symbols... DONE + __spec_install_post_check_tmpfiles + set +x Checking /var/run <-> tmpfiles.d completeness... DONE + __spec_install_post_check_shebangs + set +x Checking script shebangs... DONE + __spec_install_post_compress_docs + set +x + __spec_install_post_py_hardlink + set +x Processing files: php80-pecl-xmlrpc-1.0.0-0.1.1ed83f2.x86_64 Executing(%doc): /bin/sh -e /tmp/B.MrVBeM/BUILD/tmp/rpm-tmp.48784 + umask 022 + cd /tmp/B.MrVBeM/BUILD + cd php80-pecl-xmlrpc-1.0.0 + DOCDIR=/tmp/B.MrVBeM/BUILD/tmp/php80-pecl-xmlrpc-1.0.0-root-builder/usr/share/doc/php80-pecl-xmlrpc-1.0.0 + export DOCDIR + test -d /tmp/B.MrVBeM/BUILD/tmp/php80-pecl-xmlrpc-1.0.0-root-builder/usr/share/doc/php80-pecl-xmlrpc-1.0.0 + /bin/mkdir -p /tmp/B.MrVBeM/BUILD/tmp/php80-pecl-xmlrpc-1.0.0-root-builder/usr/share/doc/php80-pecl-xmlrpc-1.0.0 + cp -pr CREDITS LICENSE /tmp/B.MrVBeM/BUILD/tmp/php80-pecl-xmlrpc-1.0.0-root-builder/usr/share/doc/php80-pecl-xmlrpc-1.0.0 + /usr/lib/rpm/compress-doc Compressing documentation in /tmp/B.MrVBeM/BUILD/tmp/php80-pecl-xmlrpc-1.0.0-root-builder/usr/share/doc/php80-pecl-xmlrpc-1.0.0... ./CREDITS ./LICENSE Documentation compressed. + exit 0 skipping /usr/share/doc/php80-pecl-xmlrpc-1.0.0 requires detection Removing dependency on self: R config(php80-pecl-xmlrpc) = 0:1.0.0-0.1.1ed83f2 Provides: config(php80-pecl-xmlrpc) = 0:1.0.0-0.1.1ed83f2 elf(buildid) = 27f721f347eec433efb80e2dad70cc9b1800763b php(xmlrpc) = 1.0.0 xmlrpc.so()(64bit) Requires(interp): /bin/sh /bin/sh Requires(post): /bin/sh Requires(postun): /bin/sh Requires: libc.so.6()(64bit) libc.so.6(GLIBC_2.14)(64bit) libc.so.6(GLIBC_2.2.5)(64bit) libc.so.6(GLIBC_2.4)(64bit) libpthread.so.0()(64bit) libxmlrpc-epi.so.0()(64bit) rtld(GNU_HASH) Processing files: php80-pecl-xmlrpc-debuginfo-1.0.0-0.1.1ed83f2.x86_64 Checking for unpackaged file(s): /usr/lib/rpm/check-files /tmp/B.MrVBeM/BUILD/tmp/php80-pecl-xmlrpc-1.0.0-root-builder warning: Could not canonicalize hostname: ymir-builder Wrote: /tmp/B.MrVBeM/RPMS/php80-pecl-xmlrpc-1.0.0-0.1.1ed83f2.x86_64.rpm Wrote: /tmp/B.MrVBeM/RPMS/php80-pecl-xmlrpc-debuginfo-1.0.0-0.1.1ed83f2.x86_64.rpm Executing(%clean): /bin/sh -e /tmp/B.MrVBeM/BUILD/tmp/rpm-tmp.48784 + umask 022 + cd /tmp/B.MrVBeM/BUILD + cd php80-pecl-xmlrpc-1.0.0 + /bin/rm '--interactive=never' -rf /tmp/B.MrVBeM/BUILD/tmp/php80-pecl-xmlrpc-1.0.0-root-builder + rm -rf /tmp/B.MrVBeM/BUILD/tmp/php80-pecl-xmlrpc-1.0.0-root-builder ended at: Thu Oct 15 00:53:48 2020, done in 0:00:06.257661 + chmod -R u+rwX /tmp/B.MrVBeM/BUILD + rm -rf /tmp/B.MrVBeM/tmp /tmp/B.MrVBeM/BUILD test-build: not copying to /spools/ready Begin-PLD-Builder-Info not upgrading End-PLD-Builder-Info + rm -rf /tmp/B.MrVBeM Begin-PLD-Builder-Info Build-Time: user:13.21s sys:2.74s real:29.46s (faults io:1 non-io:1039382) Files queued for ftp: 59024 php80-pecl-xmlrpc-debuginfo-1.0.0-0.1.1ed83f2.x86_64.rpm 23469 php80-pecl-xmlrpc-1.0.0-0.1.1ed83f2.x86_64.rpm End-PLD-Builder-Info
[Back to list of logs] [View rpm -qa of builder]