FailedOk

th/SRPMS[OK]
th/x32[OK]
th/i686[OK]
th/x86_64[OK]

ac/SRPMS[OK]
ac/i386[OK]
ac/i586[OK]
ac/i686[OK]
ac/alpha[OK]
ac/amd64[OK]
ac/athlon[OK]
ac/ppc[OK]
ac/sparc[OK]
ac/sparc64[OK]

Advanced Search
main()
Powered by PLD Linux
(c) 2002-2024 PLD Team
$Revision: 1.37 $
Powered by php.
Your IP: 35.172.230.21

coreutils 609207f5-5e50-4ece-8ac7-2b5aafef8c0a

Status:Failed
Source URL:https://buildlogs.pld-linux.org/pld/ac/i386/FAIL/coreutils,609207f5-5e50-4ece-8ac7-2b5aafef8c0a.bz2
text/plain URL:View!
full text:View!
rpm -qa of builder:View!
Date:2015/04/21 12:08:39
Runtime:2

Toc:

  • error 1
  • ./misc/su-fail: skipping test: required program(s) not built
  • error 2
  • FAIL: tail-2/wait
  • error 3
  • ./mv/part-fail: skipping test: requires a writable directory on a different disk partition,
  • error 4
  • ./misc/su-fail: skipping test: required program(s) not built
  • error 5
  • FAIL: tail-2/wait (exit: 1)
  • error 6
  • ./mv/part-fail: skipping test: requires a writable directory on a different disk partition,
  • error 7
  • make[4]: *** [test-suite.log] Error 1
  • error 8
  • make[3]: *** [check-TESTS] Error 2
  • error 9
  • make[2]: *** [check-am] Error 2
  • error 10
  • make[1]: *** [check-recursive] Error 1
  • error 11
  • error: Bad exit status from /tmp/B.78d3c96c-d3d1-4de0-914f-8c6c57edcc36/BUILD/tmp/rpm-tmp.44228 (%build)
  • error 12
  • RPM build errors:
  • error 13
  • error: No files produced.

Content:

using SHELL=/bin/bash with 'set -x' corrupts stderr
PASS: misc/printf-surprise
using SHELL=/bin/bash with 'set -x' corrupts stderr
PASS: misc/pwd-long
using SHELL=/bin/bash with 'set -x' corrupts stderr
PASS: misc/readlink-fp-loop
using SHELL=/bin/bash with 'set -x' corrupts stderr
PASS: misc/runcon-no-reorder
PASS: misc/sha1sum
PASS: misc/sha1sum-vec
PASS: misc/sha224sum
PASS: misc/sha256sum
PASS: misc/sha384sum
PASS: misc/sha512sum
using SHELL=/bin/bash with 'set -x' corrupts stderr
PASS: misc/shred-exact
using SHELL=/bin/bash with 'set -x' corrupts stderr
PASS: misc/shred-passes
using SHELL=/bin/bash with 'set -x' corrupts stderr
PASS: misc/shred-remove
using SHELL=/bin/bash with 'set -x' corrupts stderr
PASS: misc/shuf
PASS: misc/sort
using SHELL=/bin/bash with 'set -x' corrupts stderr
./misc/sort-benchmark-random: skipping test: very expensive: disabled by default
SKIP: misc/sort-benchmark-random
using SHELL=/bin/bash with 'set -x' corrupts stderr
PASS: misc/sort-compress
using SHELL=/bin/bash with 'set -x' corrupts stderr
./misc/sort-compress-hang: skipping test: very expensive: disabled by default
SKIP: misc/sort-compress-hang
using SHELL=/bin/bash with 'set -x' corrupts stderr
./misc/sort-compress-proc: skipping test: expensive: disabled by default
SKIP: misc/sort-compress-proc
using SHELL=/bin/bash with 'set -x' corrupts stderr
PASS: misc/sort-continue
using SHELL=/bin/bash with 'set -x' corrupts stderr
PASS: misc/sort-debug-keys
using SHELL=/bin/bash with 'set -x' corrupts stderr
PASS: misc/sort-debug-warn
PASS: misc/sort-files0-from
using SHELL=/bin/bash with 'set -x' corrupts stderr
PASS: misc/sort-float
PASS: misc/sort-merge
using SHELL=/bin/bash with 'set -x' corrupts stderr
PASS: misc/sort-merge-fdlimit
using SHELL=/bin/bash with 'set -x' corrupts stderr
PASS: misc/sort-month
using SHELL=/bin/bash with 'set -x' corrupts stderr
PASS: misc/sort-rand
using SHELL=/bin/bash with 'set -x' corrupts stderr
PASS: misc/sort-spinlock-abuse
using SHELL=/bin/bash with 'set -x' corrupts stderr
./misc/sort-stale-thread-mem: skipping test: very expensive: disabled by default
SKIP: misc/sort-stale-thread-mem
using SHELL=/bin/bash with 'set -x' corrupts stderr
PASS: misc/sort-unique
using SHELL=/bin/bash with 'set -x' corrupts stderr
PASS: misc/sort-unique-segv
using SHELL=/bin/bash with 'set -x' corrupts stderr
PASS: misc/sort-version
using SHELL=/bin/bash with 'set -x' corrupts stderr
PASS: misc/split-a
using SHELL=/bin/bash with 'set -x' corrupts stderr
PASS: misc/split-bchunk
using SHELL=/bin/bash with 'set -x' corrupts stderr
PASS: misc/split-fail
using SHELL=/bin/bash with 'set -x' corrupts stderr
PASS: misc/split-l
using SHELL=/bin/bash with 'set -x' corrupts stderr
PASS: misc/split-lchunk
using SHELL=/bin/bash with 'set -x' corrupts stderr
PASS: misc/split-rchunk
using SHELL=/bin/bash with 'set -x' corrupts stderr
PASS: misc/stat-birthtime
using SHELL=/bin/bash with 'set -x' corrupts stderr
PASS: misc/stat-fmt
using SHELL=/bin/bash with 'set -x' corrupts stderr
PASS: misc/stat-hyphen
using SHELL=/bin/bash with 'set -x' corrupts stderr
PASS: misc/stat-mount
using SHELL=/bin/bash with 'set -x' corrupts stderr
stat-nanoseconds: skipped test: this file system does not support sub-second time stamps
SKIP: misc/stat-nanoseconds
PASS: misc/stat-printf
using SHELL=/bin/bash with 'set -x' corrupts stderr
PASS: misc/stat-slash
using SHELL=/bin/bash with 'set -x' corrupts stderr
PASS: misc/stdbuf
using SHELL=/bin/bash with 'set -x' corrupts stderr
./misc/stty: skipping test: requires controlling input terminal
SKIP: misc/stty
using SHELL=/bin/bash with 'set -x' corrupts stderr
./misc/stty-invalid: skipping test: requires controlling input terminal
SKIP: misc/stty-invalid
using SHELL=/bin/bash with 'set -x' corrupts stderr
./misc/stty-row-col: skipping test: requires controlling input terminal
SKIP: misc/stty-row-col
using SHELL=/bin/bash with 'set -x' corrupts stderr
./misc/su-fail: skipping test: required program(s) not built
SKIP: misc/su-fail
PASS: misc/sum
using SHELL=/bin/bash with 'set -x' corrupts stderr
PASS: misc/sum-sysv
PASS: misc/tac
using SHELL=/bin/bash with 'set -x' corrupts stderr
./misc/tac-continue: skipping test: FULL_PARTITION_TMPDIR not defined
SKIP: misc/tac-continue
PASS: misc/tail
using SHELL=/bin/bash with 'set -x' corrupts stderr
PASS: misc/tee
using SHELL=/bin/bash with 'set -x' corrupts stderr
PASS: misc/tee-dash
PASS: misc/test-diag
using SHELL=/bin/bash with 'set -x' corrupts stderr
PASS: misc/timeout
using SHELL=/bin/bash with 'set -x' corrupts stderr
PASS: misc/timeout-parameters
PASS: misc/tr
using SHELL=/bin/bash with 'set -x' corrupts stderr
PASS: misc/tr-case-class
using SHELL=/bin/bash with 'set -x' corrupts stderr
PASS: misc/truncate-dangling-symlink
using SHELL=/bin/bash with 'set -x' corrupts stderr
PASS: misc/truncate-dir-fail
using SHELL=/bin/bash with 'set -x' corrupts stderr
PASS: misc/truncate-fail-diag
using SHELL=/bin/bash with 'set -x' corrupts stderr
PASS: misc/truncate-fifo
using SHELL=/bin/bash with 'set -x' corrupts stderr
PASS: misc/truncate-no-create-missing
using SHELL=/bin/bash with 'set -x' corrupts stderr
PASS: misc/truncate-overflow
using SHELL=/bin/bash with 'set -x' corrupts stderr
PASS: misc/truncate-parameters
using SHELL=/bin/bash with 'set -x' corrupts stderr
PASS: misc/truncate-relative
PASS: misc/tsort
SKIP: misc/tty-eof
PASS: misc/unexpand
PASS: misc/uniq
using SHELL=/bin/bash with 'set -x' corrupts stderr
PASS: misc/uniq-perf
using SHELL=/bin/bash with 'set -x' corrupts stderr
./misc/xattr: skipping test: requires a writable directory on a different disk partition,
SKIP: misc/xattr
using SHELL=/bin/bash with 'set -x' corrupts stderr
FAIL: tail-2/wait
using SHELL=/bin/bash with 'set -x' corrupts stderr
PASS: chmod/c-option
using SHELL=/bin/bash with 'set -x' corrupts stderr
PASS: chmod/equal-x
using SHELL=/bin/bash with 'set -x' corrupts stderr
PASS: chmod/equals
using SHELL=/bin/bash with 'set -x' corrupts stderr
PASS: chmod/inaccessible
using SHELL=/bin/bash with 'set -x' corrupts stderr
PASS: chmod/octal
using SHELL=/bin/bash with 'set -x' corrupts stderr
PASS: chmod/setgid
using SHELL=/bin/bash with 'set -x' corrupts stderr
PASS: chmod/silent
using SHELL=/bin/bash with 'set -x' corrupts stderr
PASS: chmod/thru-dangling
using SHELL=/bin/bash with 'set -x' corrupts stderr
PASS: chmod/umask-x
using SHELL=/bin/bash with 'set -x' corrupts stderr
PASS: chmod/usage
using SHELL=/bin/bash with 'set -x' corrupts stderr
PASS: chown/deref
using SHELL=/bin/bash with 'set -x' corrupts stderr
PASS: chown/preserve-root
using SHELL=/bin/bash with 'set -x' corrupts stderr
PASS: chown/separator
using SHELL=/bin/bash with 'set -x' corrupts stderr
PASS: cp/abuse
using SHELL=/bin/bash with 'set -x' corrupts stderr
PASS: cp/acl
using SHELL=/bin/bash with 'set -x' corrupts stderr
PASS: cp/backup-1
using SHELL=/bin/bash with 'set -x' corrupts stderr
PASS: cp/backup-dir
using SHELL=/bin/bash with 'set -x' corrupts stderr
PASS: cp/backup-is-src
using SHELL=/bin/bash with 'set -x' corrupts stderr
PASS: cp/cp-HL
using SHELL=/bin/bash with 'set -x' corrupts stderr
PASS: cp/cp-deref
using SHELL=/bin/bash with 'set -x' corrupts stderr
PASS: cp/cp-i
using SHELL=/bin/bash with 'set -x' corrupts stderr
PASS: cp/cp-mv-backup
using SHELL=/bin/bash with 'set -x' corrupts stderr
PASS: cp/cp-parents
using SHELL=/bin/bash with 'set -x' corrupts stderr
PASS: cp/deref-slink
using SHELL=/bin/bash with 'set -x' corrupts stderr
PASS: cp/dir-rm-dest
using SHELL=/bin/bash with 'set -x' corrupts stderr
PASS: cp/dir-slash
using SHELL=/bin/bash with 'set -x' corrupts stderr
PASS: cp/dir-vs-file
using SHELL=/bin/bash with 'set -x' corrupts stderr
./cp/existing-perm-race: skipping test: requires membership in two groups
SKIP: cp/existing-perm-race
using SHELL=/bin/bash with 'set -x' corrupts stderr
PASS: cp/fail-perm
using SHELL=/bin/bash with 'set -x' corrupts stderr
fiemap-perf: skipped test: this file system lacks FIEMAP support
SKIP: cp/fiemap-perf
using SHELL=/bin/bash with 'set -x' corrupts stderr
fiemap-2: skipped test: this file system lacks FIEMAP support
SKIP: cp/fiemap-2
using SHELL=/bin/bash with 'set -x' corrupts stderr
PASS: cp/file-perm-race
using SHELL=/bin/bash with 'set -x' corrupts stderr
PASS: cp/into-self
using SHELL=/bin/bash with 'set -x' corrupts stderr
PASS: cp/link
using SHELL=/bin/bash with 'set -x' corrupts stderr
PASS: cp/link-no-deref
using SHELL=/bin/bash with 'set -x' corrupts stderr
PASS: cp/link-preserve
using SHELL=/bin/bash with 'set -x' corrupts stderr
PASS: cp/no-deref-link1
using SHELL=/bin/bash with 'set -x' corrupts stderr
PASS: cp/no-deref-link2
using SHELL=/bin/bash with 'set -x' corrupts stderr
PASS: cp/no-deref-link3
using SHELL=/bin/bash with 'set -x' corrupts stderr
PASS: cp/parent-perm
using SHELL=/bin/bash with 'set -x' corrupts stderr
PASS: cp/parent-perm-race
using SHELL=/bin/bash with 'set -x' corrupts stderr
./cp/perm: skipping test: very expensive: disabled by default
SKIP: cp/perm
using SHELL=/bin/bash with 'set -x' corrupts stderr
PASS: cp/preserve-2
using SHELL=/bin/bash with 'set -x' corrupts stderr
./cp/preserve-slink-time: skipping test: this system lacks the utimensat function
SKIP: cp/preserve-slink-time
using SHELL=/bin/bash with 'set -x' corrupts stderr
./cp/proc-short-read: skipping test: your system lacks /proc/kallsyms
SKIP: cp/proc-short-read
using SHELL=/bin/bash with 'set -x' corrupts stderr
PASS: cp/proc-zero-len
using SHELL=/bin/bash with 'set -x' corrupts stderr
PASS: cp/r-vs-symlink
using SHELL=/bin/bash with 'set -x' corrupts stderr
./cp/reflink-auto: skipping test: requires a writable directory on a different disk partition,
SKIP: cp/reflink-auto
using SHELL=/bin/bash with 'set -x' corrupts stderr
PASS: cp/reflink-perm
using SHELL=/bin/bash with 'set -x' corrupts stderr
PASS: cp/same-file
using SHELL=/bin/bash with 'set -x' corrupts stderr
PASS: cp/slink-2-slink
using SHELL=/bin/bash with 'set -x' corrupts stderr
PASS: cp/sparse
using SHELL=/bin/bash with 'set -x' corrupts stderr
PASS: cp/sparse-to-pipe
using SHELL=/bin/bash with 'set -x' corrupts stderr
PASS: cp/special-f
using SHELL=/bin/bash with 'set -x' corrupts stderr
PASS: cp/src-base-dot
using SHELL=/bin/bash with 'set -x' corrupts stderr
PASS: cp/symlink-slash
using SHELL=/bin/bash with 'set -x' corrupts stderr
PASS: cp/thru-dangling
using SHELL=/bin/bash with 'set -x' corrupts stderr
PASS: df/unreadable
using SHELL=/bin/bash with 'set -x' corrupts stderr
PASS: dd/direct
using SHELL=/bin/bash with 'set -x' corrupts stderr
PASS: dd/misc
using SHELL=/bin/bash with 'set -x' corrupts stderr
PASS: dd/not-rewound
using SHELL=/bin/bash with 'set -x' corrupts stderr
PASS: dd/reblock
PASS: dd/skip-seek
using SHELL=/bin/bash with 'set -x' corrupts stderr
PASS: dd/skip-seek2
using SHELL=/bin/bash with 'set -x' corrupts stderr
PASS: dd/skip-seek-past-file
using SHELL=/bin/bash with 'set -x' corrupts stderr
PASS: dd/stderr
PASS: dd/unblock
using SHELL=/bin/bash with 'set -x' corrupts stderr
PASS: dd/unblock-sync
using SHELL=/bin/bash with 'set -x' corrupts stderr
PASS: df/total-verify
using SHELL=/bin/bash with 'set -x' corrupts stderr
./du/2g: skipping test: very expensive: disabled by default
SKIP: du/2g
using SHELL=/bin/bash with 'set -x' corrupts stderr
PASS: du/8gb
using SHELL=/bin/bash with 'set -x' corrupts stderr
PASS: du/basic
using SHELL=/bin/bash with 'set -x' corrupts stderr
bigtime: skipped test: file system cannot represent big time stamps
SKIP: du/bigtime
using SHELL=/bin/bash with 'set -x' corrupts stderr
PASS: du/deref
using SHELL=/bin/bash with 'set -x' corrupts stderr
PASS: du/deref-args
using SHELL=/bin/bash with 'set -x' corrupts stderr
PASS: du/exclude
using SHELL=/bin/bash with 'set -x' corrupts stderr
./du/fd-leak: skipping test: expensive: disabled by default
SKIP: du/fd-leak
PASS: du/files0-from
using SHELL=/bin/bash with 'set -x' corrupts stderr
PASS: du/hard-link
using SHELL=/bin/bash with 'set -x' corrupts stderr
PASS: du/inacc-dest
using SHELL=/bin/bash with 'set -x' corrupts stderr
PASS: du/inacc-dir
using SHELL=/bin/bash with 'set -x' corrupts stderr
PASS: du/inaccessible-cwd
using SHELL=/bin/bash with 'set -x' corrupts stderr
PASS: du/long-from-unreadable
using SHELL=/bin/bash with 'set -x' corrupts stderr
PASS: du/long-sloop
using SHELL=/bin/bash with 'set -x' corrupts stderr
PASS: du/max-depth
using SHELL=/bin/bash with 'set -x' corrupts stderr
move-dir-while-traversing: skipped test: python inotify package not installed
SKIP: du/move-dir-while-traversing
using SHELL=/bin/bash with 'set -x' corrupts stderr
PASS: du/no-deref
using SHELL=/bin/bash with 'set -x' corrupts stderr
PASS: du/no-x
using SHELL=/bin/bash with 'set -x' corrupts stderr
PASS: du/one-file-system
using SHELL=/bin/bash with 'set -x' corrupts stderr
PASS: du/restore-wd
using SHELL=/bin/bash with 'set -x' corrupts stderr
PASS: du/slash
using SHELL=/bin/bash with 'set -x' corrupts stderr
PASS: du/slink
using SHELL=/bin/bash with 'set -x' corrupts stderr
PASS: du/trailing-slash
using SHELL=/bin/bash with 'set -x' corrupts stderr
PASS: du/two-args
using SHELL=/bin/bash with 'set -x' corrupts stderr
./id/no-context: skipping test: this system (or maybe just the current file system) lacks SELinux support
SKIP: id/no-context
using SHELL=/bin/bash with 'set -x' corrupts stderr
PASS: install/basic-1
using SHELL=/bin/bash with 'set -x' corrupts stderr
PASS: install/create-leading
using SHELL=/bin/bash with 'set -x' corrupts stderr
PASS: install/d-slashdot
using SHELL=/bin/bash with 'set -x' corrupts stderr
PASS: install/install-C
using SHELL=/bin/bash with 'set -x' corrupts stderr
./install/install-C-selinux: skipping test: this system (or maybe just the current file system) lacks SELinux support
SKIP: install/install-C-selinux
using SHELL=/bin/bash with 'set -x' corrupts stderr
PASS: install/strip-program
using SHELL=/bin/bash with 'set -x' corrupts stderr
PASS: install/trap
using SHELL=/bin/bash with 'set -x' corrupts stderr
PASS: ln/backup-1
using SHELL=/bin/bash with 'set -x' corrupts stderr
PASS: ln/hard-backup
using SHELL=/bin/bash with 'set -x' corrupts stderr
PASS: ln/hard-to-sym
using SHELL=/bin/bash with 'set -x' corrupts stderr
PASS: ln/misc
using SHELL=/bin/bash with 'set -x' corrupts stderr
PASS: ln/sf-1
using SHELL=/bin/bash with 'set -x' corrupts stderr
PASS: ln/slash-decorated-nonexistent-dest
using SHELL=/bin/bash with 'set -x' corrupts stderr
PASS: ln/target-1
using SHELL=/bin/bash with 'set -x' corrupts stderr
PASS: ls/abmon-align
using SHELL=/bin/bash with 'set -x' corrupts stderr
PASS: ls/color-clear-to-eol
using SHELL=/bin/bash with 'set -x' corrupts stderr
PASS: ls/color-dtype-dir
using SHELL=/bin/bash with 'set -x' corrupts stderr
PASS: ls/color-norm
using SHELL=/bin/bash with 'set -x' corrupts stderr
PASS: ls/dangle
using SHELL=/bin/bash with 'set -x' corrupts stderr
PASS: ls/dired
using SHELL=/bin/bash with 'set -x' corrupts stderr
PASS: ls/file-type
using SHELL=/bin/bash with 'set -x' corrupts stderr
PASS: ls/follow-slink
using SHELL=/bin/bash with 'set -x' corrupts stderr
PASS: ls/infloop
using SHELL=/bin/bash with 'set -x' corrupts stderr
PASS: ls/inode
using SHELL=/bin/bash with 'set -x' corrupts stderr
PASS: ls/m-option
using SHELL=/bin/bash with 'set -x' corrupts stderr
PASS: ls/multihardlink
using SHELL=/bin/bash with 'set -x' corrupts stderr
PASS: ls/no-arg
using SHELL=/bin/bash with 'set -x' corrupts stderr
./ls/no-cap: skipping test: no strace program
SKIP: ls/no-cap
using SHELL=/bin/bash with 'set -x' corrupts stderr
PASS: ls/proc-selinux-segfault
using SHELL=/bin/bash with 'set -x' corrupts stderr
PASS: ls/readdir-mountpoint-inode
using SHELL=/bin/bash with 'set -x' corrupts stderr
PASS: ls/recursive
using SHELL=/bin/bash with 'set -x' corrupts stderr
PASS: ls/rt-1
using SHELL=/bin/bash with 'set -x' corrupts stderr
./ls/stat-dtype: skipping test: '.' is not on a suitable file system for this test
SKIP: ls/stat-dtype
using SHELL=/bin/bash with 'set -x' corrupts stderr
PASS: ls/stat-failed
using SHELL=/bin/bash with 'set -x' corrupts stderr
./ls/stat-free-symlinks: skipping test: no strace program
SKIP: ls/stat-free-symlinks
using SHELL=/bin/bash with 'set -x' corrupts stderr
PASS: ls/stat-vs-dirent
using SHELL=/bin/bash with 'set -x' corrupts stderr
PASS: ls/symlink-slash
using SHELL=/bin/bash with 'set -x' corrupts stderr
PASS: ls/x-option
using SHELL=/bin/bash with 'set -x' corrupts stderr
PASS: mkdir/p-1
using SHELL=/bin/bash with 'set -x' corrupts stderr
PASS: mkdir/p-2
using SHELL=/bin/bash with 'set -x' corrupts stderr
PASS: mkdir/p-3
using SHELL=/bin/bash with 'set -x' corrupts stderr
PASS: mkdir/p-slashdot
using SHELL=/bin/bash with 'set -x' corrupts stderr
PASS: mkdir/p-thru-slink
using SHELL=/bin/bash with 'set -x' corrupts stderr
PASS: mkdir/p-v
using SHELL=/bin/bash with 'set -x' corrupts stderr
PASS: mkdir/parents
using SHELL=/bin/bash with 'set -x' corrupts stderr
PASS: mkdir/perm
using SHELL=/bin/bash with 'set -x' corrupts stderr
./mkdir/selinux: skipping test: This test is useful only with SELinux in Enforcing mode.
SKIP: mkdir/selinux
using SHELL=/bin/bash with 'set -x' corrupts stderr
PASS: mkdir/special-1
using SHELL=/bin/bash with 'set -x' corrupts stderr
PASS: mkdir/t-slash
using SHELL=/bin/bash with 'set -x' corrupts stderr
./mv/acl: skipping test: requires a writable directory on a different disk partition,
SKIP: mv/acl
using SHELL=/bin/bash with 'set -x' corrupts stderr
./mv/atomic: skipping test: no strace program
SKIP: mv/atomic
using SHELL=/bin/bash with 'set -x' corrupts stderr
./mv/atomic2: skipping test: no strace program
SKIP: mv/atomic2
using SHELL=/bin/bash with 'set -x' corrupts stderr
PASS: mv/backup-dir
using SHELL=/bin/bash with 'set -x' corrupts stderr
./mv/backup-is-src: skipping test: requires a writable directory on a different disk partition,
SKIP: mv/backup-is-src
using SHELL=/bin/bash with 'set -x' corrupts stderr
PASS: mv/childproof
using SHELL=/bin/bash with 'set -x' corrupts stderr
PASS: mv/diag
using SHELL=/bin/bash with 'set -x' corrupts stderr
PASS: mv/dir-file
using SHELL=/bin/bash with 'set -x' corrupts stderr
PASS: mv/dir2dir
using SHELL=/bin/bash with 'set -x' corrupts stderr
PASS: mv/dup-source
using SHELL=/bin/bash with 'set -x' corrupts stderr
PASS: mv/force
using SHELL=/bin/bash with 'set -x' corrupts stderr
PASS: mv/hard-2
using SHELL=/bin/bash with 'set -x' corrupts stderr
PASS: mv/hard-3
using SHELL=/bin/bash with 'set -x' corrupts stderr
PASS: mv/hard-4
using SHELL=/bin/bash with 'set -x' corrupts stderr
./mv/hard-link-1: skipping test: requires a writable directory on a different disk partition,
SKIP: mv/hard-link-1
using SHELL=/bin/bash with 'set -x' corrupts stderr
PASS: mv/hard-verbose
PASS: mv/i-1
using SHELL=/bin/bash with 'set -x' corrupts stderr
PASS: mv/i-2
using SHELL=/bin/bash with 'set -x' corrupts stderr
./mv/i-3: skipping test: requires controlling input terminal
SKIP: mv/i-3
using SHELL=/bin/bash with 'set -x' corrupts stderr
PASS: mv/i-4
using SHELL=/bin/bash with 'set -x' corrupts stderr
PASS: mv/i-5
using SHELL=/bin/bash with 'set -x' corrupts stderr
PASS: mv/i-link-no
using SHELL=/bin/bash with 'set -x' corrupts stderr
PASS: mv/into-self
using SHELL=/bin/bash with 'set -x' corrupts stderr
./mv/into-self-2: skipping test: requires a writable directory on a different disk partition,
SKIP: mv/into-self-2
using SHELL=/bin/bash with 'set -x' corrupts stderr
PASS: mv/into-self-3
using SHELL=/bin/bash with 'set -x' corrupts stderr
PASS: mv/into-self-4
using SHELL=/bin/bash with 'set -x' corrupts stderr
./mv/leak-fd: skipping test: requires a writable directory on a different disk partition,
SKIP: mv/leak-fd
using SHELL=/bin/bash with 'set -x' corrupts stderr
PASS: mv/mv-n
using SHELL=/bin/bash with 'set -x' corrupts stderr
./mv/mv-special-1: skipping test: requires a writable directory on a different disk partition,
SKIP: mv/mv-special-1
using SHELL=/bin/bash with 'set -x' corrupts stderr
PASS: mv/no-target-dir
using SHELL=/bin/bash with 'set -x' corrupts stderr
./mv/part-fail: skipping test: requires a writable directory on a different disk partition,
SKIP: mv/part-fail
using SHELL=/bin/bash with 'set -x' corrupts stderr
./mv/part-hardlink: skipping test: requires a writable directory on a different disk partition,
SKIP: mv/part-hardlink
using SHELL=/bin/bash with 'set -x' corrupts stderr
./mv/part-rename: skipping test: requires a writable directory on a different disk partition,
SKIP: mv/part-rename
using SHELL=/bin/bash with 'set -x' corrupts stderr
./mv/part-symlink: skipping test: requires a writable directory on a different disk partition,
SKIP: mv/part-symlink
using SHELL=/bin/bash with 'set -x' corrupts stderr
./mv/partition-perm: skipping test: requires a writable directory on a different disk partition,
SKIP: mv/partition-perm
using SHELL=/bin/bash with 'set -x' corrupts stderr
PASS: mv/perm-1
using SHELL=/bin/bash with 'set -x' corrupts stderr
./mv/to-symlink: skipping test: requires a writable directory on a different disk partition,
SKIP: mv/to-symlink
using SHELL=/bin/bash with 'set -x' corrupts stderr
PASS: mv/trailing-slash
using SHELL=/bin/bash with 'set -x' corrupts stderr
PASS: mv/update
using SHELL=/bin/bash with 'set -x' corrupts stderr
PASS: readlink/can-e
using SHELL=/bin/bash with 'set -x' corrupts stderr
PASS: readlink/can-f
using SHELL=/bin/bash with 'set -x' corrupts stderr
PASS: readlink/can-m
using SHELL=/bin/bash with 'set -x' corrupts stderr
PASS: readlink/rl-1
using SHELL=/bin/bash with 'set -x' corrupts stderr
PASS: rmdir/fail-perm
using SHELL=/bin/bash with 'set -x' corrupts stderr
PASS: rmdir/ignore
using SHELL=/bin/bash with 'set -x' corrupts stderr
PASS: rmdir/t-slash
using SHELL=/bin/bash with 'set -x' corrupts stderr
./tail-2/assert-2: skipping test: very expensive: disabled by default
SKIP: tail-2/assert-2
using SHELL=/bin/bash with 'set -x' corrupts stderr
./tail-2/big-4gb: skipping test: expensive: disabled by default
SKIP: tail-2/big-4gb
using SHELL=/bin/bash with 'set -x' corrupts stderr
PASS: tail-2/flush-initial
using SHELL=/bin/bash with 'set -x' corrupts stderr
PASS: tail-2/follow-stdin
using SHELL=/bin/bash with 'set -x' corrupts stderr
PASS: tail-2/pipe-f
using SHELL=/bin/bash with 'set -x' corrupts stderr
PASS: tail-2/pipe-f2
using SHELL=/bin/bash with 'set -x' corrupts stderr
PASS: tail-2/proc-ksyms
using SHELL=/bin/bash with 'set -x' corrupts stderr
PASS: tail-2/start-middle
using SHELL=/bin/bash with 'set -x' corrupts stderr
PASS: touch/60-seconds
using SHELL=/bin/bash with 'set -x' corrupts stderr
PASS: touch/dangling-symlink
using SHELL=/bin/bash with 'set -x' corrupts stderr
PASS: touch/dir-1
using SHELL=/bin/bash with 'set -x' corrupts stderr
PASS: touch/fail-diag
using SHELL=/bin/bash with 'set -x' corrupts stderr
PASS: touch/fifo
using SHELL=/bin/bash with 'set -x' corrupts stderr
PASS: touch/no-create-missing
using SHELL=/bin/bash with 'set -x' corrupts stderr
./touch/no-dereference: skipping test: this system lacks the utimensat function
SKIP: touch/no-dereference
using SHELL=/bin/bash with 'set -x' corrupts stderr
PASS: touch/no-rights
using SHELL=/bin/bash with 'set -x' corrupts stderr
PASS: touch/not-owner
using SHELL=/bin/bash with 'set -x' corrupts stderr
PASS: touch/obsolescent
using SHELL=/bin/bash with 'set -x' corrupts stderr
PASS: touch/read-only
using SHELL=/bin/bash with 'set -x' corrupts stderr
PASS: touch/relative
using SHELL=/bin/bash with 'set -x' corrupts stderr
PASS: touch/trailing-slash
using SHELL=/bin/bash with 'set -x' corrupts stderr
./chown/basic: skipping test: must be run as root
SKIP: chown/basic
using SHELL=/bin/bash with 'set -x' corrupts stderr
./cp/cp-a-selinux: skipping test: must be run as root
SKIP: cp/cp-a-selinux
using SHELL=/bin/bash with 'set -x' corrupts stderr
./cp/preserve-gid: skipping test: must be run as root
SKIP: cp/preserve-gid
using SHELL=/bin/bash with 'set -x' corrupts stderr
./cp/special-bits: skipping test: must be run as root
SKIP: cp/special-bits
using SHELL=/bin/bash with 'set -x' corrupts stderr
./cp/cp-mv-enotsup-xattr: skipping test: must be run as root
SKIP: cp/cp-mv-enotsup-xattr
using SHELL=/bin/bash with 'set -x' corrupts stderr
./cp/capability: skipping test: must be run as root
SKIP: cp/capability
using SHELL=/bin/bash with 'set -x' corrupts stderr
./cp/sparse-fiemap: skipping test: must be run as root
SKIP: cp/sparse-fiemap
using SHELL=/bin/bash with 'set -x' corrupts stderr
./dd/skip-seek-past-dev: skipping test: must be run as root
SKIP: dd/skip-seek-past-dev
using SHELL=/bin/bash with 'set -x' corrupts stderr
./install/install-C-root: skipping test: must be run as root
SKIP: install/install-C-root
using SHELL=/bin/bash with 'set -x' corrupts stderr
./ls/capability: skipping test: must be run as root
SKIP: ls/capability
using SHELL=/bin/bash with 'set -x' corrupts stderr
./ls/nameless-uid: skipping test: must be run as root
SKIP: ls/nameless-uid
using SHELL=/bin/bash with 'set -x' corrupts stderr
./misc/chcon: skipping test: must be run as root
SKIP: misc/chcon
using SHELL=/bin/bash with 'set -x' corrupts stderr
./misc/chroot-credentials: skipping test: must be run as root
SKIP: misc/chroot-credentials
using SHELL=/bin/bash with 'set -x' corrupts stderr
./misc/selinux: skipping test: must be run as root
SKIP: misc/selinux
using SHELL=/bin/bash with 'set -x' corrupts stderr
./misc/truncate-owned-by-other: skipping test: must be run as root
SKIP: misc/truncate-owned-by-other
using SHELL=/bin/bash with 'set -x' corrupts stderr
./mkdir/writable-under-readonly: skipping test: must be run as root
SKIP: mkdir/writable-under-readonly
using SHELL=/bin/bash with 'set -x' corrupts stderr
./mv/sticky-to-xpart: skipping test: must be run as root
SKIP: mv/sticky-to-xpart
using SHELL=/bin/bash with 'set -x' corrupts stderr
./rm/fail-2eperm: skipping test: must be run as root
SKIP: rm/fail-2eperm
using SHELL=/bin/bash with 'set -x' corrupts stderr
./rm/no-give-up: skipping test: must be run as root
SKIP: rm/no-give-up
using SHELL=/bin/bash with 'set -x' corrupts stderr
./rm/one-file-system: skipping test: must be run as root
SKIP: rm/one-file-system
using SHELL=/bin/bash with 'set -x' corrupts stderr
./rm/read-only: skipping test: must be run as root
SKIP: rm/read-only
using SHELL=/bin/bash with 'set -x' corrupts stderr
./tail-2/append-only: skipping test: must be run as root
SKIP: tail-2/append-only
using SHELL=/bin/bash with 'set -x' corrupts stderr
./touch/now-owned-by-other: skipping test: must be run as root
SKIP: touch/now-owned-by-other
==============================================
   GNU coreutils 8.10: tests/test-suite.log   
==============================================

1 of 361 tests failed.  (86 tests were not run).  

.. contents:: :depth: 2


SKIP: tail-2/inotify-race (exit: 77)
====================================

tail (GNU coreutils) 8.10
Copyright (C) 2011 Free Software Foundation, Inc.
License GPLv3+: GNU GPL version 3 or later <http://gnu.org/licenses/gpl.html>.
This is free software: you are free to change and redistribute it.
There is NO WARRANTY, to the extent permitted by law.

Written by Paul Rubin, David MacKenzie, Ian Lance Taylor,
and Jim Meyering.
./tail-2/inotify-race: skipping test: very expensive: disabled by default
This test is very expensive, so it is disabled by default.
To run it anyway, rerun make check with the RUN_VERY_EXPENSIVE_TESTS
environment variable set to yes.  E.g.,

  env RUN_VERY_EXPENSIVE_TESTS=yes make check


SKIP: rm/ext3-perf (exit: 77)
=============================

rm (GNU coreutils) 8.10
Copyright (C) 2011 Free Software Foundation, Inc.
License GPLv3+: GNU GPL version 3 or later <http://gnu.org/licenses/gpl.html>.
This is free software: you are free to change and redistribute it.
There is NO WARRANTY, to the extent permitted by law.

Written by Paul Rubin, David MacKenzie, Richard M. Stallman,
and Jim Meyering.
./rm/ext3-perf: skipping test: very expensive: disabled by default
This test is very expensive, so it is disabled by default.
To run it anyway, rerun make check with the RUN_VERY_EXPENSIVE_TESTS
environment variable set to yes.  E.g.,

  env RUN_VERY_EXPENSIVE_TESTS=yes make check


SKIP: cp/link-heap (exit: 77)
=============================

cp (GNU coreutils) 8.10
Copyright (C) 2011 Free Software Foundation, Inc.
License GPLv3+: GNU GPL version 3 or later <http://gnu.org/licenses/gpl.html>.
This is free software: you are free to change and redistribute it.
There is NO WARRANTY, to the extent permitted by law.

Written by Torbjorn Granlund, David MacKenzie, and Jim Meyering.
./cp/link-heap: skipping test: expensive: disabled by default
This test is relatively expensive, so it is disabled by default.
To run it anyway, rerun make check with the RUN_EXPENSIVE_TESTS
environment variable set to yes.  E.g.,

  env RUN_EXPENSIVE_TESTS=yes make check


SKIP: tail-2/inotify-rotate (exit: 77)
======================================

+ tail --version
tail (GNU coreutils) 8.10
Copyright (C) 2011 Free Software Foundation, Inc.
License GPLv3+: GNU GPL version 3 or later <http://gnu.org/licenses/gpl.html>.
This is free software: you are free to change and redistribute it.
There is NO WARRANTY, to the extent permitted by law.

Written by Paul Rubin, David MacKenzie, Ian Lance Taylor,
and Jim Meyering.
+ . ./init.sh
+ expr ././tail-2/inotify-rotate : .*/\(.*\)$
+ ME_=inotify-rotate
+ : 2
+ DUALCASE=1
+ export DUALCASE
+ test -n 
+ 2> /dev/null 
+ set -o posix
+ gl_shell_test_script_=
test $(echo y) = y || exit 1
score_=10
if test "$VERBOSE" = yes; then
  test -n "$( (exec 3>&1; set -x; P=1 true 2>&3) 2> /dev/null)" && score_=9
fi
test -z "$EXEEXT" && exit $score_
shopt -s expand_aliases
alias a-b="echo zoo"
v=abx
     test ${v%x} = ab \
  && test ${v#a} = bx \
  && test $(a-b) = zoo \
  && exit $score_

+ test x = x--no-reexec
+ gl_set_x_corrupts_stderr_=false
+ export gl_set_x_corrupts_stderr_
+ marginal_=
+ test __current__ = no_shell
+ test __current__ = fail
+ test __current__ = __current__
+ > /dev/null 
+ 2>&1 
+ st_=9
+ test 9 = 10
+ test 9: = 9:
+ marginal_=__current__
+ gl_set_x_corrupts_stderr_=true
+ test no_shell = no_shell
+ continue
+ test /bin/sh = no_shell
+ test /bin/sh = fail
+ test /bin/sh = __current__
+ /bin/sh -c 
test $(echo y) = y || exit 1
score_=10
if test "$VERBOSE" = yes; then
  test -n "$( (exec 3>&1; set -x; P=1 true 2>&3) 2> /dev/null)" && score_=9
fi
test -z "$EXEEXT" && exit $score_
shopt -s expand_aliases
alias a-b="echo zoo"
v=abx
     test ${v%x} = ab \
  && test ${v#a} = bx \
  && test $(a-b) = zoo \
  && exit $score_

+ 2> /dev/null 
+ st_=9
+ test 9 = 10
+ test 9:__current__ = 9:
+ test bash = no_shell
+ test bash = fail
+ test bash = __current__
+ bash -c 
test $(echo y) = y || exit 1
score_=10
if test "$VERBOSE" = yes; then
  test -n "$( (exec 3>&1; set -x; P=1 true 2>&3) 2> /dev/null)" && score_=9
fi
test -z "$EXEEXT" && exit $score_
shopt -s expand_aliases
alias a-b="echo zoo"
v=abx
     test ${v%x} = ab \
  && test ${v#a} = bx \
  && test $(a-b) = zoo \
  && exit $score_

+ 2> /dev/null 
+ st_=10
+ test 10 = 10
+ break
+ test bash != __current__
+ opts_=-x
+ exec bash -x ./tail-2/inotify-rotate --no-reexec
+ test yes = yes
+ set -x
+ tail --version
tail (GNU coreutils) 8.10
Copyright (C) 2011 Free Software Foundation, Inc.
License GPLv3+: GNU GPL version 3 or later <http://gnu.org/licenses/gpl.html>.
This is free software: you are free to change and redistribute it.
There is NO WARRANTY, to the extent permitted by law.

Written by Paul Rubin, David MacKenzie, Ian Lance Taylor,
and Jim Meyering.
+ . ./init.sh
+++ expr ././tail-2/inotify-rotate : '.*/\(.*\)$'
++ ME_=inotify-rotate
++ : 2
++ DUALCASE=1
++ export DUALCASE
++ test -n ''
++ case `(set -o) 2>/dev/null` in
++ set -o posix
++ gl_shell_test_script_='
test $(echo y) = y || exit 1
score_=10
if test "$VERBOSE" = yes; then
  test -n "$( (exec 3>&1; set -x; P=1 true 2>&3) 2> /dev/null)" && score_=9
fi
test -z "$EXEEXT" && exit $score_
shopt -s expand_aliases
alias a-b="echo zoo"
v=abx
     test ${v%x} = ab \
  && test ${v#a} = bx \
  && test $(a-b) = zoo \
  && exit $score_
'
++ test x--no-reexec = x--no-reexec
++ shift
++ test -n ''
++ : 87
++ export MALLOC_PERTURB_
++ test -f ./init.cfg
++ . ./init.cfg
+++ stderr_fileno_=9
+++ sanitize_path_
+++ local 'saved_IFS= 	
'
+++ IFS=:
+++ set -- /tmp/B.78d3c96c-d3d1-4de0-914f-8c6c57edcc36/BUILD/coreutils-8.10/src /bin /usr/bin /usr/local/bin /usr/X11R6/bin /home/services/builder/bin
+++ IFS=' 	
'
+++ local d d1
+++ local colon=
+++ local new_path=
+++ for d in '"$@"'
+++ test -z /tmp/B.78d3c96c-d3d1-4de0-914f-8c6c57edcc36/BUILD/coreutils-8.10/src
+++ d1=/tmp/B.78d3c96c-d3d1-4de0-914f-8c6c57edcc36/BUILD/coreutils-8.10/src
+++ ls -d /tmp/B.78d3c96c-d3d1-4de0-914f-8c6c57edcc36/BUILD/coreutils-8.10/src/.
+++ new_path=/tmp/B.78d3c96c-d3d1-4de0-914f-8c6c57edcc36/BUILD/coreutils-8.10/src
+++ colon=:
+++ for d in '"$@"'
+++ test -z /bin
+++ d1=/bin
+++ ls -d /bin/.
+++ new_path=/tmp/B.78d3c96c-d3d1-4de0-914f-8c6c57edcc36/BUILD/coreutils-8.10/src:/bin
+++ colon=:
+++ for d in '"$@"'
+++ test -z /usr/bin
+++ d1=/usr/bin
+++ ls -d /usr/bin/.
+++ new_path=/tmp/B.78d3c96c-d3d1-4de0-914f-8c6c57edcc36/BUILD/coreutils-8.10/src:/bin:/usr/bin
+++ colon=:
+++ for d in '"$@"'
+++ test -z /usr/local/bin
+++ d1=/usr/local/bin
+++ ls -d /usr/local/bin/.
+++ new_path=/tmp/B.78d3c96c-d3d1-4de0-914f-8c6c57edcc36/BUILD/coreutils-8.10/src:/bin:/usr/bin:/usr/local/bin
+++ colon=:
+++ for d in '"$@"'
+++ test -z /usr/X11R6/bin
+++ d1=/usr/X11R6/bin
+++ ls -d /usr/X11R6/bin/.
+++ new_path=/tmp/B.78d3c96c-d3d1-4de0-914f-8c6c57edcc36/BUILD/coreutils-8.10/src:/bin:/usr/bin:/usr/local/bin:/usr/X11R6/bin
+++ colon=:
+++ for d in '"$@"'
+++ test -z /home/services/builder/bin
+++ d1=/home/services/builder/bin
+++ ls -d /home/services/builder/bin/.
+++ PATH=/tmp/B.78d3c96c-d3d1-4de0-914f-8c6c57edcc36/BUILD/coreutils-8.10/src:/bin:/usr/bin:/usr/local/bin:/usr/X11R6/bin
+++ export PATH
++ setup_
++ test yes = yes
++ true
++ warn_ 'using SHELL=/bin/bash with '\''set -x'\'' corrupts stderr'
++ echo 'using SHELL=/bin/bash with '\''set -x'\'' corrupts stderr'
++ initial_cwd_=/tmp/B.78d3c96c-d3d1-4de0-914f-8c6c57edcc36/BUILD/coreutils-8.10/tests
++ fail=0
+++ testdir_prefix_
+++ printf gt
++ pfx_=gt
+++ mktempd_ /tmp/B.78d3c96c-d3d1-4de0-914f-8c6c57edcc36/BUILD/coreutils-8.10/tests gt-inotify-rotate.XXXX
+++ case $# in
+++ destdir_=/tmp/B.78d3c96c-d3d1-4de0-914f-8c6c57edcc36/BUILD/coreutils-8.10/tests
+++ template_=gt-inotify-rotate.XXXX
+++ MAX_TRIES_=4
+++ case $destdir_ in
+++ case $template_ in
++++ unset TMPDIR
++++ mktemp -d -t -p /tmp/B.78d3c96c-d3d1-4de0-914f-8c6c57edcc36/BUILD/coreutils-8.10/tests gt-inotify-rotate.XXXX
+++ d=/tmp/B.78d3c96c-d3d1-4de0-914f-8c6c57edcc36/BUILD/coreutils-8.10/tests/gt-inotify-rotate.LmVS
+++ case $d in
+++ test -d /tmp/B.78d3c96c-d3d1-4de0-914f-8c6c57edcc36/BUILD/coreutils-8.10/tests/gt-inotify-rotate.LmVS
++++ tr S -
++++ ls -dgo /tmp/B.78d3c96c-d3d1-4de0-914f-8c6c57edcc36/BUILD/coreutils-8.10/tests/gt-inotify-rotate.LmVS
+++ perms='drwx------ 2 6 Apr 18 10:56 /tmp/B.78d3c96c-d3d1-4de0-914f-8c6c57edcc36/BUILD/coreutils-8.10/tests/gt-inotify-rotate.LmV-'
+++ case $perms in
+++ test 0 = 0
+++ echo /tmp/B.78d3c96c-d3d1-4de0-914f-8c6c57edcc36/BUILD/coreutils-8.10/tests/gt-inotify-rotate.LmVS
+++ return
++ test_dir_=/tmp/B.78d3c96c-d3d1-4de0-914f-8c6c57edcc36/BUILD/coreutils-8.10/tests/gt-inotify-rotate.LmVS
++ cd /tmp/B.78d3c96c-d3d1-4de0-914f-8c6c57edcc36/BUILD/coreutils-8.10/tests/gt-inotify-rotate.LmVS
++ gl_init_sh_nl_='
'
++ IFS=' 	
'
++ for sig_ in 1 2 3 13 15
+++ expr 1 + 128
++ eval 'trap '\''Exit 129'\'' 1'
+++ trap 'Exit 129' 1
++ for sig_ in 1 2 3 13 15
+++ expr 2 + 128
++ eval 'trap '\''Exit 130'\'' 2'
+++ trap 'Exit 130' 2
++ for sig_ in 1 2 3 13 15
+++ expr 3 + 128
++ eval 'trap '\''Exit 131'\'' 3'
+++ trap 'Exit 131' 3
++ for sig_ in 1 2 3 13 15
+++ expr 13 + 128
++ eval 'trap '\''Exit 141'\'' 13'
+++ trap 'Exit 141' 13
++ for sig_ in 1 2 3 13 15
+++ expr 15 + 128
++ eval 'trap '\''Exit 143'\'' 15'
+++ trap 'Exit 143' 15
++ trap remove_tmp_ 0
+ path_prepend_ ../src
+ test 1 '!=' 0
+ path_dir_=../src
+ case $path_dir_ in
++ cd /tmp/B.78d3c96c-d3d1-4de0-914f-8c6c57edcc36/BUILD/coreutils-8.10/tests/../src
++ echo /tmp/B.78d3c96c-d3d1-4de0-914f-8c6c57edcc36/BUILD/coreutils-8.10/src
+ abs_path_dir_=/tmp/B.78d3c96c-d3d1-4de0-914f-8c6c57edcc36/BUILD/coreutils-8.10/src
+ case $abs_path_dir_ in
+ PATH=/tmp/B.78d3c96c-d3d1-4de0-914f-8c6c57edcc36/BUILD/coreutils-8.10/src:/tmp/B.78d3c96c-d3d1-4de0-914f-8c6c57edcc36/BUILD/coreutils-8.10/src:/bin:/usr/bin:/usr/local/bin:/usr/X11R6/bin
+ create_exe_shims_ /tmp/B.78d3c96c-d3d1-4de0-914f-8c6c57edcc36/BUILD/coreutils-8.10/src
+ case $EXEEXT in
+ return 0
+ shift
+ test 0 '!=' 0
+ export PATH
+ expensive_
+ test '' '!=' yes
+ skip_test_ 'expensive: disabled by default
This test is relatively expensive, so it is disabled by default.
To run it anyway, rerun make check with the RUN_EXPENSIVE_TESTS
environment variable set to yes.  E.g.,

  env RUN_EXPENSIVE_TESTS=yes make check
'
+ head -1
+ echo './tail-2/inotify-rotate: skipping test: expensive: disabled by default
This test is relatively expensive, so it is disabled by default.
To run it anyway, rerun make check with the RUN_EXPENSIVE_TESTS
environment variable set to yes.  E.g.,

  env RUN_EXPENSIVE_TESTS=yes make check
'
+ echo './tail-2/inotify-rotate: skipping test: expensive: disabled by default
This test is relatively expensive, so it is disabled by default.
To run it anyway, rerun make check with the RUN_EXPENSIVE_TESTS
environment variable set to yes.  E.g.,

  env RUN_EXPENSIVE_TESTS=yes make check
'
./tail-2/inotify-rotate: skipping test: expensive: disabled by default
This test is relatively expensive, so it is disabled by default.
To run it anyway, rerun make check with the RUN_EXPENSIVE_TESTS
environment variable set to yes.  E.g.,

  env RUN_EXPENSIVE_TESTS=yes make check

+ Exit 77
+ set +e
+ exit 77
+ exit 77
+ remove_tmp_
+ __st=77
+ cleanup_
+ :
+ cd /tmp/B.78d3c96c-d3d1-4de0-914f-8c6c57edcc36/BUILD/coreutils-8.10/tests
+ chmod -R u+rwx /tmp/B.78d3c96c-d3d1-4de0-914f-8c6c57edcc36/BUILD/coreutils-8.10/tests/gt-inotify-rotate.LmVS
+ rm -rf /tmp/B.78d3c96c-d3d1-4de0-914f-8c6c57edcc36/BUILD/coreutils-8.10/tests/gt-inotify-rotate.LmVS
+ exit 77

SKIP: chgrp/basic (exit: 77)
============================

chgrp (GNU coreutils) 8.10
Copyright (C) 2011 Free Software Foundation, Inc.
License GPLv3+: GNU GPL version 3 or later <http://gnu.org/licenses/gpl.html>.
This is free software: you are free to change and redistribute it.
There is NO WARRANTY, to the extent permitted by law.

Written by David MacKenzie and Jim Meyering.
./chgrp/basic: skipping test: requires membership in two groups
this test requires that you be a member of more than one group,
but running `id -G' either failed or found just one.  If you really
are a member of at least two groups, then rerun this test with
COREUTILS_GROUPS set in your environment to the space-separated list
of group names or numbers.  E.g.,

  env COREUTILS_GROUPS=users cdrom make check



SKIP: rm/isatty (exit: 77)
==========================

rm (GNU coreutils) 8.10
Copyright (C) 2011 Free Software Foundation, Inc.
License GPLv3+: GNU GPL version 3 or later <http://gnu.org/licenses/gpl.html>.
This is free software: you are free to change and redistribute it.
There is NO WARRANTY, to the extent permitted by law.

Written by Paul Rubin, David MacKenzie, Richard M. Stallman,
and Jim Meyering.
./rm/isatty: skipping test: there is no /dev/stdin file

SKIP: tail-2/assert (exit: 77)
==============================

tail (GNU coreutils) 8.10
Copyright (C) 2011 Free Software Foundation, Inc.
License GPLv3+: GNU GPL version 3 or later <http://gnu.org/licenses/gpl.html>.
This is free software: you are free to change and redistribute it.
There is NO WARRANTY, to the extent permitted by law.

Written by Paul Rubin, David MacKenzie, Ian Lance Taylor,
and Jim Meyering.
./tail-2/assert: skipping test: very expensive: disabled by default
This test is very expensive, so it is disabled by default.
To run it anyway, rerun make check with the RUN_VERY_EXPENSIVE_TESTS
environment variable set to yes.  E.g.,

  env RUN_VERY_EXPENSIVE_TESTS=yes make check


SKIP: rm/hash (exit: 77)
========================

rm (GNU coreutils) 8.10
Copyright (C) 2011 Free Software Foundation, Inc.
License GPLv3+: GNU GPL version 3 or later <http://gnu.org/licenses/gpl.html>.
This is free software: you are free to change and redistribute it.
There is NO WARRANTY, to the extent permitted by law.

Written by Paul Rubin, David MacKenzie, Richard M. Stallman,
and Jim Meyering.
./rm/hash: skipping test: expensive: disabled by default
This test is relatively expensive, so it is disabled by default.
To run it anyway, rerun make check with the RUN_EXPENSIVE_TESTS
environment variable set to yes.  E.g.,

  env RUN_EXPENSIVE_TESTS=yes make check


SKIP: chgrp/default-no-deref (exit: 77)
=======================================

chgrp (GNU coreutils) 8.10
Copyright (C) 2011 Free Software Foundation, Inc.
License GPLv3+: GNU GPL version 3 or later <http://gnu.org/licenses/gpl.html>.
This is free software: you are free to change and redistribute it.
There is NO WARRANTY, to the extent permitted by law.

Written by David MacKenzie and Jim Meyering.
./chgrp/default-no-deref: skipping test: requires membership in two groups
this test requires that you be a member of more than one group,
but running `id -G' either failed or found just one.  If you really
are a member of at least two groups, then rerun this test with
COREUTILS_GROUPS set in your environment to the space-separated list
of group names or numbers.  E.g.,

  env COREUTILS_GROUPS=users cdrom make check



SKIP: chgrp/deref (exit: 77)
============================

chgrp (GNU coreutils) 8.10
Copyright (C) 2011 Free Software Foundation, Inc.
License GPLv3+: GNU GPL version 3 or later <http://gnu.org/licenses/gpl.html>.
This is free software: you are free to change and redistribute it.
There is NO WARRANTY, to the extent permitted by law.

Written by David MacKenzie and Jim Meyering.
./chgrp/deref: skipping test: requires membership in two groups
this test requires that you be a member of more than one group,
but running `id -G' either failed or found just one.  If you really
are a member of at least two groups, then rerun this test with
COREUTILS_GROUPS set in your environment to the space-separated list
of group names or numbers.  E.g.,

  env COREUTILS_GROUPS=users cdrom make check



SKIP: chgrp/no-x (exit: 77)
===========================

chgrp (GNU coreutils) 8.10
Copyright (C) 2011 Free Software Foundation, Inc.
License GPLv3+: GNU GPL version 3 or later <http://gnu.org/licenses/gpl.html>.
This is free software: you are free to change and redistribute it.
There is NO WARRANTY, to the extent permitted by law.

Written by David MacKenzie and Jim Meyering.
./chgrp/no-x: skipping test: requires membership in two groups
this test requires that you be a member of more than one group,
but running `id -G' either failed or found just one.  If you really
are a member of at least two groups, then rerun this test with
COREUTILS_GROUPS set in your environment to the space-separated list
of group names or numbers.  E.g.,

  env COREUTILS_GROUPS=users cdrom make check



SKIP: chgrp/posix-H (exit: 77)
==============================

chgrp (GNU coreutils) 8.10
Copyright (C) 2011 Free Software Foundation, Inc.
License GPLv3+: GNU GPL version 3 or later <http://gnu.org/licenses/gpl.html>.
This is free software: you are free to change and redistribute it.
There is NO WARRANTY, to the extent permitted by law.

Written by David MacKenzie and Jim Meyering.
./chgrp/posix-H: skipping test: requires membership in two groups
this test requires that you be a member of more than one group,
but running `id -G' either failed or found just one.  If you really
are a member of at least two groups, then rerun this test with
COREUTILS_GROUPS set in your environment to the space-separated list
of group names or numbers.  E.g.,

  env COREUTILS_GROUPS=users cdrom make check



SKIP: chgrp/recurse (exit: 77)
==============================

chgrp (GNU coreutils) 8.10
Copyright (C) 2011 Free Software Foundation, Inc.
License GPLv3+: GNU GPL version 3 or later <http://gnu.org/licenses/gpl.html>.
This is free software: you are free to change and redistribute it.
There is NO WARRANTY, to the extent permitted by law.

Written by David MacKenzie and Jim Meyering.
./chgrp/recurse: skipping test: requires membership in two groups
this test requires that you be a member of more than one group,
but running `id -G' either failed or found just one.  If you really
are a member of at least two groups, then rerun this test with
COREUTILS_GROUPS set in your environment to the space-separated list
of group names or numbers.  E.g.,

  env COREUTILS_GROUPS=users cdrom make check



SKIP: misc/arch (exit: 77)
==========================

env: arch: No such file or directory
arch: not built
./misc/arch: skipping test: required program(s) not built

SKIP: misc/id-context (exit: 77)
================================

id (GNU coreutils) 8.10
Copyright (C) 2011 Free Software Foundation, Inc.
License GPLv3+: GNU GPL version 3 or later <http://gnu.org/licenses/gpl.html>.
This is free software: you are free to change and redistribute it.
There is NO WARRANTY, to the extent permitted by law.

Written by Arnold Robbins and David MacKenzie.
./misc/id-context: skipping test: this system (or maybe just the current file system) lacks SELinux support

SKIP: misc/nice (exit: 77)
==========================

nice (GNU coreutils) 8.10
Copyright (C) 2011 Free Software Foundation, Inc.
License GPLv3+: GNU GPL version 3 or later <http://gnu.org/licenses/gpl.html>.
This is free software: you are free to change and redistribute it.
There is NO WARRANTY, to the extent permitted by law.

Written by David MacKenzie.
./misc/nice: skipping test: this test must be run at nice level 0

SKIP: misc/sort-benchmark-random (exit: 77)
===========================================

sort (GNU coreutils) 8.10
Copyright (C) 2011 Free Software Foundation, Inc.
License GPLv3+: GNU GPL version 3 or later <http://gnu.org/licenses/gpl.html>.
This is free software: you are free to change and redistribute it.
There is NO WARRANTY, to the extent permitted by law.

Written by Mike Haertel and Paul Eggert.
./misc/sort-benchmark-random: skipping test: very expensive: disabled by default
This test is very expensive, so it is disabled by default.
To run it anyway, rerun make check with the RUN_VERY_EXPENSIVE_TESTS
environment variable set to yes.  E.g.,

  env RUN_VERY_EXPENSIVE_TESTS=yes make check


SKIP: misc/sort-compress-hang (exit: 77)
========================================

sort (GNU coreutils) 8.10
Copyright (C) 2011 Free Software Foundation, Inc.
License GPLv3+: GNU GPL version 3 or later <http://gnu.org/licenses/gpl.html>.
This is free software: you are free to change and redistribute it.
There is NO WARRANTY, to the extent permitted by law.

Written by Mike Haertel and Paul Eggert.
./misc/sort-compress-hang: skipping test: very expensive: disabled by default
This test is very expensive, so it is disabled by default.
To run it anyway, rerun make check with the RUN_VERY_EXPENSIVE_TESTS
environment variable set to yes.  E.g.,

  env RUN_VERY_EXPENSIVE_TESTS=yes make check


SKIP: misc/sort-compress-proc (exit: 77)
========================================

sort (GNU coreutils) 8.10
Copyright (C) 2011 Free Software Foundation, Inc.
License GPLv3+: GNU GPL version 3 or later <http://gnu.org/licenses/gpl.html>.
This is free software: you are free to change and redistribute it.
There is NO WARRANTY, to the extent permitted by law.

Written by Mike Haertel and Paul Eggert.
./misc/sort-compress-proc: skipping test: expensive: disabled by default
This test is relatively expensive, so it is disabled by default.
To run it anyway, rerun make check with the RUN_EXPENSIVE_TESTS
environment variable set to yes.  E.g.,

  env RUN_EXPENSIVE_TESTS=yes make check


SKIP: misc/sort-stale-thread-mem (exit: 77)
===========================================

sort (GNU coreutils) 8.10
Copyright (C) 2011 Free Software Foundation, Inc.
License GPLv3+: GNU GPL version 3 or later <http://gnu.org/licenses/gpl.html>.
This is free software: you are free to change and redistribute it.
There is NO WARRANTY, to the extent permitted by law.

Written by Mike Haertel and Paul Eggert.
./misc/sort-stale-thread-mem: skipping test: very expensive: disabled by default
This test is very expensive, so it is disabled by default.
To run it anyway, rerun make check with the RUN_VERY_EXPENSIVE_TESTS
environment variable set to yes.  E.g.,

  env RUN_VERY_EXPENSIVE_TESTS=yes make check


SKIP: misc/stat-nanoseconds (exit: 77)
======================================

./misc/stat-nanoseconds[19]: print_ver_: not found
./misc/stat-nanoseconds: line 19: print_ver_: command not found

SKIP: misc/stty (exit: 77)
==========================

stty (GNU coreutils) 8.10
Copyright (C) 2011 Free Software Foundation, Inc.
License GPLv3+: GNU GPL version 3 or later <http://gnu.org/licenses/gpl.html>.
This is free software: you are free to change and redistribute it.
There is NO WARRANTY, to the extent permitted by law.

Written by David MacKenzie.
./misc/stty: skipping test: requires controlling input terminal
This test must have a controlling input "terminal", so it may not be
run via "batch", "at", or "ssh".  On some systems, it may not even be
run in the background.

SKIP: misc/stty-invalid (exit: 77)
==================================

stty (GNU coreutils) 8.10
Copyright (C) 2011 Free Software Foundation, Inc.
License GPLv3+: GNU GPL version 3 or later <http://gnu.org/licenses/gpl.html>.
This is free software: you are free to change and redistribute it.
There is NO WARRANTY, to the extent permitted by law.

Written by David MacKenzie.
./misc/stty-invalid: skipping test: requires controlling input terminal
This test must have a controlling input "terminal", so it may not be
run via "batch", "at", or "ssh".  On some systems, it may not even be
run in the background.

SKIP: misc/stty-row-col (exit: 77)
==================================

stty (GNU coreutils) 8.10
Copyright (C) 2011 Free Software Foundation, Inc.
License GPLv3+: GNU GPL version 3 or later <http://gnu.org/licenses/gpl.html>.
This is free software: you are free to change and redistribute it.
There is NO WARRANTY, to the extent permitted by law.

Written by David MacKenzie.
./misc/stty-row-col: skipping test: requires controlling input terminal
This test must have a controlling input "terminal", so it may not be
run via "batch", "at", or "ssh".  On some systems, it may not even be
run in the background.

SKIP: misc/su-fail (exit: 77)
=============================

su (GNU coreutils) 8.10
Copyright (C) 2011 Free Software Foundation, Inc.
License GPLv3+: GNU GPL version 3 or later <http://gnu.org/licenses/gpl.html>.
This is free software: you are free to change and redistribute it.
There is NO WARRANTY, to the extent permitted by law.

Written by David MacKenzie.
su: not built
./misc/su-fail: skipping test: required program(s) not built

SKIP: misc/tac-continue (exit: 77)
==================================

tac (GNU coreutils) 8.10
Copyright (C) 2011 Free Software Foundation, Inc.
License GPLv3+: GNU GPL version 3 or later <http://gnu.org/licenses/gpl.html>.
This is free software: you are free to change and redistribute it.
There is NO WARRANTY, to the extent permitted by law.

Written by Jay Lepreau and David MacKenzie.
./misc/tac-continue: skipping test: FULL_PARTITION_TMPDIR not defined

SKIP: misc/tty-eof (exit: 77)
=============================

tty-eof: this script requires Perl's Expect package >=1.11

SKIP: misc/xattr (exit: 77)
===========================

cp (GNU coreutils) 8.10
Copyright (C) 2011 Free Software Foundation, Inc.
License GPLv3+: GNU GPL version 3 or later <http://gnu.org/licenses/gpl.html>.
This is free software: you are free to change and redistribute it.
There is NO WARRANTY, to the extent permitted by law.

Written by Torbjorn Granlund, David MacKenzie, and Jim Meyering.
mv (GNU coreutils) 8.10
Copyright (C) 2011 Free Software Foundation, Inc.
License GPLv3+: GNU GPL version 3 or later <http://gnu.org/licenses/gpl.html>.
This is free software: you are free to change and redistribute it.
There is NO WARRANTY, to the extent permitted by law.

Written by Mike Parker, David MacKenzie, and Jim Meyering.
install (GNU coreutils) 8.10
Copyright (C) 2011 Free Software Foundation, Inc.
License GPLv3+: GNU GPL version 3 or later <http://gnu.org/licenses/gpl.html>.
This is free software: you are free to change and redistribute it.
There is NO WARRANTY, to the extent permitted by law.

Written by David MacKenzie.
./misc/xattr: skipping test: requires a writable directory on a different disk partition,
and I couldn't find one.  I tried these:
  /tmp/B.78d3c96c-d3d1-4de0-914f-8c6c57edcc36/BUILD/tmp /tmp /dev/shm /var/tmp /usr/tmp /home/services/builder
Set your environment variable CANDIDATE_TMP_DIRS to make
this test use a different list.

FAIL: tail-2/wait (exit: 1)
===========================

tail (GNU coreutils) 8.10
Copyright (C) 2011 Free Software Foundation, Inc.
License GPLv3+: GNU GPL version 3 or later <http://gnu.org/licenses/gpl.html>.
This is free software: you are free to change and redistribute it.
There is NO WARRANTY, to the extent permitted by law.

Written by Paul Rubin, David MacKenzie, Ian Lance Taylor,
and Jim Meyering.
tail: cannot open `not_here' for reading: No such file or directory
tail: no files remaining
tail: cannot open `unreadable' for reading: Permission denied
tail: no files remaining
tail: cannot open `unreadable' for reading: Permission denied
tail: cannot open `not_here' for reading: No such file or directory
tail: `k' has become inaccessible: No such file or directory
tail: cannot open `not_here' for reading: No such file or directory
tail: cannot open `unreadable' for reading: Permission denied
tail: cannot open `unreadable' for reading: Permission denied
tail: cannot open `not_here' for reading: No such file or directory
tail: `k' has become inaccessible: No such file or directory
tail: `k' has appeared;  following end of new file
tail: `k' has become inaccessible: No such file or directory

SKIP: cp/existing-perm-race (exit: 77)
======================================

cp (GNU coreutils) 8.10
Copyright (C) 2011 Free Software Foundation, Inc.
License GPLv3+: GNU GPL version 3 or later <http://gnu.org/licenses/gpl.html>.
This is free software: you are free to change and redistribute it.
There is NO WARRANTY, to the extent permitted by law.

Written by Torbjorn Granlund, David MacKenzie, and Jim Meyering.
./cp/existing-perm-race: skipping test: requires membership in two groups
this test requires that you be a member of more than one group,
but running `id -G' either failed or found just one.  If you really
are a member of at least two groups, then rerun this test with
COREUTILS_GROUPS set in your environment to the space-separated list
of group names or numbers.  E.g.,

  env COREUTILS_GROUPS=users cdrom make check



SKIP: cp/fiemap-perf (exit: 77)
===============================

cp (GNU coreutils) 8.10
Copyright (C) 2011 Free Software Foundation, Inc.
License GPLv3+: GNU GPL version 3 or later <http://gnu.org/licenses/gpl.html>.
This is free software: you are free to change and redistribute it.
There is NO WARRANTY, to the extent permitted by law.

Written by Torbjorn Granlund, David MacKenzie, and Jim Meyering.
df: no file systems processed

SKIP: cp/fiemap-2 (exit: 77)
============================

cp (GNU coreutils) 8.10
Copyright (C) 2011 Free Software Foundation, Inc.
License GPLv3+: GNU GPL version 3 or later <http://gnu.org/licenses/gpl.html>.
This is free software: you are free to change and redistribute it.
There is NO WARRANTY, to the extent permitted by law.

Written by Torbjorn Granlund, David MacKenzie, and Jim Meyering.
df: no file systems processed

SKIP: cp/perm (exit: 77)
========================

cp (GNU coreutils) 8.10
Copyright (C) 2011 Free Software Foundation, Inc.
License GPLv3+: GNU GPL version 3 or later <http://gnu.org/licenses/gpl.html>.
This is free software: you are free to change and redistribute it.
There is NO WARRANTY, to the extent permitted by law.

Written by Torbjorn Granlund, David MacKenzie, and Jim Meyering.
mv (GNU coreutils) 8.10
Copyright (C) 2011 Free Software Foundation, Inc.
License GPLv3+: GNU GPL version 3 or later <http://gnu.org/licenses/gpl.html>.
This is free software: you are free to change and redistribute it.
There is NO WARRANTY, to the extent permitted by law.

Written by Mike Parker, David MacKenzie, and Jim Meyering.
./cp/perm: skipping test: very expensive: disabled by default
This test is very expensive, so it is disabled by default.
To run it anyway, rerun make check with the RUN_VERY_EXPENSIVE_TESTS
environment variable set to yes.  E.g.,

  env RUN_VERY_EXPENSIVE_TESTS=yes make check


SKIP: cp/preserve-slink-time (exit: 77)
=======================================

cp (GNU coreutils) 8.10
Copyright (C) 2011 Free Software Foundation, Inc.
License GPLv3+: GNU GPL version 3 or later <http://gnu.org/licenses/gpl.html>.
This is free software: you are free to change and redistribute it.
There is NO WARRANTY, to the extent permitted by law.

Written by Torbjorn Granlund, David MacKenzie, and Jim Meyering.
./cp/preserve-slink-time: skipping test: this system lacks the utimensat function

SKIP: cp/proc-short-read (exit: 77)
===================================

cp (GNU coreutils) 8.10
Copyright (C) 2011 Free Software Foundation, Inc.
License GPLv3+: GNU GPL version 3 or later <http://gnu.org/licenses/gpl.html>.
This is free software: you are free to change and redistribute it.
There is NO WARRANTY, to the extent permitted by law.

Written by Torbjorn Granlund, David MacKenzie, and Jim Meyering.
./cp/proc-short-read: skipping test: your system lacks /proc/kallsyms

SKIP: cp/reflink-auto (exit: 77)
================================

cp (GNU coreutils) 8.10
Copyright (C) 2011 Free Software Foundation, Inc.
License GPLv3+: GNU GPL version 3 or later <http://gnu.org/licenses/gpl.html>.
This is free software: you are free to change and redistribute it.
There is NO WARRANTY, to the extent permitted by law.

Written by Torbjorn Granlund, David MacKenzie, and Jim Meyering.
./cp/reflink-auto: skipping test: requires a writable directory on a different disk partition,
and I couldn't find one.  I tried these:
  /tmp/B.78d3c96c-d3d1-4de0-914f-8c6c57edcc36/BUILD/tmp /tmp /dev/shm /var/tmp /usr/tmp /home/services/builder
Set your environment variable CANDIDATE_TMP_DIRS to make
this test use a different list.

SKIP: du/2g (exit: 77)
======================

du (GNU coreutils) 8.10
Copyright (C) 2011 Free Software Foundation, Inc.
License GPLv3+: GNU GPL version 3 or later <http://gnu.org/licenses/gpl.html>.
This is free software: you are free to change and redistribute it.
There is NO WARRANTY, to the extent permitted by law.

Written by Torbjorn Granlund, David MacKenzie, Paul Eggert,
and Jim Meyering.
./du/2g: skipping test: very expensive: disabled by default
This test is very expensive, so it is disabled by default.
To run it anyway, rerun make check with the RUN_VERY_EXPENSIVE_TESTS
environment variable set to yes.  E.g.,

  env RUN_VERY_EXPENSIVE_TESTS=yes make check


SKIP: du/bigtime (exit: 77)
===========================


SKIP: du/fd-leak (exit: 77)
===========================

du (GNU coreutils) 8.10
Copyright (C) 2011 Free Software Foundation, Inc.
License GPLv3+: GNU GPL version 3 or later <http://gnu.org/licenses/gpl.html>.
This is free software: you are free to change and redistribute it.
There is NO WARRANTY, to the extent permitted by law.

Written by Torbjorn Granlund, David MacKenzie, Paul Eggert,
and Jim Meyering.
./du/fd-leak: skipping test: expensive: disabled by default
This test is relatively expensive, so it is disabled by default.
To run it anyway, rerun make check with the RUN_EXPENSIVE_TESTS
environment variable set to yes.  E.g.,

  env RUN_EXPENSIVE_TESTS=yes make check


SKIP: du/move-dir-while-traversing (exit: 77)
=============================================

du (GNU coreutils) 8.10
Copyright (C) 2011 Free Software Foundation, Inc.
License GPLv3+: GNU GPL version 3 or later <http://gnu.org/licenses/gpl.html>.
This is free software: you are free to change and redistribute it.
There is NO WARRANTY, to the extent permitted by law.

Written by Torbjorn Granlund, David MacKenzie, Paul Eggert,
and Jim Meyering.
python: module pyinotify not found

SKIP: id/no-context (exit: 77)
==============================

id (GNU coreutils) 8.10
Copyright (C) 2011 Free Software Foundation, Inc.
License GPLv3+: GNU GPL version 3 or later <http://gnu.org/licenses/gpl.html>.
This is free software: you are free to change and redistribute it.
There is NO WARRANTY, to the extent permitted by law.

Written by Arnold Robbins and David MacKenzie.
./id/no-context: skipping test: this system (or maybe just the current file system) lacks SELinux support

SKIP: install/install-C-selinux (exit: 77)
==========================================

install (GNU coreutils) 8.10
Copyright (C) 2011 Free Software Foundation, Inc.
License GPLv3+: GNU GPL version 3 or later <http://gnu.org/licenses/gpl.html>.
This is free software: you are free to change and redistribute it.
There is NO WARRANTY, to the extent permitted by law.

Written by David MacKenzie.
./install/install-C-selinux: skipping test: this system (or maybe just the current file system) lacks SELinux support

SKIP: ls/no-cap (exit: 77)
==========================

ls (GNU coreutils) 8.10
Copyright (C) 2011 Free Software Foundation, Inc.
License GPLv3+: GNU GPL version 3 or later <http://gnu.org/licenses/gpl.html>.
This is free software: you are free to change and redistribute it.
There is NO WARRANTY, to the extent permitted by law.

Written by Richard M. Stallman and David MacKenzie.
./ls/no-cap: skipping test: no strace program

SKIP: ls/stat-dtype (exit: 77)
==============================

ls (GNU coreutils) 8.10
Copyright (C) 2011 Free Software Foundation, Inc.
License GPLv3+: GNU GPL version 3 or later <http://gnu.org/licenses/gpl.html>.
This is free software: you are free to change and redistribute it.
There is NO WARRANTY, to the extent permitted by law.

Written by Richard M. Stallman and David MacKenzie.
./ls/stat-dtype: skipping test: '.' is not on a suitable file system for this test

SKIP: ls/stat-free-symlinks (exit: 77)
======================================

ls (GNU coreutils) 8.10
Copyright (C) 2011 Free Software Foundation, Inc.
License GPLv3+: GNU GPL version 3 or later <http://gnu.org/licenses/gpl.html>.
This is free software: you are free to change and redistribute it.
There is NO WARRANTY, to the extent permitted by law.

Written by Richard M. Stallman and David MacKenzie.
./ls/stat-free-symlinks: skipping test: no strace program

SKIP: mkdir/selinux (exit: 77)
==============================

mkdir (GNU coreutils) 8.10
Copyright (C) 2011 Free Software Foundation, Inc.
License GPLv3+: GNU GPL version 3 or later <http://gnu.org/licenses/gpl.html>.
This is free software: you are free to change and redistribute it.
There is NO WARRANTY, to the extent permitted by law.

Written by David MacKenzie.
mkfifo (GNU coreutils) 8.10
Copyright (C) 2011 Free Software Foundation, Inc.
License GPLv3+: GNU GPL version 3 or later <http://gnu.org/licenses/gpl.html>.
This is free software: you are free to change and redistribute it.
There is NO WARRANTY, to the extent permitted by law.

Written by David MacKenzie.
mknod (GNU coreutils) 8.10
Copyright (C) 2011 Free Software Foundation, Inc.
License GPLv3+: GNU GPL version 3 or later <http://gnu.org/licenses/gpl.html>.
This is free software: you are free to change and redistribute it.
There is NO WARRANTY, to the extent permitted by law.

Written by David MacKenzie.
./init.cfg: line 76: getenforce: command not found
./mkdir/selinux: skipping test: This test is useful only with SELinux in Enforcing mode.

SKIP: mv/acl (exit: 77)
=======================

mv (GNU coreutils) 8.10
Copyright (C) 2011 Free Software Foundation, Inc.
License GPLv3+: GNU GPL version 3 or later <http://gnu.org/licenses/gpl.html>.
This is free software: you are free to change and redistribute it.
There is NO WARRANTY, to the extent permitted by law.

Written by Mike Parker, David MacKenzie, and Jim Meyering.
getfacl 2.2.45
setfacl 2.2.45
./mv/acl: skipping test: requires a writable directory on a different disk partition,
and I couldn't find one.  I tried these:
  /tmp/B.78d3c96c-d3d1-4de0-914f-8c6c57edcc36/BUILD/tmp /tmp /dev/shm /var/tmp /usr/tmp /home/services/builder
Set your environment variable CANDIDATE_TMP_DIRS to make
this test use a different list.

SKIP: mv/atomic (exit: 77)
==========================

mv (GNU coreutils) 8.10
Copyright (C) 2011 Free Software Foundation, Inc.
License GPLv3+: GNU GPL version 3 or later <http://gnu.org/licenses/gpl.html>.
This is free software: you are free to change and redistribute it.
There is NO WARRANTY, to the extent permitted by law.

Written by Mike Parker, David MacKenzie, and Jim Meyering.
./mv/atomic: skipping test: no strace program

SKIP: mv/atomic2 (exit: 77)
===========================

mv (GNU coreutils) 8.10
Copyright (C) 2011 Free Software Foundation, Inc.
License GPLv3+: GNU GPL version 3 or later <http://gnu.org/licenses/gpl.html>.
This is free software: you are free to change and redistribute it.
There is NO WARRANTY, to the extent permitted by law.

Written by Mike Parker, David MacKenzie, and Jim Meyering.
./mv/atomic2: skipping test: no strace program

SKIP: mv/backup-is-src (exit: 77)
=================================

mv (GNU coreutils) 8.10
Copyright (C) 2011 Free Software Foundation, Inc.
License GPLv3+: GNU GPL version 3 or later <http://gnu.org/licenses/gpl.html>.
This is free software: you are free to change and redistribute it.
There is NO WARRANTY, to the extent permitted by law.

Written by Mike Parker, David MacKenzie, and Jim Meyering.
./mv/backup-is-src: skipping test: requires a writable directory on a different disk partition,
and I couldn't find one.  I tried these:
  /tmp/B.78d3c96c-d3d1-4de0-914f-8c6c57edcc36/BUILD/tmp /tmp /dev/shm /var/tmp /usr/tmp /home/services/builder
Set your environment variable CANDIDATE_TMP_DIRS to make
this test use a different list.

SKIP: mv/hard-link-1 (exit: 77)
===============================

mv (GNU coreutils) 8.10
Copyright (C) 2011 Free Software Foundation, Inc.
License GPLv3+: GNU GPL version 3 or later <http://gnu.org/licenses/gpl.html>.
This is free software: you are free to change and redistribute it.
There is NO WARRANTY, to the extent permitted by law.

Written by Mike Parker, David MacKenzie, and Jim Meyering.
./mv/hard-link-1: skipping test: requires a writable directory on a different disk partition,
and I couldn't find one.  I tried these:
  /tmp/B.78d3c96c-d3d1-4de0-914f-8c6c57edcc36/BUILD/tmp /tmp /dev/shm /var/tmp /usr/tmp /home/services/builder
Set your environment variable CANDIDATE_TMP_DIRS to make
this test use a different list.

SKIP: mv/i-3 (exit: 77)
=======================

mv (GNU coreutils) 8.10
Copyright (C) 2011 Free Software Foundation, Inc.
License GPLv3+: GNU GPL version 3 or later <http://gnu.org/licenses/gpl.html>.
This is free software: you are free to change and redistribute it.
There is NO WARRANTY, to the extent permitted by law.

Written by Mike Parker, David MacKenzie, and Jim Meyering.
./mv/i-3: skipping test: requires controlling input terminal
This test must have a controlling input "terminal", so it may not be
run via "batch", "at", or "ssh".  On some systems, it may not even be
run in the background.

SKIP: mv/into-self-2 (exit: 77)
===============================

mv (GNU coreutils) 8.10
Copyright (C) 2011 Free Software Foundation, Inc.
License GPLv3+: GNU GPL version 3 or later <http://gnu.org/licenses/gpl.html>.
This is free software: you are free to change and redistribute it.
There is NO WARRANTY, to the extent permitted by law.

Written by Mike Parker, David MacKenzie, and Jim Meyering.
./mv/into-self-2: skipping test: requires a writable directory on a different disk partition,
and I couldn't find one.  I tried these:
  /tmp/B.78d3c96c-d3d1-4de0-914f-8c6c57edcc36/BUILD/tmp /tmp /dev/shm /var/tmp /usr/tmp /home/services/builder
Set your environment variable CANDIDATE_TMP_DIRS to make
this test use a different list.

SKIP: mv/leak-fd (exit: 77)
===========================

mv (GNU coreutils) 8.10
Copyright (C) 2011 Free Software Foundation, Inc.
License GPLv3+: GNU GPL version 3 or later <http://gnu.org/licenses/gpl.html>.
This is free software: you are free to change and redistribute it.
There is NO WARRANTY, to the extent permitted by law.

Written by Mike Parker, David MacKenzie, and Jim Meyering.
./mv/leak-fd: skipping test: requires a writable directory on a different disk partition,
and I couldn't find one.  I tried these:
  /tmp/B.78d3c96c-d3d1-4de0-914f-8c6c57edcc36/BUILD/tmp /tmp /dev/shm /var/tmp /usr/tmp /home/services/builder
Set your environment variable CANDIDATE_TMP_DIRS to make
this test use a different list.

SKIP: mv/mv-special-1 (exit: 77)
================================

mv (GNU coreutils) 8.10
Copyright (C) 2011 Free Software Foundation, Inc.
License GPLv3+: GNU GPL version 3 or later <http://gnu.org/licenses/gpl.html>.
This is free software: you are free to change and redistribute it.
There is NO WARRANTY, to the extent permitted by law.

Written by Mike Parker, David MacKenzie, and Jim Meyering.
./mv/mv-special-1: skipping test: requires a writable directory on a different disk partition,
and I couldn't find one.  I tried these:
  /tmp/B.78d3c96c-d3d1-4de0-914f-8c6c57edcc36/BUILD/tmp /tmp /dev/shm /var/tmp /usr/tmp /home/services/builder
Set your environment variable CANDIDATE_TMP_DIRS to make
this test use a different list.

SKIP: mv/part-fail (exit: 77)
=============================

mv (GNU coreutils) 8.10
Copyright (C) 2011 Free Software Foundation, Inc.
License GPLv3+: GNU GPL version 3 or later <http://gnu.org/licenses/gpl.html>.
This is free software: you are free to change and redistribute it.
There is NO WARRANTY, to the extent permitted by law.

Written by Mike Parker, David MacKenzie, and Jim Meyering.
./mv/part-fail: skipping test: requires a writable directory on a different disk partition,
and I couldn't find one.  I tried these:
  /tmp/B.78d3c96c-d3d1-4de0-914f-8c6c57edcc36/BUILD/tmp /tmp /dev/shm /var/tmp /usr/tmp /home/services/builder
Set your environment variable CANDIDATE_TMP_DIRS to make
this test use a different list.
chmod: cannot access `': No such file or directory

SKIP: mv/part-hardlink (exit: 77)
=================================

mv (GNU coreutils) 8.10
Copyright (C) 2011 Free Software Foundation, Inc.
License GPLv3+: GNU GPL version 3 or later <http://gnu.org/licenses/gpl.html>.
This is free software: you are free to change and redistribute it.
There is NO WARRANTY, to the extent permitted by law.

Written by Mike Parker, David MacKenzie, and Jim Meyering.
./mv/part-hardlink: skipping test: requires a writable directory on a different disk partition,
and I couldn't find one.  I tried these:
  /tmp/B.78d3c96c-d3d1-4de0-914f-8c6c57edcc36/BUILD/tmp /tmp /dev/shm /var/tmp /usr/tmp /home/services/builder
Set your environment variable CANDIDATE_TMP_DIRS to make
this test use a different list.

SKIP: mv/part-rename (exit: 77)
===============================

mv (GNU coreutils) 8.10
Copyright (C) 2011 Free Software Foundation, Inc.
License GPLv3+: GNU GPL version 3 or later <http://gnu.org/licenses/gpl.html>.
This is free software: you are free to change and redistribute it.
There is NO WARRANTY, to the extent permitted by law.

Written by Mike Parker, David MacKenzie, and Jim Meyering.
./mv/part-rename: skipping test: requires a writable directory on a different disk partition,
and I couldn't find one.  I tried these:
  /tmp/B.78d3c96c-d3d1-4de0-914f-8c6c57edcc36/BUILD/tmp /tmp /dev/shm /var/tmp /usr/tmp /home/services/builder
Set your environment variable CANDIDATE_TMP_DIRS to make
this test use a different list.

SKIP: mv/part-symlink (exit: 77)
================================

cp (GNU coreutils) 8.10
Copyright (C) 2011 Free Software Foundation, Inc.
License GPLv3+: GNU GPL version 3 or later <http://gnu.org/licenses/gpl.html>.
This is free software: you are free to change and redistribute it.
There is NO WARRANTY, to the extent permitted by law.

Written by Torbjorn Granlund, David MacKenzie, and Jim Meyering.
mv (GNU coreutils) 8.10
Copyright (C) 2011 Free Software Foundation, Inc.
License GPLv3+: GNU GPL version 3 or later <http://gnu.org/licenses/gpl.html>.
This is free software: you are free to change and redistribute it.
There is NO WARRANTY, to the extent permitted by law.

Written by Mike Parker, David MacKenzie, and Jim Meyering.
./mv/part-symlink: skipping test: requires a writable directory on a different disk partition,
and I couldn't find one.  I tried these:
  /tmp/B.78d3c96c-d3d1-4de0-914f-8c6c57edcc36/BUILD/tmp /tmp /dev/shm /var/tmp /usr/tmp /home/services/builder
Set your environment variable CANDIDATE_TMP_DIRS to make
this test use a different list.

SKIP: mv/partition-perm (exit: 77)
==================================

mv (GNU coreutils) 8.10
Copyright (C) 2011 Free Software Foundation, Inc.
License GPLv3+: GNU GPL version 3 or later <http://gnu.org/licenses/gpl.html>.
This is free software: you are free to change and redistribute it.
There is NO WARRANTY, to the extent permitted by law.

Written by Mike Parker, David MacKenzie, and Jim Meyering.
./mv/partition-perm: skipping test: requires a writable directory on a different disk partition,
and I couldn't find one.  I tried these:
  /tmp/B.78d3c96c-d3d1-4de0-914f-8c6c57edcc36/BUILD/tmp /tmp /dev/shm /var/tmp /usr/tmp /home/services/builder
Set your environment variable CANDIDATE_TMP_DIRS to make
this test use a different list.

SKIP: mv/to-symlink (exit: 77)
==============================

mv (GNU coreutils) 8.10
Copyright (C) 2011 Free Software Foundation, Inc.
License GPLv3+: GNU GPL version 3 or later <http://gnu.org/licenses/gpl.html>.
This is free software: you are free to change and redistribute it.
There is NO WARRANTY, to the extent permitted by law.

Written by Mike Parker, David MacKenzie, and Jim Meyering.
./mv/to-symlink: skipping test: requires a writable directory on a different disk partition,
and I couldn't find one.  I tried these:
  /tmp/B.78d3c96c-d3d1-4de0-914f-8c6c57edcc36/BUILD/tmp /tmp /dev/shm /var/tmp /usr/tmp /home/services/builder
Set your environment variable CANDIDATE_TMP_DIRS to make
this test use a different list.

SKIP: tail-2/assert-2 (exit: 77)
================================

tail (GNU coreutils) 8.10
Copyright (C) 2011 Free Software Foundation, Inc.
License GPLv3+: GNU GPL version 3 or later <http://gnu.org/licenses/gpl.html>.
This is free software: you are free to change and redistribute it.
There is NO WARRANTY, to the extent permitted by law.

Written by Paul Rubin, David MacKenzie, Ian Lance Taylor,
and Jim Meyering.
./tail-2/assert-2: skipping test: very expensive: disabled by default
This test is very expensive, so it is disabled by default.
To run it anyway, rerun make check with the RUN_VERY_EXPENSIVE_TESTS
environment variable set to yes.  E.g.,

  env RUN_VERY_EXPENSIVE_TESTS=yes make check


SKIP: tail-2/big-4gb (exit: 77)
===============================

tail (GNU coreutils) 8.10
Copyright (C) 2011 Free Software Foundation, Inc.
License GPLv3+: GNU GPL version 3 or later <http://gnu.org/licenses/gpl.html>.
This is free software: you are free to change and redistribute it.
There is NO WARRANTY, to the extent permitted by law.

Written by Paul Rubin, David MacKenzie, Ian Lance Taylor,
and Jim Meyering.
./tail-2/big-4gb: skipping test: expensive: disabled by default
This test is relatively expensive, so it is disabled by default.
To run it anyway, rerun make check with the RUN_EXPENSIVE_TESTS
environment variable set to yes.  E.g.,

  env RUN_EXPENSIVE_TESTS=yes make check


SKIP: touch/no-dereference (exit: 77)
=====================================

touch (GNU coreutils) 8.10
Copyright (C) 2011 Free Software Foundation, Inc.
License GPLv3+: GNU GPL version 3 or later <http://gnu.org/licenses/gpl.html>.
This is free software: you are free to change and redistribute it.
There is NO WARRANTY, to the extent permitted by law.

Written by Paul Rubin, Arnold Robbins, Jim Kingdon,
David MacKenzie, and Randy Smith.
./touch/no-dereference: skipping test: this system lacks the utimensat function

SKIP: chown/basic (exit: 77)
============================

chgrp (GNU coreutils) 8.10
Copyright (C) 2011 Free Software Foundation, Inc.
License GPLv3+: GNU GPL version 3 or later <http://gnu.org/licenses/gpl.html>.
This is free software: you are free to change and redistribute it.
There is NO WARRANTY, to the extent permitted by law.

Written by David MacKenzie and Jim Meyering.
./chown/basic: skipping test: must be run as root

SKIP: cp/cp-a-selinux (exit: 77)
================================

cp (GNU coreutils) 8.10
Copyright (C) 2011 Free Software Foundation, Inc.
License GPLv3+: GNU GPL version 3 or later <http://gnu.org/licenses/gpl.html>.
This is free software: you are free to change and redistribute it.
There is NO WARRANTY, to the extent permitted by law.

Written by Torbjorn Granlund, David MacKenzie, and Jim Meyering.
./cp/cp-a-selinux: skipping test: must be run as root

SKIP: cp/preserve-gid (exit: 77)
================================

cp (GNU coreutils) 8.10
Copyright (C) 2011 Free Software Foundation, Inc.
License GPLv3+: GNU GPL version 3 or later <http://gnu.org/licenses/gpl.html>.
This is free software: you are free to change and redistribute it.
There is NO WARRANTY, to the extent permitted by law.

Written by Torbjorn Granlund, David MacKenzie, and Jim Meyering.
./cp/preserve-gid: skipping test: must be run as root

SKIP: cp/special-bits (exit: 77)
================================

cp (GNU coreutils) 8.10
Copyright (C) 2011 Free Software Foundation, Inc.
License GPLv3+: GNU GPL version 3 or later <http://gnu.org/licenses/gpl.html>.
This is free software: you are free to change and redistribute it.
There is NO WARRANTY, to the extent permitted by law.

Written by Torbjorn Granlund, David MacKenzie, and Jim Meyering.
./cp/special-bits: skipping test: must be run as root

SKIP: cp/cp-mv-enotsup-xattr (exit: 77)
=======================================

cp (GNU coreutils) 8.10
Copyright (C) 2011 Free Software Foundation, Inc.
License GPLv3+: GNU GPL version 3 or later <http://gnu.org/licenses/gpl.html>.
This is free software: you are free to change and redistribute it.
There is NO WARRANTY, to the extent permitted by law.

Written by Torbjorn Granlund, David MacKenzie, and Jim Meyering.
mv (GNU coreutils) 8.10
Copyright (C) 2011 Free Software Foundation, Inc.
License GPLv3+: GNU GPL version 3 or later <http://gnu.org/licenses/gpl.html>.
This is free software: you are free to change and redistribute it.
There is NO WARRANTY, to the extent permitted by law.

Written by Mike Parker, David MacKenzie, and Jim Meyering.
./cp/cp-mv-enotsup-xattr: skipping test: must be run as root

SKIP: cp/capability (exit: 77)
==============================

ls (GNU coreutils) 8.10
Copyright (C) 2011 Free Software Foundation, Inc.
License GPLv3+: GNU GPL version 3 or later <http://gnu.org/licenses/gpl.html>.
This is free software: you are free to change and redistribute it.
There is NO WARRANTY, to the extent permitted by law.

Written by Richard M. Stallman and David MacKenzie.
./cp/capability: skipping test: must be run as root

SKIP: cp/sparse-fiemap (exit: 77)
=================================

cp (GNU coreutils) 8.10
Copyright (C) 2011 Free Software Foundation, Inc.
License GPLv3+: GNU GPL version 3 or later <http://gnu.org/licenses/gpl.html>.
This is free software: you are free to change and redistribute it.
There is NO WARRANTY, to the extent permitted by law.

Written by Torbjorn Granlund, David MacKenzie, and Jim Meyering.
df: no file systems processed
./cp/sparse-fiemap: skipping test: must be run as root

SKIP: dd/skip-seek-past-dev (exit: 77)
======================================

dd (coreutils) 8.10
Copyright (C) 2011 Free Software Foundation, Inc.
License GPLv3+: GNU GPL version 3 or later <http://gnu.org/licenses/gpl.html>.
This is free software: you are free to change and redistribute it.
There is NO WARRANTY, to the extent permitted by law.

Written by Paul Rubin, David MacKenzie, and Stuart Kemp.
./dd/skip-seek-past-dev: skipping test: must be run as root

SKIP: install/install-C-root (exit: 77)
=======================================

install (GNU coreutils) 8.10
Copyright (C) 2011 Free Software Foundation, Inc.
License GPLv3+: GNU GPL version 3 or later <http://gnu.org/licenses/gpl.html>.
This is free software: you are free to change and redistribute it.
There is NO WARRANTY, to the extent permitted by law.

Written by David MacKenzie.
./install/install-C-root: skipping test: must be run as root

SKIP: ls/capability (exit: 77)
==============================

ls (GNU coreutils) 8.10
Copyright (C) 2011 Free Software Foundation, Inc.
License GPLv3+: GNU GPL version 3 or later <http://gnu.org/licenses/gpl.html>.
This is free software: you are free to change and redistribute it.
There is NO WARRANTY, to the extent permitted by law.

Written by Richard M. Stallman and David MacKenzie.
./ls/capability: skipping test: must be run as root

SKIP: ls/nameless-uid (exit: 77)
================================

ls (GNU coreutils) 8.10
Copyright (C) 2011 Free Software Foundation, Inc.
License GPLv3+: GNU GPL version 3 or later <http://gnu.org/licenses/gpl.html>.
This is free software: you are free to change and redistribute it.
There is NO WARRANTY, to the extent permitted by law.

Written by Richard M. Stallman and David MacKenzie.
./ls/nameless-uid: skipping test: must be run as root

SKIP: misc/chcon (exit: 77)
===========================

chcon (GNU coreutils) 8.10
Copyright (C) 2011 Free Software Foundation, Inc.
License GPLv3+: GNU GPL version 3 or later <http://gnu.org/licenses/gpl.html>.
This is free software: you are free to change and redistribute it.
There is NO WARRANTY, to the extent permitted by law.

Written by Russell Coker and Jim Meyering.
./misc/chcon: skipping test: must be run as root

SKIP: misc/chroot-credentials (exit: 77)
========================================

chroot (GNU coreutils) 8.10
Copyright (C) 2011 Free Software Foundation, Inc.
License GPLv3+: GNU GPL version 3 or later <http://gnu.org/licenses/gpl.html>.
This is free software: you are free to change and redistribute it.
There is NO WARRANTY, to the extent permitted by law.

Written by Roland McGrath.
./misc/chroot-credentials: skipping test: must be run as root

SKIP: misc/selinux (exit: 77)
=============================

chcon (GNU coreutils) 8.10
Copyright (C) 2011 Free Software Foundation, Inc.
License GPLv3+: GNU GPL version 3 or later <http://gnu.org/licenses/gpl.html>.
This is free software: you are free to change and redistribute it.
There is NO WARRANTY, to the extent permitted by law.

Written by Russell Coker and Jim Meyering.
cp (GNU coreutils) 8.10
Copyright (C) 2011 Free Software Foundation, Inc.
License GPLv3+: GNU GPL version 3 or later <http://gnu.org/licenses/gpl.html>.
This is free software: you are free to change and redistribute it.
There is NO WARRANTY, to the extent permitted by law.

Written by Torbjorn Granlund, David MacKenzie, and Jim Meyering.
ls (GNU coreutils) 8.10
Copyright (C) 2011 Free Software Foundation, Inc.
License GPLv3+: GNU GPL version 3 or later <http://gnu.org/licenses/gpl.html>.
This is free software: you are free to change and redistribute it.
There is NO WARRANTY, to the extent permitted by law.

Written by Richard M. Stallman and David MacKenzie.
mv (GNU coreutils) 8.10
Copyright (C) 2011 Free Software Foundation, Inc.
License GPLv3+: GNU GPL version 3 or later <http://gnu.org/licenses/gpl.html>.
This is free software: you are free to change and redistribute it.
There is NO WARRANTY, to the extent permitted by law.

Written by Mike Parker, David MacKenzie, and Jim Meyering.
stat (GNU coreutils) 8.10
Copyright (C) 2011 Free Software Foundation, Inc.
License GPLv3+: GNU GPL version 3 or later <http://gnu.org/licenses/gpl.html>.
This is free software: you are free to change and redistribute it.
There is NO WARRANTY, to the extent permitted by law.

Written by Michael Meskes.
./misc/selinux: skipping test: must be run as root

SKIP: misc/truncate-owned-by-other (exit: 77)
=============================================

truncate (GNU coreutils) 8.10
Copyright (C) 2011 Free Software Foundation, Inc.
License GPLv3+: GNU GPL version 3 or later <http://gnu.org/licenses/gpl.html>.
This is free software: you are free to change and redistribute it.
There is NO WARRANTY, to the extent permitted by law.

Written by Padraig Brady.
./misc/truncate-owned-by-other: skipping test: must be run as root

SKIP: mkdir/writable-under-readonly (exit: 77)
==============================================

mkdir (GNU coreutils) 8.10
Copyright (C) 2011 Free Software Foundation, Inc.
License GPLv3+: GNU GPL version 3 or later <http://gnu.org/licenses/gpl.html>.
This is free software: you are free to change and redistribute it.
There is NO WARRANTY, to the extent permitted by law.

Written by David MacKenzie.
./mkdir/writable-under-readonly: skipping test: must be run as root

SKIP: mv/sticky-to-xpart (exit: 77)
===================================

mv (GNU coreutils) 8.10
Copyright (C) 2011 Free Software Foundation, Inc.
License GPLv3+: GNU GPL version 3 or later <http://gnu.org/licenses/gpl.html>.
This is free software: you are free to change and redistribute it.
There is NO WARRANTY, to the extent permitted by law.

Written by Mike Parker, David MacKenzie, and Jim Meyering.
./mv/sticky-to-xpart: skipping test: must be run as root

SKIP: rm/fail-2eperm (exit: 77)
===============================

rm (GNU coreutils) 8.10
Copyright (C) 2011 Free Software Foundation, Inc.
License GPLv3+: GNU GPL version 3 or later <http://gnu.org/licenses/gpl.html>.
This is free software: you are free to change and redistribute it.
There is NO WARRANTY, to the extent permitted by law.

Written by Paul Rubin, David MacKenzie, Richard M. Stallman,
and Jim Meyering.
./rm/fail-2eperm: skipping test: must be run as root

SKIP: rm/no-give-up (exit: 77)
==============================

rm (GNU coreutils) 8.10
Copyright (C) 2011 Free Software Foundation, Inc.
License GPLv3+: GNU GPL version 3 or later <http://gnu.org/licenses/gpl.html>.
This is free software: you are free to change and redistribute it.
There is NO WARRANTY, to the extent permitted by law.

Written by Paul Rubin, David MacKenzie, Richard M. Stallman,
and Jim Meyering.
./rm/no-give-up: skipping test: must be run as root

SKIP: rm/one-file-system (exit: 77)
===================================

rm (GNU coreutils) 8.10
Copyright (C) 2011 Free Software Foundation, Inc.
License GPLv3+: GNU GPL version 3 or later <http://gnu.org/licenses/gpl.html>.
This is free software: you are free to change and redistribute it.
There is NO WARRANTY, to the extent permitted by law.

Written by Paul Rubin, David MacKenzie, Richard M. Stallman,
and Jim Meyering.
./rm/one-file-system: skipping test: must be run as root

SKIP: rm/read-only (exit: 77)
=============================

rm (GNU coreutils) 8.10
Copyright (C) 2011 Free Software Foundation, Inc.
License GPLv3+: GNU GPL version 3 or later <http://gnu.org/licenses/gpl.html>.
This is free software: you are free to change and redistribute it.
There is NO WARRANTY, to the extent permitted by law.

Written by Paul Rubin, David MacKenzie, Richard M. Stallman,
and Jim Meyering.
./rm/read-only: skipping test: must be run as root

SKIP: tail-2/append-only (exit: 77)
===================================

tail (GNU coreutils) 8.10
Copyright (C) 2011 Free Software Foundation, Inc.
License GPLv3+: GNU GPL version 3 or later <http://gnu.org/licenses/gpl.html>.
This is free software: you are free to change and redistribute it.
There is NO WARRANTY, to the extent permitted by law.

Written by Paul Rubin, David MacKenzie, Ian Lance Taylor,
and Jim Meyering.
./tail-2/append-only: skipping test: must be run as root

SKIP: touch/now-owned-by-other (exit: 77)
=========================================

touch (GNU coreutils) 8.10
Copyright (C) 2011 Free Software Foundation, Inc.
License GPLv3+: GNU GPL version 3 or later <http://gnu.org/licenses/gpl.html>.
This is free software: you are free to change and redistribute it.
There is NO WARRANTY, to the extent permitted by law.

Written by Paul Rubin, Arnold Robbins, Jim Kingdon,
David MacKenzie, and Randy Smith.
./touch/now-owned-by-other: skipping test: must be run as root
======================================
1 of 361 tests failed
(86 tests were not run)
See tests/test-suite.log
Please report to bug-coreutils@gnu.org
======================================
make[4]: *** [test-suite.log] Error 1
make[4]: Leaving directory `/tmp/B.78d3c96c-d3d1-4de0-914f-8c6c57edcc36/BUILD/coreutils-8.10/tests'
make[3]: *** [check-TESTS] Error 2
make[3]: Leaving directory `/tmp/B.78d3c96c-d3d1-4de0-914f-8c6c57edcc36/BUILD/coreutils-8.10/tests'
make[2]: *** [check-am] Error 2
make[2]: Leaving directory `/tmp/B.78d3c96c-d3d1-4de0-914f-8c6c57edcc36/BUILD/coreutils-8.10/tests'
make[1]: *** [check-recursive] Error 1
make[1]: Leaving directory `/tmp/B.78d3c96c-d3d1-4de0-914f-8c6c57edcc36/BUILD/coreutils-8.10'
make: *** [check] Error 2
error: Bad exit status from /tmp/B.78d3c96c-d3d1-4de0-914f-8c6c57edcc36/BUILD/tmp/rpm-tmp.44228 (%build)


RPM build errors:
    Bad exit status from /tmp/B.78d3c96c-d3d1-4de0-914f-8c6c57edcc36/BUILD/tmp/rpm-tmp.44228 (%build)
ended at: Tue Apr 21 12:08:38 2015, done in 2 days, 23:15:17.677449
error: No files produced.
Can't find java virtual machine, aborting.
+ chmod -R u+rwX /tmp/B.78d3c96c-d3d1-4de0-914f-8c6c57edcc36/BUILD
+ rm -rf /tmp/B.78d3c96c-d3d1-4de0-914f-8c6c57edcc36/tmp /tmp/B.78d3c96c-d3d1-4de0-914f-8c6c57edcc36/BUILD
Can't find java virtual machine, aborting.
+ rm -rf /tmp/B.78d3c96c-d3d1-4de0-914f-8c6c57edcc36
Begin-PLD-Builder-Info
Build-Time: user:208.47s sys:16.80s real:256520.36s (faults io:134 non-io:17373017)

End-PLD-Builder-Info
[Back to list of logs] [View rpm -qa of builder]