FailedOk

th/SRPMS[OK]
th/x32[OK]
th/i686[OK]
th/x86_64[OK]

ac/SRPMS[OK]
ac/i386[OK]
ac/i586[OK]
ac/i686[OK]
ac/alpha[OK]
ac/amd64[OK]
ac/athlon[OK]
ac/ppc[OK]
ac/sparc[OK]
ac/sparc64[OK]

Advanced Search
main()
Powered by PLD Linux
(c) 2002-2024 PLD Team
$Revision: 1.37 $
Powered by nasi tu byli.
Your IP: 3.235.182.206

irssi 27008dcb-e99d-4bd0-a5ec-05b42bc866ee

Status:Failed
Source URL:https://buildlogs.pld-linux.org/pld/ac/ppc/FAIL/irssi,27008dcb-e99d-4bd0-a5ec-05b42bc866ee.bz2
text/plain URL:View!
full text:View!
rpm -qa of builder:View!
Date:2015/04/27 18:37:07
Runtime:0:06:09.775175

Toc:

  • error 1
  • make[3]: *** [get.lo] Error 1
  • error 2
  • make[2]: *** [all-recursive] Error 1
  • error 3
  • make[1]: *** [all-recursive] Error 1
  • error 4
  • error: Bad exit status from /home/services/builder/rpm/BUILD/irssi/tmp/rpm-tmp.59993 (%build)
  • error 5
  • RPM build errors:
  • error 6
  • error: No files produced.

Content:

checking size of int... 4
checking size of long... 4
checking size of long long... 8
checking size of off_t... 8
checking for ppc-pld-linux-pkg-config... no
checking for pkg-config... /usr/bin/pkg-config
checking pkg-config is at least version 0.7... yes
checking for GLIB - version >= 2.6.0... yes (version 2.16.1)
checking for SSL... yes
configure: checking "location of ncurses.h file"...
Found ncurses on /usr/include/ncurses/ncurses.h
checking for initscr in -lncurses... yes
checking for setupterm... yes
checking for working Perl support... ok
checking for IPv6... yes
configure: creating ./config.status
config.status: creating Makefile
config.status: creating src/Makefile
config.status: creating src/core/Makefile
config.status: creating src/irc/Makefile
config.status: creating src/irc/core/Makefile
config.status: creating src/irc/dcc/Makefile
config.status: creating src/irc/notifylist/Makefile
config.status: creating src/irc/proxy/Makefile
config.status: creating src/irc/flood/Makefile
config.status: creating src/fe-common/Makefile
config.status: creating src/fe-common/core/Makefile
config.status: creating src/fe-common/irc/Makefile
config.status: creating src/fe-common/irc/dcc/Makefile
config.status: creating src/fe-common/irc/notifylist/Makefile
config.status: creating src/fe-none/Makefile
config.status: creating src/fe-text/Makefile
config.status: creating src/lib-config/Makefile
config.status: creating src/perl/Makefile
config.status: creating src/perl/common/Makefile.PL
config.status: creating src/perl/irc/Makefile.PL
config.status: creating src/perl/ui/Makefile.PL
config.status: creating src/perl/textui/Makefile.PL
config.status: creating scripts/Makefile
config.status: creating scripts/examples/Makefile
config.status: creating docs/Makefile
config.status: creating docs/help/Makefile
config.status: creating docs/help/in/Makefile
config.status: creating irssi-config
config.status: creating irssi-config.h
config.status: executing depfiles commands
config.status: executing libtool commands
configure: WARNING: unrecognized options: --enable-nls

Building text frontend ........... : yes, using terminfo
Building irssi bot ............... : yes
Building irssi proxy ............. : yes
Building with module support ..... : yes
Building with Perl support ....... : static (in irssi binary)
Perl library directory ........... : (vendor default - /usr/lib/perl5/5.8.8/ppc-pld-linux-thread-multi)
Install prefix ................... : /usr

Building with IPv6 support ....... : yes
Building with SSL support ........ : yes
Building with 64bit DCC support .. : yes
Building with garbage collector .. : no

If there are any problems, read the INSTALL file.
+ /usr/bin/make -j1
./file2header.sh ./irssi.conf default_config > default-config.h
./file2header.sh ./default.theme default_theme > default-theme.h
./irssi-version.sh . | cmp -s - irssi-version.h || ./irssi-version.sh . >irssi-version.h
/usr/bin/make  all-recursive
make[1]: Entering directory `/home/services/builder/rpm/BUILD/irssi/irssi-0.8.15'
Making all in src
make[2]: Entering directory `/home/services/builder/rpm/BUILD/irssi/irssi-0.8.15/src'
Making all in lib-config
make[3]: Entering directory `/home/services/builder/rpm/BUILD/irssi/irssi-0.8.15/src/lib-config'
/bin/sh ../../libtool --tag=CC   --mode=compile ppc-pld-linux-gcc -DHAVE_CONFIG_H -I. -I../.. -I../../src -I/usr/include/glib-2.0 -I/usr/lib/glib-2.0/include      -O2 -fsigned-char  -Wall -I/usr/include/openssl   -MT get.lo -MD -MP -MF .deps/get.Tpo -c -o get.lo get.c
../../libtool[965]: X--tag=CC: not found
../../libtool[965]: libtool: ignoring unknown tag : not found
../../libtool[965]: X--mode=compile: not found
../../libtool[7132]: *** Warning: inferring the mode of operation is deprecated.: not found
../../libtool[7132]: *** Future versions of Libtool will require --mode=MODE be specified.: not found
../../libtool[7132]: Xppc-pld-linux-gcc: not found
../../libtool[7132]: X-DHAVE_CONFIG_H: not found
../../libtool[7132]: X-I.: not found
../../libtool[7132]: X-I../..: not found
../../libtool[7132]: X-I../../src: not found
../../libtool[7132]: X-I/usr/include/glib-2.0: not found
../../libtool[7132]: X-I/usr/lib/glib-2.0/include: not found
../../libtool[7132]: X-O2: not found
../../libtool[7132]: X-fsigned-char: not found
../../libtool[7132]: X-Wall: not found
../../libtool[7132]: X-I/usr/include/openssl: not found
../../libtool[7132]: X-MT: not found
../../libtool[7132]: Xget.lo: not found
../../libtool[7132]: X-MD: not found
../../libtool[7132]: X-MP: not found
../../libtool[7132]: X-MF: not found
../../libtool[7132]: X.deps/get.Tpo: not found
../../libtool[7132]: X-c: not found
../../libtool[7132]: Xget.lo: not found
../../libtool[7132]: libtool: compile: cannot determine name of library object from `': not found
make[3]: *** [get.lo] Error 1
make[3]: Leaving directory `/home/services/builder/rpm/BUILD/irssi/irssi-0.8.15/src/lib-config'
make[2]: *** [all-recursive] Error 1
make[2]: Leaving directory `/home/services/builder/rpm/BUILD/irssi/irssi-0.8.15/src'
make[1]: *** [all-recursive] Error 1
make[1]: Leaving directory `/home/services/builder/rpm/BUILD/irssi/irssi-0.8.15'
make: *** [all] Error 2
error: Bad exit status from /home/services/builder/rpm/BUILD/irssi/tmp/rpm-tmp.59993 (%build)


RPM build errors:
    Bad exit status from /home/services/builder/rpm/BUILD/irssi/tmp/rpm-tmp.59993 (%build)
ended at: Mon Apr 27 19:36:57 2015, done in 0:06:09.775175
error: No files produced.
Can't find java virtual machine, aborting.
+ rpmbuild --define '_topdir %(echo $HOME/rpm)' --define '_specdir %{_topdir}/packages/%{name}' --define '_sourcedir %{_specdir}' --define '_builddir %{_topdir}/BUILD/%{name}' --target ppc-pld-linux --nodeps --nobuild --clean --rmspec --rmsource rpm/packages/irssi/irssi.spec
Building target platforms: ppc-pld-linux
+ rm -rf /home/services/builder/rpm/BUILD/irssi/tmp
+ chmod -R u+rwX rpm/BUILD/irssi
+ rm -rf rpm/BUILD/irssi
Begin-PLD-Builder-Info
Build-Time: user:275.16s sys:110.90s real:415.95s (faults io:14 non-io:921738)

End-PLD-Builder-Info
[Back to list of logs] [View rpm -qa of builder]