FailedOk

th/SRPMS[OK]
th/x32[OK]
th/i686[OK]
th/x86_64[OK]

ac/SRPMS[OK]
ac/i386[OK]
ac/i586[OK]
ac/i686[OK]
ac/alpha[OK]
ac/amd64[OK]
ac/athlon[OK]
ac/ppc[OK]
ac/sparc[OK]
ac/sparc64[OK]

Advanced Search
main()
Powered by PLD Linux
(c) 2002-2024 PLD Team
$Revision: 1.37 $
Powered by nasi tu byli.
Your IP: 44.192.94.177

openslp 3e1a0be3-d061-4a67-b38d-194438c3e2c6

Status:Failed
Source URL:https://buildlogs.pld-linux.org/pld/ac/ppc/FAIL/openslp,3e1a0be3-d061-4a67-b38d-194438c3e2c6.bz2
text/plain URL:View!
full text:View!
rpm -qa of builder:View!
Date:2015/04/27 16:32:21
Runtime:0:06:39.853013

Toc:

  • error 1
  • make[2]: *** [slp_atomic.lo] Error 1
  • error 2
  • make[1]: *** [all-recursive] Error 1
  • error 3
  • error: Bad exit status from /home/services/builder/rpm/BUILD/openslp/tmp/rpm-tmp.48146 (%build)
  • error 4
  • RPM build errors:
  • error 5
  • error: No files produced.

Content:

checking for working memcmp... yes
checking sys/select.h usability... yes
checking sys/select.h presence... yes
checking for sys/select.h... yes
checking for sys/socket.h... (cached) yes
checking types of arguments for select... int,fd_set *,struct timeval *
checking for vprintf... yes
checking for _doprnt... no
checking for strchr... yes
checking for memcpy... yes
checking for strcasecmp... (cached) yes
checking for strdup... yes
checking for strtol... yes
checking for strerror... yes
checking for isascii... yes
checking for alarm... yes
checking for gethostname... yes
checking for gettimeofday... yes
checking for select... yes
checking for socket... yes
checking for poll... yes
checking for pthread_mutexattr_settype... yes
checking for pthread_mutexattr_setkind_np... yes
checking for DSA_sign in -lcrypto... yes
checking for inflate in -lz... yes
checking for dlopen in -ldl... yes
configure: creating ./config.status
config.status: creating Makefile
config.status: creating common/Makefile
config.status: creating libslpattr/Makefile
config.status: creating libslp/Makefile
config.status: creating slpd/Makefile
config.status: creating slptool/Makefile
config.status: creating etc/Makefile
config.status: creating doc/Makefile
config.status: creating doc/doxyfile
config.status: creating obs/Makefile
config.status: creating obs/debian.changelog
config.status: creating obs/debian.control
config.status: creating obs/debian.rules
config.status: creating obs/openslp.dsc
config.status: creating obs/openslp.spec
config.status: creating config.h
config.status: executing depfiles commands
config.status: executing libtool commands
------------------------------------------------------------

 OpenSLP Version 2.0.0 Configuration:

 Prefix: '/usr'.
 Compiler: 'ppc-pld-linux-gcc -O2 -fsigned-char  -Wall    -DLINUX'

 Package features:
   SLPv1 Messages: yes
   SLPv2 Security: yes
   SLP Async API:  yes
   SLP Predicates: yes
   Debugging:      no

 Now type 'make [prefix=<user-prefix>] [<target>]'
   where the optional <target> is:
     all                - build all binaries (default).
     docs               - build doxygen documentation.
     install            - install all binaries and data.

   additionally, on rpm-based systems only:
     rpmcheck           - check whether rpms may be built.
     srcrpm             - build only source rpm.
     rpms               - build source and binary rpms.

------------------------------------------------------------
+ /usr/bin/make -j1
/usr/bin/make  all-recursive
make[1]: Entering directory `/home/services/builder/rpm/BUILD/openslp/openslp-2.0.0'
Making all in common
make[2]: Entering directory `/home/services/builder/rpm/BUILD/openslp/openslp-2.0.0/common'
/bin/sh ../libtool --tag=CC   --mode=compile ppc-pld-linux-gcc -DHAVE_CONFIG_H -I. -I..   -DLINUX  -O2 -fsigned-char  -Wall   -MT slp_atomic.lo -MD -MP -MF .deps/slp_atomic.Tpo -c -o slp_atomic.lo slp_atomic.c
../libtool[1003]: X--tag=CC: not found
../libtool[1003]: libtool: ignoring unknown tag : not found
../libtool[1003]: X--mode=compile: not found
../libtool[7170]: *** Warning: inferring the mode of operation is deprecated.: not found
../libtool[7170]: *** Future versions of Libtool will require --mode=MODE be specified.: not found
../libtool[7170]: Xppc-pld-linux-gcc: not found
../libtool[7170]: X-DHAVE_CONFIG_H: not found
../libtool[7170]: X-I.: not found
../libtool[7170]: X-I..: not found
../libtool[7170]: X-DLINUX: not found
../libtool[7170]: X-O2: not found
../libtool[7170]: X-fsigned-char: not found
../libtool[7170]: X-Wall: not found
../libtool[7170]: X-MT: not found
../libtool[7170]: Xslp_atomic.lo: not found
../libtool[7170]: X-MD: not found
../libtool[7170]: X-MP: not found
../libtool[7170]: X-MF: not found
../libtool[7170]: X.deps/slp_atomic.Tpo: not found
../libtool[7170]: X-c: not found
../libtool[7170]: Xslp_atomic.lo: not found
../libtool[7170]: libtool: compile: cannot determine name of library object from `': not found
make[2]: *** [slp_atomic.lo] Error 1
make[2]: Leaving directory `/home/services/builder/rpm/BUILD/openslp/openslp-2.0.0/common'
make[1]: *** [all-recursive] Error 1
make[1]: Leaving directory `/home/services/builder/rpm/BUILD/openslp/openslp-2.0.0'
make: *** [all] Error 2
error: Bad exit status from /home/services/builder/rpm/BUILD/openslp/tmp/rpm-tmp.48146 (%build)


RPM build errors:
    Bad exit status from /home/services/builder/rpm/BUILD/openslp/tmp/rpm-tmp.48146 (%build)
ended at: Mon Apr 27 17:32:14 2015, done in 0:06:39.853013
error: No files produced.
Can't find java virtual machine, aborting.
+ rpmbuild --define '_topdir %(echo $HOME/rpm)' --define '_specdir %{_topdir}/packages/%{name}' --define '_sourcedir %{_specdir}' --define '_builddir %{_topdir}/BUILD/%{name}' --target ppc-pld-linux --nodeps --nobuild --clean --rmspec --rmsource rpm/packages/openslp/openslp.spec
Building target platforms: ppc-pld-linux
+ rm -rf /home/services/builder/rpm/BUILD/openslp/tmp
+ chmod -R u+rwX rpm/BUILD/openslp
+ rm -rf rpm/BUILD/openslp
Begin-PLD-Builder-Info
Build-Time: user:266.80s sys:131.16s real:436.46s (faults io:6 non-io:1000943)

End-PLD-Builder-Info
[Back to list of logs] [View rpm -qa of builder]