FailedOk

th/SRPMS[OK]
th/x32[OK]
th/i686[OK]
th/x86_64[OK]

ac/SRPMS[OK]
ac/i386[OK]
ac/i586[OK]
ac/i686[OK]
ac/alpha[OK]
ac/amd64[OK]
ac/athlon[OK]
ac/ppc[OK]
ac/sparc[OK]
ac/sparc64[OK]

Advanced Search
main()
Powered by PLD Linux
(c) 2002-2024 PLD Team
$Revision: 1.37 $
Powered by coffee.
Your IP: 3.235.182.206

php-ext-pimple 7fc5b610-7390-4336-8458-badb4b1fe06c

Status:Failed
Source URL:https://buildlogs.pld-linux.org/pld/ac/ppc/FAIL/php-ext-pimple,7fc5b610-7390-4336-8458-badb4b1fe06c.bz2
text/plain URL:View!
full text:View!
rpm -qa of builder:View!
Date:2015/05/08 21:34:51
Runtime:0:02:18.343267

Toc:

  • error 1
  • rpm: error: Failed build dependencies:
  • error 2
  • rpm: error: Failed build dependencies:
  • prep
  • Executing(%prep): env -i PATH=/bin:/usr/bin:/usr/local/bin:/usr/X11R6/bin:/home/services/builder/bin HOME=/home/services/builder TMP=/home/services/builder/tmp TMPDIR=/home/services/builder/rpm/BUILD/php-ext-pimple/tmp /bin/sh -e /home/services/builder/rpm/BUILD/php-ext-pimple/tmp/rpm-tmp.94059
  • build
  • Executing(%build): env -i PATH=/bin:/usr/bin:/usr/local/bin:/usr/X11R6/bin:/home/services/builder/bin HOME=/home/services/builder TMP=/home/services/builder/tmp TMPDIR=/home/services/builder/rpm/BUILD/php-ext-pimple/tmp /bin/sh -e /home/services/builder/rpm/BUILD/php-ext-pimple/tmp/rpm-tmp.1481
  • error 3
  • /home/services/builder/rpm/BUILD/php-ext-pimple/php-ext-pimple-3.0.0/pimple.c:161: error: `PHP_FE_END' undeclared here (not in a function)
  • error 4
  • /home/services/builder/rpm/BUILD/php-ext-pimple/php-ext-pimple-3.0.0/pimple.c:161: error: initializer element is not constant
  • error 5
  • /home/services/builder/rpm/BUILD/php-ext-pimple/php-ext-pimple-3.0.0/pimple.c:161: error: (near initialization for `pimple_ce_functions[11]')
  • error 6
  • /home/services/builder/rpm/BUILD/php-ext-pimple/php-ext-pimple-3.0.0/pimple.c:166: error: `PHP_FE_END' undeclared here (not in a function)
  • error 7
  • /home/services/builder/rpm/BUILD/php-ext-pimple/php-ext-pimple-3.0.0/pimple.c:166: error: initializer element is not constant
  • error 8
  • /home/services/builder/rpm/BUILD/php-ext-pimple/php-ext-pimple-3.0.0/pimple.c:166: error: (near initialization for `pimple_closure_ce_functions[1]')
  • error 9
  • /home/services/builder/rpm/BUILD/php-ext-pimple/php-ext-pimple-3.0.0/pimple.c:171: error: `PHP_FE_END' undeclared here (not in a function)
  • error 10
  • /home/services/builder/rpm/BUILD/php-ext-pimple/php-ext-pimple-3.0.0/pimple.c:171: error: initializer element is not constant
  • error 11
  • /home/services/builder/rpm/BUILD/php-ext-pimple/php-ext-pimple-3.0.0/pimple.c:171: error: (near initialization for `pimple_serviceprovider_iface_ce_functions[1]')
  • error 12
  • /home/services/builder/rpm/BUILD/php-ext-pimple/php-ext-pimple-3.0.0/pimple.c:426: error: structure has no member named `object_ptr'
  • error 13
  • /home/services/builder/rpm/BUILD/php-ext-pimple/php-ext-pimple-3.0.0/pimple.c:426: error: structure has no member named `object_ptr'
  • error 14
  • /home/services/builder/rpm/BUILD/php-ext-pimple/php-ext-pimple-3.0.0/pimple.c:439: error: structure has no member named `object_ptr'
  • error 15
  • /home/services/builder/rpm/BUILD/php-ext-pimple/php-ext-pimple-3.0.0/pimple.c:439: error: structure has no member named `object_ptr'
  • error 16
  • /home/services/builder/rpm/BUILD/php-ext-pimple/php-ext-pimple-3.0.0/pimple.c:454: error: structure has no member named `called_scope'
  • error 17
  • /home/services/builder/rpm/BUILD/php-ext-pimple/php-ext-pimple-3.0.0/pimple.c:458: error: structure has no member named `get_closure'
  • error 18
  • /home/services/builder/rpm/BUILD/php-ext-pimple/php-ext-pimple-3.0.0/pimple.c:458: error: structure has no member named `get_closure'
  • error 19
  • /home/services/builder/rpm/BUILD/php-ext-pimple/php-ext-pimple-3.0.0/pimple.c:458: error: structure has no member named `object_ptr'
  • error 20
  • /home/services/builder/rpm/BUILD/php-ext-pimple/php-ext-pimple-3.0.0/pimple.c:459: error: structure has no member named `called_scope'
  • error 21
  • error: Bad exit status from /home/services/builder/rpm/BUILD/php-ext-pimple/tmp/rpm-tmp.1481 (%build)
  • error 22
  • RPM build errors:
  • error 23
  • error: No files produced.

Content:

checking if we should skip the build
started at: Fri May  8 22:30:15 2015
fetching http://src.ac.pld-linux.org/~buildsrc//srpms/7fc5b610-7390-4336-8458-badb4b1fe06c/php-ext-pimple-3.0.0-1.src.rpm
fetched 30283 bytes, 9.9 K/s
installing srpm: php-ext-pimple-3.0.0-1.src.rpm
Can't find java virtual machine, aborting.
+ install -d rpm/packages/php-ext-pimple rpm/BUILD/php-ext-pimple
+ rpm -Uhv --define '_topdir %(echo $HOME/rpm)' --define '_specdir %{_topdir}/packages/%{name}' --define '_sourcedir %{_specdir}' --define '_builddir %{_topdir}/BUILD/%{name}' php-ext-pimple-3.0.0-1.src.rpm
warning: php-ext-pimple-3.0.0-1.src.rpm: Header V4 DSA signature: NOKEY, key ID 793aa535
php-ext-pimple              ##################################################
+ rm -f php-ext-pimple-3.0.0-1.src.rpm
Can't find java virtual machine, aborting.
+ TMPDIR=/home/services/builder/rpm/BUILD/php-ext-pimple/tmp
+ exec nice -n 0 rpmbuild -bp --short-circuit --nodeps --define '_topdir %(echo $HOME/rpm)' --define '_specdir %{_topdir}/packages/%{name}' --define '_sourcedir %{_specdir}' --define '_builddir %{_topdir}/BUILD/%{name}' --target ppc-pld-linux --define 'prep exit 0' rpm/packages/php-ext-pimple/php-ext-pimple.spec
sh: php-config: not found
Building target platforms: ppc-pld-linux
checking BuildConflict-ing packages
no BuildConflicts found
checking BR
rpm: sh: php-config: not found
rpm: error: Failed build dependencies:
rpm: 	php-devel is needed by php-ext-pimple-3.0.0-1.src
rpm: Building target platforms: ppc-pld-linux
updating poldek cache...
Can't find java virtual machine, aborting.

Retrieving ac-main::packages.ndir.md...
ac-main is up to date

Retrieving ac-updates::packages.ndir.md...
ac-updates is up to date

Retrieving okas::packages.ndir.md...
okas is up to date
checking conflicting packages in BRed packages
poldek: Loading [pndir]okas...
poldek: Loading [dir]ready...
poldek: Loading [pndir]ac-main...
poldek: Loading [pndir]ac-updates...
poldek: 19210 packages read
poldek: Removed 4148 duplicate packages from available set
poldek: Processing dependencies...
poldek: There are 1 package to install:
poldek: I php-devel-5.2.17-20130717.8
poldek: This operation will use 2.4MB of disk space.
poldek: Need to get 387.5KB of archives (387.5KB to download).
poldek: 
poldek: Retrieving ac-updates::php-devel-5.2.17-20130717.8.ppc.rpm...
poldek: ..............................done
poldek: Executing rpm --upgrade -vh --test --root / --define _check_dirname_deps 0...
poldek: Preparing...                ##################################################
no conflicts found
checking BR
rpm: sh: php-config: not found
rpm: error: Failed build dependencies:
rpm: 	php-devel is needed by php-ext-pimple-3.0.0-1.src
rpm: Building target platforms: ppc-pld-linux
installing BR: php\-devel
Can't find java virtual machine, aborting.
Loading [pndir]okas...
Loading [dir]ready...
Loading [pndir]ac-main...
Loading [pndir]ac-updates...
19210 packages read
Removed 4148 duplicate packages from available set
Processing dependencies...
There are 1 package to install:
I php-devel-5.2.17-20130717.8
This operation will use 2.4MB of disk space.
Need to get 387.5KB of archives. 
Executing rpm --upgrade -vh --root / --define _check_dirname_deps 0...
Preparing...                ##################################################
php-devel                   ##################################################
building RPM using: set -ex; : build-id: 7fc5b610-7390-4336-8458-badb4b1fe06c; TMPDIR=/home/services/builder/rpm/BUILD/php-ext-pimple/tmp exec nice -n 0 rpmbuild -bb --define '_smp_mflags -j1' --define '_topdir %(echo $HOME/rpm)' --define '_specdir %{_topdir}/packages/%{name}' --define '_sourcedir %{_specdir}' --define '_builddir %{_topdir}/BUILD/%{name}'  --target ppc-pld-linux rpm/packages/php-ext-pimple/php-ext-pimple.spec
Can't find java virtual machine, aborting.
+ : build-id: 7fc5b610-7390-4336-8458-badb4b1fe06c
+ TMPDIR=/home/services/builder/rpm/BUILD/php-ext-pimple/tmp
+ exec nice -n 0 rpmbuild -bb --define '_smp_mflags -j1' --define '_topdir %(echo $HOME/rpm)' --define '_specdir %{_topdir}/packages/%{name}' --define '_sourcedir %{_specdir}' --define '_builddir %{_topdir}/BUILD/%{name}' --target ppc-pld-linux rpm/packages/php-ext-pimple/php-ext-pimple.spec
Building target platforms: ppc-pld-linux
Executing(%prep): env -i PATH=/bin:/usr/bin:/usr/local/bin:/usr/X11R6/bin:/home/services/builder/bin HOME=/home/services/builder TMP=/home/services/builder/tmp TMPDIR=/home/services/builder/rpm/BUILD/php-ext-pimple/tmp  /bin/sh -e /home/services/builder/rpm/BUILD/php-ext-pimple/tmp/rpm-tmp.94059
+ umask 022
+ cd /home/services/builder/rpm/BUILD/php-ext-pimple
+ cd /home/services/builder/rpm/BUILD/php-ext-pimple
+ rm -rf php-ext-pimple-3.0.0
+ /bin/mkdir -p php-ext-pimple-3.0.0
+ cd php-ext-pimple-3.0.0
+ /bin/gzip -dc /home/services/builder/rpm/packages/php-ext-pimple/pimple-3.0.0.tar.gz
+ tar -xf -
+ STATUS=0
+ [ 0 -ne 0 ]
+ /bin/id -u
+ [ 182 = 0 ]
+ true .
+ /bin/chmod -Rf -Rf a+rX,u+w,g-w,o-w .
+ mv Pimple-3.0.0/ext/pimple/README.md Pimple-3.0.0/ext/pimple/config.m4 Pimple-3.0.0/ext/pimple/config.w32 Pimple-3.0.0/ext/pimple/php_pimple.h Pimple-3.0.0/ext/pimple/pimple.c Pimple-3.0.0/ext/pimple/pimple_compat.h Pimple-3.0.0/ext/pimple/tests .
+ /bin/rm --interactive=never tests/015.phpt
+ exit 0
Executing(%build): env -i PATH=/bin:/usr/bin:/usr/local/bin:/usr/X11R6/bin:/home/services/builder/bin HOME=/home/services/builder TMP=/home/services/builder/tmp TMPDIR=/home/services/builder/rpm/BUILD/php-ext-pimple/tmp  /bin/sh -e /home/services/builder/rpm/BUILD/php-ext-pimple/tmp/rpm-tmp.1481
PATH=/bin:/usr/bin:/usr/local/bin:/usr/X11R6/bin:/home/services/builder/bin
HOME=/home/services/builder
TMP=/home/services/builder/tmp
TMPDIR=/home/services/builder/rpm/BUILD/php-ext-pimple/tmp
+ umask 022
+ cd /home/services/builder/rpm/BUILD/php-ext-pimple
+ cd php-ext-pimple-3.0.0
+ phpize
Configuring for:
PHP Api Version:         20041225
Zend Module Api No:      20060613
Zend Extension Api No:   220060519
configure.in:3: warning: prefer named diversions
configure.in:3: warning: prefer named diversions
+ ./configure LDFLAGS=-Wl,--as-needed  CFLAGS=-O2 -fsigned-char  CXXFLAGS=-O2 -fsigned-char  FFLAGS=-O2 -fsigned-char  FCFLAGS=-O2 -fsigned-char  CPPFLAGS= CC=ppc-pld-linux-gcc CXX=ppc-pld-linux-g++ --host=ppc-pld-linux --build=ppc-pld-linux --prefix=/usr --exec-prefix=/usr --bindir=/usr/bin --sbindir=/usr/sbin --sysconfdir=/etc --datadir=/usr/share --includedir=/usr/include --libdir=/usr/lib --libexecdir=/usr/lib --localstatedir=/var --sharedstatedir=/var/lib --mandir=/usr/share/man --infodir=/usr/share/info --x-libraries=/usr/X11R6/lib
checking for grep that handles long lines and -e... /bin/grep
checking for egrep... /bin/grep -E
checking for a sed that does not truncate output... /bin/sed
checking for ppc-pld-linux-cc... ppc-pld-linux-gcc
checking whether the C compiler works... yes
checking for C compiler default output file name... a.out
checking for suffix of executables... 
checking whether we are cross compiling... no
checking for suffix of object files... o
checking whether we are using the GNU C compiler... yes
checking whether ppc-pld-linux-gcc accepts -g... yes
checking for ppc-pld-linux-gcc option to accept ISO C89... none needed
checking how to run the C preprocessor... ppc-pld-linux-gcc -E
checking for icc... no
checking for suncc... no
checking whether ppc-pld-linux-gcc and cc understand -c and -o together... yes
checking for system library directory... lib
checking if compiler supports -R... no
checking if compiler supports -Wl,-rpath,... yes
checking build system type... powerpc-pld-linux-gnu
checking host system type... powerpc-pld-linux-gnu
checking target system type... powerpc-pld-linux-gnu
checking for PHP prefix... /usr
checking for PHP includes... -I/usr/include/php -I/usr/include/php/main -I/usr/include/php/TSRM -I/usr/include/php/Zend -I/usr/include/php/ext -I/usr/include/php/ext/date/lib
checking for PHP extension directory... /usr/lib/php
checking for PHP installed headers prefix... /usr/include/php
checking if debug is enabled... no
checking if zts is enabled... no
checking for re2c... re2c
checking for re2c version... 0.13.5 (ok)
checking for gawk... gawk
checking whether to enable pimple support... yes, shared
checking for ld used by ppc-pld-linux-gcc... /usr/bin/ld
checking if the linker (/usr/bin/ld) is GNU ld... yes
checking for /usr/bin/ld option to reload object files... -r
checking for BSD-compatible nm... /usr/bin/nm -B
checking whether ln -s works... yes
checking how to recognize dependent libraries... pass_all
checking for ANSI C header files... yes
checking for sys/types.h... yes
checking for sys/stat.h... yes
checking for stdlib.h... yes
checking for string.h... yes
checking for memory.h... yes
checking for strings.h... yes
checking for inttypes.h... yes
checking for stdint.h... yes
checking for unistd.h... yes
checking dlfcn.h usability... yes
checking dlfcn.h presence... yes
checking for dlfcn.h... yes
checking for ppc-pld-linux-g77... no
checking for ppc-pld-linux-xlf... no
checking for ppc-pld-linux-f77... no
checking for ppc-pld-linux-frt... no
checking for ppc-pld-linux-pgf77... no
checking for ppc-pld-linux-cf77... no
checking for ppc-pld-linux-fort77... no
checking for ppc-pld-linux-fl32... no
checking for ppc-pld-linux-af77... no
checking for ppc-pld-linux-xlf90... no
checking for ppc-pld-linux-f90... no
checking for ppc-pld-linux-pgf90... no
checking for ppc-pld-linux-pghpf... no
checking for ppc-pld-linux-epcf90... no
checking for ppc-pld-linux-gfortran... no
checking for ppc-pld-linux-g95... no
checking for ppc-pld-linux-xlf95... no
checking for ppc-pld-linux-f95... no
checking for ppc-pld-linux-fort... no
checking for ppc-pld-linux-ifort... no
checking for ppc-pld-linux-ifc... no
checking for ppc-pld-linux-efc... no
checking for ppc-pld-linux-pgfortran... no
checking for ppc-pld-linux-pgf95... no
checking for ppc-pld-linux-lf95... no
checking for ppc-pld-linux-ftn... no
checking for g77... no
checking for xlf... no
checking for f77... no
checking for frt... no
checking for pgf77... no
checking for cf77... no
checking for fort77... no
checking for fl32... no
checking for af77... no
checking for xlf90... no
checking for f90... no
checking for pgf90... no
checking for pghpf... no
checking for epcf90... no
checking for gfortran... no
checking for g95... no
checking for xlf95... no
checking for f95... no
checking for fort... no
checking for ifort... no
checking for ifc... no
checking for efc... no
checking for pgfortran... no
checking for pgf95... no
checking for lf95... no
checking for ftn... no
checking whether we are using the GNU Fortran 77 compiler... no
checking whether  accepts -g... no
checking the maximum length of command line arguments... 98304
checking command to parse /usr/bin/nm -B output from ppc-pld-linux-gcc object... ok
checking for objdir... .libs
checking for ppc-pld-linux-ar... no
checking for ar... ar
checking for ppc-pld-linux-ranlib... no
checking for ranlib... ranlib
checking for ppc-pld-linux-strip... no
checking for strip... strip
checking if ppc-pld-linux-gcc supports -fno-rtti -fno-exceptions... no
checking for ppc-pld-linux-gcc option to produce PIC... -fPIC
checking if ppc-pld-linux-gcc PIC flag -fPIC works... yes
checking if ppc-pld-linux-gcc static flag -static works... no
checking if ppc-pld-linux-gcc supports -c -o file.o... yes
checking whether the ppc-pld-linux-gcc linker (/usr/bin/ld) supports shared libraries... yes
checking whether -lc should be explicitly linked in... no
checking dynamic linker characteristics... GNU/Linux ld.so
checking how to hardcode library paths into programs... immediate
checking whether stripping libraries is possible... yes
checking if libtool supports shared libraries... yes
checking whether to build shared libraries... yes
checking whether to build static libraries... no
configure: creating libtool
appending configuration tag "CXX" to libtool
checking whether the ppc-pld-linux-g++ linker (/usr/bin/ld) supports shared libraries... yes
checking for ppc-pld-linux-g++ option to produce PIC... 
checking if ppc-pld-linux-g++ static flag  works... yes
checking if ppc-pld-linux-g++ supports -c -o file.o... yes
checking whether the ppc-pld-linux-g++ linker (/usr/bin/ld) supports shared libraries... yes
checking dynamic linker characteristics... GNU/Linux ld.so
(cached) (cached) checking how to hardcode library paths into programs... unsupported
appending configuration tag "F77" to libtool
configure: creating ./config.status
config.status: creating config.h
+ /usr/bin/make -j1
/bin/sh /home/services/builder/rpm/BUILD/php-ext-pimple/php-ext-pimple-3.0.0/libtool --mode=compile ppc-pld-linux-gcc  -I. -I/home/services/builder/rpm/BUILD/php-ext-pimple/php-ext-pimple-3.0.0 -DPHP_ATOM_INC -I/home/services/builder/rpm/BUILD/php-ext-pimple/php-ext-pimple-3.0.0/include -I/home/services/builder/rpm/BUILD/php-ext-pimple/php-ext-pimple-3.0.0/main -I/home/services/builder/rpm/BUILD/php-ext-pimple/php-ext-pimple-3.0.0 -I/usr/include/php -I/usr/include/php/main -I/usr/include/php/TSRM -I/usr/include/php/Zend -I/usr/include/php/ext -I/usr/include/php/ext/date/lib  -DHAVE_CONFIG_H  -O2 -fsigned-char   -c /home/services/builder/rpm/BUILD/php-ext-pimple/php-ext-pimple-3.0.0/pimple.c -o pimple.lo 
mkdir .libs
 ppc-pld-linux-gcc -I. -I/home/services/builder/rpm/BUILD/php-ext-pimple/php-ext-pimple-3.0.0 -DPHP_ATOM_INC -I/home/services/builder/rpm/BUILD/php-ext-pimple/php-ext-pimple-3.0.0/include -I/home/services/builder/rpm/BUILD/php-ext-pimple/php-ext-pimple-3.0.0/main -I/home/services/builder/rpm/BUILD/php-ext-pimple/php-ext-pimple-3.0.0 -I/usr/include/php -I/usr/include/php/main -I/usr/include/php/TSRM -I/usr/include/php/Zend -I/usr/include/php/ext -I/usr/include/php/ext/date/lib -DHAVE_CONFIG_H -O2 -fsigned-char -c /home/services/builder/rpm/BUILD/php-ext-pimple/php-ext-pimple-3.0.0/pimple.c  -fPIC -DPIC -o .libs/pimple.o
/home/services/builder/rpm/BUILD/php-ext-pimple/php-ext-pimple-3.0.0/pimple.c:161: error: `PHP_FE_END' undeclared here (not in a function)
/home/services/builder/rpm/BUILD/php-ext-pimple/php-ext-pimple-3.0.0/pimple.c:161: error: initializer element is not constant
/home/services/builder/rpm/BUILD/php-ext-pimple/php-ext-pimple-3.0.0/pimple.c:161: error: (near initialization for `pimple_ce_functions[11]')
/home/services/builder/rpm/BUILD/php-ext-pimple/php-ext-pimple-3.0.0/pimple.c:166: error: `PHP_FE_END' undeclared here (not in a function)
/home/services/builder/rpm/BUILD/php-ext-pimple/php-ext-pimple-3.0.0/pimple.c:166: error: initializer element is not constant
/home/services/builder/rpm/BUILD/php-ext-pimple/php-ext-pimple-3.0.0/pimple.c:166: error: (near initialization for `pimple_closure_ce_functions[1]')
/home/services/builder/rpm/BUILD/php-ext-pimple/php-ext-pimple-3.0.0/pimple.c:171: error: `PHP_FE_END' undeclared here (not in a function)
/home/services/builder/rpm/BUILD/php-ext-pimple/php-ext-pimple-3.0.0/pimple.c:171: error: initializer element is not constant
/home/services/builder/rpm/BUILD/php-ext-pimple/php-ext-pimple-3.0.0/pimple.c:171: error: (near initialization for `pimple_serviceprovider_iface_ce_functions[1]')
/home/services/builder/rpm/BUILD/php-ext-pimple/php-ext-pimple-3.0.0/pimple.c: In function `pimple_object_read_dimension':
/home/services/builder/rpm/BUILD/php-ext-pimple/php-ext-pimple-3.0.0/pimple.c:426: error: structure has no member named `object_ptr'
/home/services/builder/rpm/BUILD/php-ext-pimple/php-ext-pimple-3.0.0/pimple.c:426: error: structure has no member named `object_ptr'
/home/services/builder/rpm/BUILD/php-ext-pimple/php-ext-pimple-3.0.0/pimple.c:439: error: structure has no member named `object_ptr'
/home/services/builder/rpm/BUILD/php-ext-pimple/php-ext-pimple-3.0.0/pimple.c:439: error: structure has no member named `object_ptr'
/home/services/builder/rpm/BUILD/php-ext-pimple/php-ext-pimple-3.0.0/pimple.c: In function `pimple_zval_is_valid_callback':
/home/services/builder/rpm/BUILD/php-ext-pimple/php-ext-pimple-3.0.0/pimple.c:454: error: structure has no member named `called_scope'
/home/services/builder/rpm/BUILD/php-ext-pimple/php-ext-pimple-3.0.0/pimple.c:458: error: structure has no member named `get_closure'
/home/services/builder/rpm/BUILD/php-ext-pimple/php-ext-pimple-3.0.0/pimple.c:458: error: structure has no member named `get_closure'
/home/services/builder/rpm/BUILD/php-ext-pimple/php-ext-pimple-3.0.0/pimple.c:458: error: structure has no member named `object_ptr'
/home/services/builder/rpm/BUILD/php-ext-pimple/php-ext-pimple-3.0.0/pimple.c:459: error: structure has no member named `called_scope'
make: *** [pimple.lo] Error 1
error: Bad exit status from /home/services/builder/rpm/BUILD/php-ext-pimple/tmp/rpm-tmp.1481 (%build)


RPM build errors:
    Bad exit status from /home/services/builder/rpm/BUILD/php-ext-pimple/tmp/rpm-tmp.1481 (%build)
ended at: Fri May  8 22:34:42 2015, done in 0:02:18.343267
error: No files produced.
Can't find java virtual machine, aborting.
+ rpmbuild --define '_topdir %(echo $HOME/rpm)' --define '_specdir %{_topdir}/packages/%{name}' --define '_sourcedir %{_specdir}' --define '_builddir %{_topdir}/BUILD/%{name}' --target ppc-pld-linux --nodeps --nobuild --clean --rmspec --rmsource rpm/packages/php-ext-pimple/php-ext-pimple.spec
Building target platforms: ppc-pld-linux
+ rm -rf /home/services/builder/rpm/BUILD/php-ext-pimple/tmp
+ chmod -R u+rwX rpm/BUILD/php-ext-pimple
+ rm -rf rpm/BUILD/php-ext-pimple
Begin-PLD-Builder-Info
Build-Time: user:169.44s sys:91.52s real:276.17s (faults io:52 non-io:696736)

End-PLD-Builder-Info
[Back to list of logs] [View rpm -qa of builder]