FailedOk

th/SRPMS[OK]
th/x32[OK]
th/i686[OK]
th/x86_64[OK]

ac/SRPMS[OK]
ac/i386[OK]
ac/i586[OK]
ac/i686[OK]
ac/alpha[OK]
ac/amd64[OK]
ac/athlon[OK]
ac/ppc[OK]
ac/sparc[OK]
ac/sparc64[OK]

Advanced Search
main()
Powered by PLD Linux
(c) 2002-2023 PLD Team
$Revision: 1.37 $
Powered by Real Programmer.
Your IP: 44.192.38.49

bacula bb3cd997-09cc-423d-b697-4003d6172948

Status:Failed
Source URL:https://buildlogs.pld-linux.org/pld/ac/sparc/FAIL/bacula,bb3cd997-09cc-423d-b697-4003d6172948.bz2
text/plain URL:View!
full text:View!
rpm -qa of builder:View!
Date:2015/02/06 01:07:00
Runtime:0:00:59.374228

Toc:

  • error 1
  • rpm: error: Failed build dependencies:
  • error 2
  • rpm: error: Failed build dependencies:
  • error 3
  • error: db4 error(-30975) from dbenv->failchk: DB_RUNRECOVERY: Fatal error, run database recovery
  • error 4
  • error: Runnning db->verify ...
  • error 5
  • error: Failed build dependencies:
  • error 6
  • error: No files produced.

Content:

checking if we should skip the build
started at: Fri Feb  6 01:54:13 2015
fetching http://src.ac.pld-linux.org/~buildsrc//srpms/bb3cd997-09cc-423d-b697-4003d6172948/bacula-5.2.6-2.src.rpm
fetched 51167157 bytes, 581.2 K/s
installing srpm: bacula-5.2.6-2.src.rpm
+ install -d /tmp/B.c1bb0875-486e-4247-a293-e91a40b1a7f3/BUILD /tmp/B.c1bb0875-486e-4247-a293-e91a40b1a7f3/RPMS
+ rpm -Uhv --nodeps --define '_topdir /tmp/B.c1bb0875-486e-4247-a293-e91a40b1a7f3' --define '_specdir %{_topdir}' --define '_sourcedir %{_specdir}' --define '_rpmdir %{_topdir}/RPMS' --define '_builddir %{_topdir}/BUILD' bacula-5.2.6-2.src.rpm
warning: bacula-5.2.6-2.src.rpm: Header V4 DSA signature: NOKEY, key ID 1e92f5eb
bacula                      ##################################################
+ rm -f bacula-5.2.6-2.src.rpm
+ install -m 700 -d /tmp/B.c1bb0875-486e-4247-a293-e91a40b1a7f3/BUILD/tmp
+ TMPDIR=/tmp/B.c1bb0875-486e-4247-a293-e91a40b1a7f3/BUILD/tmp
+ exec nice -n 0 rpmbuild -bp --short-circuit --nodeps --define '_topdir /tmp/B.c1bb0875-486e-4247-a293-e91a40b1a7f3' --define '_specdir %{_topdir}' --define '_sourcedir %{_specdir}' --define '_rpmdir %{_topdir}/RPMS' --define '_builddir %{_topdir}/BUILD' --target sparc-pld-linux --define 'prep exit 0' /tmp/B.c1bb0875-486e-4247-a293-e91a40b1a7f3/bacula.spec
Building target platforms: sparc-pld-linux
checking BuildConflict-ing packages
no BuildConflicts found
checking BR
rpm: error: Failed build dependencies:
rpm: 	libtool >= 2:2.2 is needed by bacula-5.2.6-2.src
rpm: 	wxGTK2-unicode-devel >= 2.4.0 is needed by bacula-5.2.6-2.src
rpm: Building target platforms: sparc-pld-linux
updating poldek cache...

Retrieving ac-main::packages.ndir.md...
ac-main is up to date

Retrieving ac-updates::packages.ndir.md...
ac-updates is up to date

Retrieving okas::packages.ndir.md...
okas is up to date
checking conflicting packages in BRed packages
poldek: Loading [pndir]okas...
poldek: Loading [dir]ready...
poldek: 200..400..402
poldek: Loading [pndir]ac-main...
poldek: Loading [pndir]ac-updates...
poldek: 19388 packages read
poldek: Removed 4500 duplicate packages from available set
poldek: libtool-1.5.26-2.sparc: equal version installed, skipped
poldek: Processing dependencies...
poldek: wxGTK2-unicode-devel-2.6.2-2.sparc marks wxBase-unicode-devel-2.6.2-2.sparc (cap wxBase-unicode-devel = 2.6.2-2)
poldek:  wxBase-unicode-devel-2.6.2-2.sparc marks wxWidgets-devel-2.6.2-2.sparc (cap wxWidgets-devel = 2.6.2-2)
poldek: There are 3 packages to install (2 marked by dependencies):
poldek: I wxGTK2-unicode-devel-2.6.2-2.sparc
poldek: D wxBase-unicode-devel-2.6.2-2.sparc  wxWidgets-devel-2.6.2-2.sparc
poldek: This operation will use 4.3MB of disk space.
poldek: Need to get 881.3KB of archives (881.3KB to download).
poldek: 
poldek: Retrieving [1/3] ac-main::wxWidgets-devel-2.6.2-2.sparc.rpm...
poldek: ..............................done
poldek: Retrieving [2/3] ac-main::wxBase-unicode-devel-2.6.2-2.sparc.rpm...
poldek: ..............................done
poldek: Retrieving [3/3] ac-main::wxGTK2-unicode-devel-2.6.2-2.sparc.rpm...
poldek: ..............................done
no conflicts found
checking BR
rpm: error: Failed build dependencies:
rpm: 	libtool >= 2:2.2 is needed by bacula-5.2.6-2.src
rpm: 	wxGTK2-unicode-devel >= 2.4.0 is needed by bacula-5.2.6-2.src
rpm: Building target platforms: sparc-pld-linux
installing BR: wxGTK2\-unicode\-devel libtool
Loading [pndir]okas...
Loading [dir]ready...
200..400..402
Loading [pndir]ac-main...
Loading [pndir]ac-updates...
19388 packages read
Removed 4500 duplicate packages from available set
rpmdb: Thread/process 13454/0 failed: Thread died in Berkeley DB library
error: db4 error(-30975) from dbenv->failchk: DB_RUNRECOVERY: Fatal error, run database recovery
error: Runnning db->verify ...
libtool-1.5.26-2.sparc: equal version installed, skipped
Processing dependencies...
wxGTK2-unicode-devel-2.6.2-2.sparc marks wxBase-unicode-devel-2.6.2-2.sparc (cap wxBase-unicode-devel = 2.6.2-2)
 wxBase-unicode-devel-2.6.2-2.sparc marks wxWidgets-devel-2.6.2-2.sparc (cap wxWidgets-devel = 2.6.2-2)
There are 3 packages to install (2 marked by dependencies):
I wxGTK2-unicode-devel-2.6.2-2.sparc
D wxBase-unicode-devel-2.6.2-2.sparc  wxWidgets-devel-2.6.2-2.sparc
This operation will use 4.3MB of disk space.
Need to get 881.3KB of archives. 
Executing rpm --upgrade -vh --root / --define _check_dirname_deps 0...
Preparing...                ##################################################
wxWidgets-devel             ##################################################
wxBase-unicode-devel        ##################################################
wxGTK2-unicode-devel        ##################################################
building RPM using: set -ex; : build-id: bb3cd997-09cc-423d-b697-4003d6172948; TMPDIR=/tmp/B.c1bb0875-486e-4247-a293-e91a40b1a7f3/BUILD/tmp exec nice -n 0 rpmbuild -bb --define '_smp_mflags -j1' --define '_pld_builder 1' --define '_topdir /tmp/B.c1bb0875-486e-4247-a293-e91a40b1a7f3' --define '_specdir %{_topdir}' --define '_sourcedir %{_specdir}' --define '_rpmdir %{_topdir}/RPMS' --define '_builddir %{_topdir}/BUILD'  --target sparc-pld-linux /tmp/B.c1bb0875-486e-4247-a293-e91a40b1a7f3/bacula.spec
+ : build-id: bb3cd997-09cc-423d-b697-4003d6172948
+ TMPDIR=/tmp/B.c1bb0875-486e-4247-a293-e91a40b1a7f3/BUILD/tmp
+ exec nice -n 0 rpmbuild -bb --define '_smp_mflags -j1' --define '_pld_builder 1' --define '_topdir /tmp/B.c1bb0875-486e-4247-a293-e91a40b1a7f3' --define '_specdir %{_topdir}' --define '_sourcedir %{_specdir}' --define '_rpmdir %{_topdir}/RPMS' --define '_builddir %{_topdir}/BUILD' --target sparc-pld-linux /tmp/B.c1bb0875-486e-4247-a293-e91a40b1a7f3/bacula.spec
error: Failed build dependencies:
	libtool >= 2:2.2 is needed by bacula-5.2.6-2.src
Building target platforms: sparc-pld-linux
ended at: Fri Feb  6 02:06:54 2015, done in 0:00:59.374228
error: No files produced.
+ chmod -R u+rwX /tmp/B.c1bb0875-486e-4247-a293-e91a40b1a7f3/BUILD
+ rm -rf /tmp/B.c1bb0875-486e-4247-a293-e91a40b1a7f3/tmp /tmp/B.c1bb0875-486e-4247-a293-e91a40b1a7f3/BUILD
+ rm -rf /tmp/B.c1bb0875-486e-4247-a293-e91a40b1a7f3
Begin-PLD-Builder-Info
Build-Time: user:353.00s sys:113.08s real:768.60s (faults io:82 non-io:262464)

End-PLD-Builder-Info
[Back to list of logs] [View rpm -qa of builder]