Advanced Search
Powered by PLD Linux
(c) 2002-2024 PLD Team
$Revision: 1.37 $
Powered by x-files.
Your IP:

nfs-utils 7e87ca93-14d3-4f1f-b622-88e276265992

Source URL:,7e87ca93-14d3-4f1f-b622-88e276265992.bz2
text/plain URL:View!
full text:View!
rpm -qa of builder:View!
Date:2016/01/05 10:59:25


  • error 1
  • getkversion.c:17: error: `UTS_RELEASE' undeclared (first use in this function)
  • error 2
  • getkversion.c:17: error: (Each undeclared identifier is reported only once
  • error 3
  • getkversion.c:17: error: for each function it appears in.)
  • error 4
  • make[2]: *** [getkversion-getkversion.o] Error 1
  • error 5
  • make[1]: *** [all-recursive] Error 1
  • error 6
  • error: Bad exit status from /tmp/rpm-tmp.8474 (%build)
  • error 7
  • RPM build errors:
  • error 8
  • error: No files produced.


checking whether sys/types.h defines makedev... yes
checking for working memcmp... yes
checking sys/select.h usability... yes
checking sys/select.h presence... yes
checking for sys/select.h... yes
checking for sys/socket.h... (cached) yes
checking types of arguments for select... int,fd_set *,struct timeval *
checking return type of signal handlers... void
checking whether stat accepts an empty string... no
checking for vprintf... yes
checking for _doprnt... no
checking for alarm... yes
checking for atexit... yes
checking for dup2... yes
checking for fdatasync... yes
checking for ftruncate... yes
checking for getcwd... yes
checking for gethostbyaddr... yes
checking for gethostbyname... (cached) yes
checking for gethostname... yes
checking for getmntent... (cached) yes
checking for gettimeofday... yes
checking for hasmntopt... yes
checking for inet_ntoa... yes
checking for innetgr... yes
checking for memset... yes
checking for mkdir... yes
checking for pathconf... yes
checking for realpath... yes
checking for rmdir... yes
checking for select... yes
checking for socket... (cached) yes
checking for strcasecmp... yes
checking for strchr... yes
checking for strdup... yes
checking for strerror... yes
checking for strrchr... yes
checking for strtol... yes
checking for strtoul... yes
checking for sigprocmask... yes
checking size of short... 2
checking size of int... 4
checking size of long... 4
checking size of size_t... 4
checking size of socklen_t... 4
configure: creating ./config.status
config.status: creating Makefile
config.status: creating linux-nfs/Makefile
config.status: creating support/Makefile
config.status: creating support/export/Makefile
config.status: creating support/include/nfs/Makefile
config.status: creating support/include/rpcsvc/Makefile
config.status: creating support/include/sys/fs/Makefile
config.status: creating support/include/sys/Makefile
config.status: creating support/include/Makefile
config.status: creating support/misc/Makefile
config.status: creating support/nfs/Makefile
config.status: creating tools/Makefile
config.status: creating tools/getiversion/Makefile
config.status: creating tools/getkversion/Makefile
config.status: creating tools/locktest/Makefile
config.status: creating tools/nlmtest/Makefile
config.status: creating tools/rpcdebug/Makefile
config.status: creating tools/rpcgen/Makefile
config.status: creating utils/Makefile
config.status: creating utils/exportfs/Makefile
config.status: creating utils/gssd/Makefile
config.status: creating utils/idmapd/Makefile
config.status: creating utils/lockd/Makefile
config.status: creating utils/mount/Makefile
config.status: creating utils/mountd/Makefile
config.status: creating utils/nfsd/Makefile
config.status: creating utils/nfsstat/Makefile
config.status: creating utils/nhfsstone/Makefile
config.status: creating utils/rquotad/Makefile
config.status: creating utils/showmount/Makefile
config.status: creating utils/statd/Makefile
config.status: creating support/include/config.h
config.status: executing depfiles commands
+ /usr/bin/make -j1 all
make: Warning: File `Makefile' has modification time 93 s in the future
Making all in tools
make[1]: Entering directory `/tmp/B.8583be61-7748-4036-9240-db3a4950d6f6/BUILD/nfs-utils-1.0.10/tools'
make[1]: Warning: File `Makefile' has modification time 1.1e+02 s in the future
Making all in getiversion
make[2]: Entering directory `/tmp/B.8583be61-7748-4036-9240-db3a4950d6f6/BUILD/nfs-utils-1.0.10/tools/getiversion'
make[2]: Warning: File `.deps/getiversion-getiversion.Po' has modification time 1.7e+02 s in the future
sparc-pld-linux-gcc -DHAVE_CONFIG_H -I. -I../../support/include  -D_GNU_SOURCE -I../../support/include -D_GNU_SOURCE -O2 -m32 -mtune=ultrasparc  -O2 -m32 -mtune=ultrasparc  -MT getiversion-getiversion.o -MD -MP -MF .deps/getiversion-getiversion.Tpo -c -o getiversion-getiversion.o `test -f 'getiversion.c' || echo './'`getiversion.c
mv -f .deps/getiversion-getiversion.Tpo .deps/getiversion-getiversion.Po
/bin/sh ../../libtool --tag=CC --tag=CC   --mode=link sparc-pld-linux-gcc -O2 -m32 -mtune=ultrasparc  -O2 -m32 -mtune=ultrasparc  -Wl,--as-needed  -Wl,--as-needed  -o getiversion getiversion-getiversion.o  
mkdir .libs
sparc-pld-linux-gcc -O2 -m32 -mtune=ultrasparc -O2 -m32 -mtune=ultrasparc -Wl,--as-needed -Wl,--as-needed -o getiversion getiversion-getiversion.o 
make[2]: warning:  Clock skew detected.  Your build may be incomplete.
make[2]: Leaving directory `/tmp/B.8583be61-7748-4036-9240-db3a4950d6f6/BUILD/nfs-utils-1.0.10/tools/getiversion'
Making all in getkversion
make[2]: Entering directory `/tmp/B.8583be61-7748-4036-9240-db3a4950d6f6/BUILD/nfs-utils-1.0.10/tools/getkversion'
make[2]: Warning: File `.deps/getkversion-getkversion.Po' has modification time 1.6e+02 s in the future
sparc-pld-linux-gcc -DHAVE_CONFIG_H -I. -I../../support/include  -D_GNU_SOURCE -D_GNU_SOURCE -O2 -m32 -mtune=ultrasparc  -O2 -m32 -mtune=ultrasparc  -MT getkversion-getkversion.o -MD -MP -MF .deps/getkversion-getkversion.Tpo -c -o getkversion-getkversion.o `test -f 'getkversion.c' || echo './'`getkversion.c
getkversion.c: In function `main':
getkversion.c:17: error: `UTS_RELEASE' undeclared (first use in this function)
getkversion.c:17: error: (Each undeclared identifier is reported only once
getkversion.c:17: error: for each function it appears in.)
make[2]: *** [getkversion-getkversion.o] Error 1
make[2]: Leaving directory `/tmp/B.8583be61-7748-4036-9240-db3a4950d6f6/BUILD/nfs-utils-1.0.10/tools/getkversion'
make[1]: *** [all-recursive] Error 1
make[1]: Leaving directory `/tmp/B.8583be61-7748-4036-9240-db3a4950d6f6/BUILD/nfs-utils-1.0.10/tools'
make: *** [all-recursive] Error 1
error: Bad exit status from /tmp/rpm-tmp.8474 (%build)

RPM build errors:
    Bad exit status from /tmp/rpm-tmp.8474 (%build)
ended at: Tue Jan  5 11:55:58 2016, done in 0:26:41.835629
error: No files produced.
+ chmod -R u+rwX /tmp/B.8583be61-7748-4036-9240-db3a4950d6f6/BUILD
+ rm -rf /tmp/B.8583be61-7748-4036-9240-db3a4950d6f6/tmp /tmp/B.8583be61-7748-4036-9240-db3a4950d6f6/BUILD
+ rm -rf /tmp/B.8583be61-7748-4036-9240-db3a4950d6f6
Build-Time: user:974.71s sys:263.11s real:1678.61s (faults io:11 non-io:1309441)

[Back to list of logs] [View rpm -qa of builder]