FailedOk

th/SRPMS[OK]
th/x32[OK]
th/i686[OK]
th/x86_64[OK]

ac/SRPMS[OK]
ac/i386[OK]
ac/i586[OK]
ac/i686[OK]
ac/alpha[OK]
ac/amd64[OK]
ac/athlon[OK]
ac/ppc[OK]
ac/sparc[OK]
ac/sparc64[OK]

Advanced Search
main()
Powered by PLD Linux
(c) 2002-2021 PLD Team
$Revision: 1.37 $
Powered by /dev/null.
Your IP: 54.80.173.217

abseil-cpp 450206f2-6545-4bf6-a8f5-01845e8573df

Status:Failed
Source URL:https://buildlogs.pld-linux.org/pld/th/i686/FAIL/abseil-cpp,450206f2-6545-4bf6-a8f5-01845e8573df.bz2
text/plain URL:View!
rpm -qa of builder:View!
Date:2021/11/20 23:06:58
Runtime:0:00:14.749461

Toc:

  • prep
  • Executing(%prep): /bin/sh -e /tmp/B.u4f9ex94/BUILD/tmp/rpm-tmp.oehTeC
  • build
  • Executing(%build): /bin/sh -e /tmp/B.u4f9ex94/BUILD/tmp/rpm-tmp.zy9BJZ
  • error 1
  • /tmp/B.u4f9ex94/BUILD/abseil-cpp-20200923.3/absl/debugging/failure_signal_handler.cc:138:32: error: no matching function for call to 'max(long int, int)'
  • error 2
  • make[2]: *** [absl/debugging/CMakeFiles/failure_signal_handler.dir/build.make:86: absl/debugging/CMakeFiles/failure_signal_handler.dir/failure_signal_handler.cc.o] Error 1
  • error 3
  • make[1]: *** [CMakeFiles/Makefile2:1025: absl/debugging/CMakeFiles/failure_signal_handler.dir/all] Error 2
  • error 4
  • error: Bad exit status from /tmp/B.u4f9ex94/BUILD/tmp/rpm-tmp.zy9BJZ (%build)
  • error 5
  • RPM build errors:
  • error 6
  • error: No files produced.

Content:

request from: baggins
checking if we should skip the build
started at: Sat Nov 20 23:06:41 2021
killing old processes on a builder
sending signal 9 to pid -1
cleaning up /tmp
fetching https://srcbuilder.pld-linux.org/th//srpms/450206f2-6545-4bf6-a8f5-01845e8573df/abseil-cpp-20200923.3-2.src.rpm
fetched 1790134 bytes, 3856.7 K/s
installing srpm: abseil-cpp-20200923.3-2.src.rpm
+ install -d /tmp/B.u4f9ex94/BUILD /tmp/B.u4f9ex94/RPMS
+ LC_ALL=en_US.UTF-8
+ rpm -qp --changelog abseil-cpp-20200923.3-2.src.rpm
* Sat Nov 20 2021 PLD Linux Team <feedback@pld-linux.org>
- For complete changelog see: http://git.pld-linux.org/?p=packages/abseil-cpp.git;a=log;h=master
* Sat Nov 20 2021 Jan Rękorajski <baggins@pld-linux.org> 11e2416
- rebuild with separate debuginfo build-ids * Sun Mar 14 2021 Jakub Bogusz <qboosh@pld-linux.org> ab4eff7
- updated to 20200923.3 * Sat Sep 26 2020 Jakub Bogusz <qboosh@pld-linux.org> 15a7d71
- updated to 20200923 * Sun Jun 28 2020 Jakub Bogusz <qboosh@pld-linux.org> 3a72818
- new + rpm -Uhv --nodeps --define '_topdir /tmp/B.u4f9ex94' --define '_specdir %{_topdir}' --define '_sourcedir %{_specdir}' --define '_rpmdir %{_topdir}/RPMS' --define '_builddir %{_topdir}/BUILD' abseil-cpp-20200923.3-2.src.rpm Updating / installing... abseil-cpp-20200923.3-2 ######################################## + rm -f abseil-cpp-20200923.3-2.src.rpm + install -m 700 -d /tmp/B.u4f9ex94/BUILD/tmp + TMPDIR=/tmp/B.u4f9ex94/BUILD/tmp + exec nice -n 0 rpmbuild -bp --short-circuit --nodeps --define '_topdir /tmp/B.u4f9ex94' --define '_specdir %{_topdir}' --define '_sourcedir %{_specdir}' --define '_rpmdir %{_topdir}/RPMS' --define '_builddir %{_topdir}/BUILD' --target i686-pld-linux --define 'prep exit 0' /tmp/B.u4f9ex94/abseil-cpp.spec warning: Could not canonicalize hostname: nereid Building target platforms: i686-pld-linux Building for target i686-pld-linux checking BuildConflict-ing packages rpm: warning: Could not canonicalize hostname: nereid rpm: Building target platforms: i686-pld-linux rpm: Building for target i686-pld-linux no BuildConflicts found checking BR rpm: warning: Could not canonicalize hostname: nereid rpm: Building target platforms: i686-pld-linux rpm: Building for target i686-pld-linux no BR needed building RPM using: set -ex; : build-id: 450206f2-6545-4bf6-a8f5-01845e8573df; TMPDIR=/tmp/B.u4f9ex94/BUILD/tmp exec nice -n 0 rpmbuild -bb --define '_smp_mflags -j9' --define '_make_opts -Otarget' --define '_pld_builder 1' --define '_topdir /tmp/B.u4f9ex94' --define '_specdir %{_topdir}' --define '_sourcedir %{_specdir}' --define '_rpmdir %{_topdir}/RPMS' --define '_builddir %{_topdir}/BUILD' --target i686-pld-linux /tmp/B.u4f9ex94/abseil-cpp.spec + : build-id: 450206f2-6545-4bf6-a8f5-01845e8573df + TMPDIR=/tmp/B.u4f9ex94/BUILD/tmp + exec nice -n 0 rpmbuild -bb --define '_smp_mflags -j9' --define '_make_opts -Otarget' --define '_pld_builder 1' --define '_topdir /tmp/B.u4f9ex94' --define '_specdir %{_topdir}' --define '_sourcedir %{_specdir}' --define '_rpmdir %{_topdir}/RPMS' --define '_builddir %{_topdir}/BUILD' --target i686-pld-linux /tmp/B.u4f9ex94/abseil-cpp.spec warning: Could not canonicalize hostname: nereid Building target platforms: i686-pld-linux Building for target i686-pld-linux Executing(%prep): /bin/sh -e /tmp/B.u4f9ex94/BUILD/tmp/rpm-tmp.oehTeC + umask 022 + cd /tmp/B.u4f9ex94/BUILD + cd /tmp/B.u4f9ex94/BUILD + rm -rf abseil-cpp-20200923.3 + /bin/gzip -dc /tmp/B.u4f9ex94/abseil-cpp-20200923.3.tar.gz + /bin/tar -xof - + STATUS=0 + '[' 0 -ne 0 ']' + cd abseil-cpp-20200923.3 + /bin/chmod -Rf a+rX,u+w,g-w,o-w . + RPM_EC=0 + jobs -p + exit 0 Executing(%build): /bin/sh -e /tmp/B.u4f9ex94/BUILD/tmp/rpm-tmp.zy9BJZ TMP=/home/users/builder/tmp HOME=/home/users/builder PATH=/home/users/builder/GNUstep/Tools:/bin:/usr/bin:/usr/local/bin:/home/users/builder/bin TMPDIR=/tmp/B.u4f9ex94/BUILD/tmp + umask 022 + cd /tmp/B.u4f9ex94/BUILD + cd abseil-cpp-20200923.3 + install -d build-static + cd build-static + CC=i686-pld-linux-gcc CXX=i686-pld-linux-g++ CPPFLAGS='' /usr/bin/cmake '-DCMAKE_VERBOSE_MAKEFILE:BOOL=ON' '-DCMAKE_BUILD_TYPE=PLD' '-DCMAKE_INSTALL_BINDIR:PATH=/usr/bin' '-DCMAKE_INSTALL_SBINDIR:PATH=/usr/sbin' '-DCMAKE_INSTALL_LIBEXECDIR:PATH=/usr/libexec' '-DCMAKE_INSTALL_SYSCONFDIR:PATH=/etc' '-DCMAKE_INSTALL_SHAREDSTATEDIRPATH:PATH=/var/lib' '-DCMAKE_INSTALL_LOCALSTATEDIRPATH:PATH=/var' '-DCMAKE_INSTALL_LIBDIR:PATH=/usr/lib' '-DCMAKE_INSTALL_INCLUDEDIR:PATH=/usr/include' '-DCMAKE_INSTALL_OLDINCLUDEDIR:PATH=/usr/include' '-DCMAKE_INSTALL_DATAROOTDIR:PATH=/usr/share' '-DCMAKE_INSTALL_DATADIR:PATH=/usr/share' '-DCMAKE_INSTALL_INFODIR:PATH=/usr/share/info' '-DCMAKE_INSTALL_LOCALEDIR:PATH=/usr/share/locale' '-DCMAKE_INSTALL_MANDIR:PATH=/usr/share/man' '-DCMAKE_INSTALL_DOCDIR:PATH=/usr/share/doc' '-DCMAKE_INSTALL_PREFIX:PATH=/usr' '-DSYSCONF_INSTALL_DIR:PATH=/etc' '-DCMAKE_CXX_FLAGS_PLD=-O2 -fwrapv -pipe -Wformat -Werror=format-security -gdwarf-4 -fno-debug-types-section -fvar-tracking-assignments -g2 -Wp,-D_FORTIFY_SOURCE=2 -fstack-protector-strong --param=ssp-buffer-size=4 -Werror=trampolines -fomit-frame-pointer -march=i686 -fasynchronous-unwind-tables -mtune=pentium4 -gdwarf-4 -fno-debug-types-section -fvar-tracking-assignments -g2 -DNDEBUG -DQT_NO_DEBUG' '-DCMAKE_C_FLAGS_PLD=-O2 -fwrapv -pipe -Wformat -Werror=format-security -gdwarf-4 -fno-debug-types-section -fvar-tracking-assignments -g2 -Wp,-D_FORTIFY_SOURCE=2 -fstack-protector-strong --param=ssp-buffer-size=4 -Werror=trampolines -fomit-frame-pointer -march=i686 -fasynchronous-unwind-tables -mtune=pentium4 -gdwarf-4 -fno-debug-types-section -fvar-tracking-assignments -g2 -DNDEBUG -DQT_NO_DEBUG' '-DCMAKE_Fortran_FLAGS_PLD=-O2 -fwrapv -pipe -Wformat -Werror=format-security -gdwarf-4 -fno-debug-types-section -fvar-tracking-assignments -g2 -Wp,-D_FORTIFY_SOURCE=2 -fstack-protector-strong --param=ssp-buffer-size=4 -Werror=trampolines -fomit-frame-pointer -march=i686 -fasynchronous-unwind-tables -mtune=pentium4 -gdwarf-4 -fno-debug-types-section -fvar-tracking-assignments -g2 -DNDEBUG -DQT_NO_DEBUG' '-DCMAKE_EXE_LINKER_FLAGS_PLD=-Wl,--as-needed -Wl,--no-copy-dt-needed-entries -Wl,-z,relro -Wl,-z,combreloc ' '-DCMAKE_SHARED_LINKER_FLAGS_PLD=-Wl,--as-needed -Wl,--no-copy-dt-needed-entries -Wl,-z,relro -Wl,-z,combreloc ' '-DCMAKE_MODULE_LINKER_FLAGS_PLD=-Wl,--as-needed -Wl,--no-copy-dt-needed-entries -Wl,-z,relro -Wl,-z,combreloc ' '-DBUILD_SHARED_LIBS:BOOL=ON' .. '-DBUILD_SHARED_LIBS=OFF' -- The CXX compiler identification is GNU 11.2.0 -- Check for working CXX compiler: /usr/bin/i686-pld-linux-g++ -- Check for working CXX compiler: /usr/bin/i686-pld-linux-g++ - works -- Detecting CXX compiler ABI info -- Detecting CXX compiler ABI info - done -- Detecting CXX compile features -- Detecting CXX compile features - done CMake Warning at absl/copts/AbseilConfigureCopts.cmake:30 (message): Value of CMAKE_SYSTEM_PROCESSOR (i686) is unknown and cannot be used to set ABSL_RANDOM_RANDEN_COPTS Call Stack (most recent call first): CMake/AbseilHelpers.cmake:18 (include) CMakeLists.txt:68 (include) -- Looking for C++ include pthread.h -- Looking for C++ include pthread.h - found -- Performing Test CMAKE_HAVE_LIBC_PTHREAD -- Performing Test CMAKE_HAVE_LIBC_PTHREAD - Success -- Found Threads: TRUE -- Configuring done -- Generating done CMake Warning: Manually-specified variables were not used by the project: CMAKE_C_FLAGS_PLD CMAKE_Fortran_FLAGS_PLD CMAKE_INSTALL_LOCALSTATEDIRPATH CMAKE_INSTALL_SHAREDSTATEDIRPATH SYSCONF_INSTALL_DIR -- Build files have been written to: /tmp/B.u4f9ex94/BUILD/abseil-cpp-20200923.3/build-static + /usr/bin/make -Otarget -j9 /usr/bin/cmake -S/tmp/B.u4f9ex94/BUILD/abseil-cpp-20200923.3 -B/tmp/B.u4f9ex94/BUILD/abseil-cpp-20200923.3/build-static --check-build-system CMakeFiles/Makefile.cmake 0 /usr/bin/cmake -E cmake_progress_start /tmp/B.u4f9ex94/BUILD/abseil-cpp-20200923.3/build-static/CMakeFiles /tmp/B.u4f9ex94/BUILD/abseil-cpp-20200923.3/build-static/CMakeFiles/progress.marks /usr/bin/make -f CMakeFiles/Makefile2 all /usr/bin/make -f absl/base/CMakeFiles/strerror.dir/build.make absl/base/CMakeFiles/strerror.dir/depend /usr/bin/make -f absl/base/CMakeFiles/log_severity.dir/build.make absl/base/CMakeFiles/log_severity.dir/depend /usr/bin/make -f absl/base/CMakeFiles/exponential_biased.dir/build.make absl/base/CMakeFiles/exponential_biased.dir/depend /usr/bin/make -f absl/base/CMakeFiles/spinlock_wait.dir/build.make absl/base/CMakeFiles/spinlock_wait.dir/depend /usr/bin/make -f absl/time/CMakeFiles/civil_time.dir/build.make absl/time/CMakeFiles/civil_time.dir/depend /usr/bin/make -f absl/numeric/CMakeFiles/int128.dir/build.make absl/numeric/CMakeFiles/int128.dir/depend /usr/bin/make -f absl/time/CMakeFiles/time_zone.dir/build.make absl/time/CMakeFiles/time_zone.dir/depend /usr/bin/make -f absl/debugging/CMakeFiles/leak_check.dir/build.make absl/debugging/CMakeFiles/leak_check.dir/depend /usr/bin/make -f absl/debugging/CMakeFiles/leak_check_disable.dir/build.make absl/debugging/CMakeFiles/leak_check_disable.dir/depend make[2]: Entering directory '/tmp/B.u4f9ex94/BUILD/abseil-cpp-20200923.3/build-static' cd /tmp/B.u4f9ex94/BUILD/abseil-cpp-20200923.3/build-static && /usr/bin/cmake -E cmake_depends "Unix Makefiles" /tmp/B.u4f9ex94/BUILD/abseil-cpp-20200923.3 /tmp/B.u4f9ex94/BUILD/abseil-cpp-20200923.3/absl/base /tmp/B.u4f9ex94/BUILD/abseil-cpp-20200923.3/build-static /tmp/B.u4f9ex94/BUILD/abseil-cpp-20200923.3/build-static/absl/base /tmp/B.u4f9ex94/BUILD/abseil-cpp-20200923.3/build-static/absl/base/CMakeFiles/strerror.dir/DependInfo.cmake --color= Scanning dependencies of target strerror make[2]: Leaving directory '/tmp/B.u4f9ex94/BUILD/abseil-cpp-20200923.3/build-static' make[2]: Entering directory '/tmp/B.u4f9ex94/BUILD/abseil-cpp-20200923.3/build-static' cd /tmp/B.u4f9ex94/BUILD/abseil-cpp-20200923.3/build-static && /usr/bin/cmake -E cmake_depends "Unix Makefiles" /tmp/B.u4f9ex94/BUILD/abseil-cpp-20200923.3 /tmp/B.u4f9ex94/BUILD/abseil-cpp-20200923.3/absl/base /tmp/B.u4f9ex94/BUILD/abseil-cpp-20200923.3/build-static /tmp/B.u4f9ex94/BUILD/abseil-cpp-20200923.3/build-static/absl/base /tmp/B.u4f9ex94/BUILD/abseil-cpp-20200923.3/build-static/absl/base/CMakeFiles/spinlock_wait.dir/DependInfo.cmake --color= Scanning dependencies of target spinlock_wait make[2]: Leaving directory '/tmp/B.u4f9ex94/BUILD/abseil-cpp-20200923.3/build-static' /usr/bin/make -f absl/base/CMakeFiles/strerror.dir/build.make absl/base/CMakeFiles/strerror.dir/build make[2]: Entering directory '/tmp/B.u4f9ex94/BUILD/abseil-cpp-20200923.3/build-static' cd /tmp/B.u4f9ex94/BUILD/abseil-cpp-20200923.3/build-static && /usr/bin/cmake -E cmake_depends "Unix Makefiles" /tmp/B.u4f9ex94/BUILD/abseil-cpp-20200923.3 /tmp/B.u4f9ex94/BUILD/abseil-cpp-20200923.3/absl/base /tmp/B.u4f9ex94/BUILD/abseil-cpp-20200923.3/build-static /tmp/B.u4f9ex94/BUILD/abseil-cpp-20200923.3/build-static/absl/base /tmp/B.u4f9ex94/BUILD/abseil-cpp-20200923.3/build-static/absl/base/CMakeFiles/exponential_biased.dir/DependInfo.cmake --color= Scanning dependencies of target exponential_biased make[2]: Leaving directory '/tmp/B.u4f9ex94/BUILD/abseil-cpp-20200923.3/build-static' make[2]: Entering directory '/tmp/B.u4f9ex94/BUILD/abseil-cpp-20200923.3/build-static' cd /tmp/B.u4f9ex94/BUILD/abseil-cpp-20200923.3/build-static && /usr/bin/cmake -E cmake_depends "Unix Makefiles" /tmp/B.u4f9ex94/BUILD/abseil-cpp-20200923.3 /tmp/B.u4f9ex94/BUILD/abseil-cpp-20200923.3/absl/time /tmp/B.u4f9ex94/BUILD/abseil-cpp-20200923.3/build-static /tmp/B.u4f9ex94/BUILD/abseil-cpp-20200923.3/build-static/absl/time /tmp/B.u4f9ex94/BUILD/abseil-cpp-20200923.3/build-static/absl/time/CMakeFiles/civil_time.dir/DependInfo.cmake --color= Scanning dependencies of target civil_time make[2]: Leaving directory '/tmp/B.u4f9ex94/BUILD/abseil-cpp-20200923.3/build-static' make[2]: Entering directory '/tmp/B.u4f9ex94/BUILD/abseil-cpp-20200923.3/build-static' cd /tmp/B.u4f9ex94/BUILD/abseil-cpp-20200923.3/build-static && /usr/bin/cmake -E cmake_depends "Unix Makefiles" /tmp/B.u4f9ex94/BUILD/abseil-cpp-20200923.3 /tmp/B.u4f9ex94/BUILD/abseil-cpp-20200923.3/absl/base /tmp/B.u4f9ex94/BUILD/abseil-cpp-20200923.3/build-static /tmp/B.u4f9ex94/BUILD/abseil-cpp-20200923.3/build-static/absl/base /tmp/B.u4f9ex94/BUILD/abseil-cpp-20200923.3/build-static/absl/base/CMakeFiles/log_severity.dir/DependInfo.cmake --color= Scanning dependencies of target log_severity make[2]: Leaving directory '/tmp/B.u4f9ex94/BUILD/abseil-cpp-20200923.3/build-static' make[2]: Entering directory '/tmp/B.u4f9ex94/BUILD/abseil-cpp-20200923.3/build-static' cd /tmp/B.u4f9ex94/BUILD/abseil-cpp-20200923.3/build-static && /usr/bin/cmake -E cmake_depends "Unix Makefiles" /tmp/B.u4f9ex94/BUILD/abseil-cpp-20200923.3 /tmp/B.u4f9ex94/BUILD/abseil-cpp-20200923.3/absl/debugging /tmp/B.u4f9ex94/BUILD/abseil-cpp-20200923.3/build-static /tmp/B.u4f9ex94/BUILD/abseil-cpp-20200923.3/build-static/absl/debugging /tmp/B.u4f9ex94/BUILD/abseil-cpp-20200923.3/build-static/absl/debugging/CMakeFiles/leak_check_disable.dir/DependInfo.cmake --color= Scanning dependencies of target leak_check_disable make[2]: Leaving directory '/tmp/B.u4f9ex94/BUILD/abseil-cpp-20200923.3/build-static' /usr/bin/make -f absl/base/CMakeFiles/spinlock_wait.dir/build.make absl/base/CMakeFiles/spinlock_wait.dir/build make[2]: Entering directory '/tmp/B.u4f9ex94/BUILD/abseil-cpp-20200923.3/build-static' cd /tmp/B.u4f9ex94/BUILD/abseil-cpp-20200923.3/build-static && /usr/bin/cmake -E cmake_depends "Unix Makefiles" /tmp/B.u4f9ex94/BUILD/abseil-cpp-20200923.3 /tmp/B.u4f9ex94/BUILD/abseil-cpp-20200923.3/absl/numeric /tmp/B.u4f9ex94/BUILD/abseil-cpp-20200923.3/build-static /tmp/B.u4f9ex94/BUILD/abseil-cpp-20200923.3/build-static/absl/numeric /tmp/B.u4f9ex94/BUILD/abseil-cpp-20200923.3/build-static/absl/numeric/CMakeFiles/int128.dir/DependInfo.cmake --color= Scanning dependencies of target int128 make[2]: Leaving directory '/tmp/B.u4f9ex94/BUILD/abseil-cpp-20200923.3/build-static' make[2]: Entering directory '/tmp/B.u4f9ex94/BUILD/abseil-cpp-20200923.3/build-static' cd /tmp/B.u4f9ex94/BUILD/abseil-cpp-20200923.3/build-static && /usr/bin/cmake -E cmake_depends "Unix Makefiles" /tmp/B.u4f9ex94/BUILD/abseil-cpp-20200923.3 /tmp/B.u4f9ex94/BUILD/abseil-cpp-20200923.3/absl/time /tmp/B.u4f9ex94/BUILD/abseil-cpp-20200923.3/build-static /tmp/B.u4f9ex94/BUILD/abseil-cpp-20200923.3/build-static/absl/time /tmp/B.u4f9ex94/BUILD/abseil-cpp-20200923.3/build-static/absl/time/CMakeFiles/time_zone.dir/DependInfo.cmake --color= Scanning dependencies of target time_zone make[2]: Leaving directory '/tmp/B.u4f9ex94/BUILD/abseil-cpp-20200923.3/build-static' make[2]: Entering directory '/tmp/B.u4f9ex94/BUILD/abseil-cpp-20200923.3/build-static' cd /tmp/B.u4f9ex94/BUILD/abseil-cpp-20200923.3/build-static && /usr/bin/cmake -E cmake_depends "Unix Makefiles" /tmp/B.u4f9ex94/BUILD/abseil-cpp-20200923.3 /tmp/B.u4f9ex94/BUILD/abseil-cpp-20200923.3/absl/debugging /tmp/B.u4f9ex94/BUILD/abseil-cpp-20200923.3/build-static /tmp/B.u4f9ex94/BUILD/abseil-cpp-20200923.3/build-static/absl/debugging /tmp/B.u4f9ex94/BUILD/abseil-cpp-20200923.3/build-static/absl/debugging/CMakeFiles/leak_check.dir/DependInfo.cmake --color= Scanning dependencies of target leak_check make[2]: Leaving directory '/tmp/B.u4f9ex94/BUILD/abseil-cpp-20200923.3/build-static' /usr/bin/make -f absl/base/CMakeFiles/exponential_biased.dir/build.make absl/base/CMakeFiles/exponential_biased.dir/build /usr/bin/make -f absl/time/CMakeFiles/civil_time.dir/build.make absl/time/CMakeFiles/civil_time.dir/build /usr/bin/make -f absl/base/CMakeFiles/log_severity.dir/build.make absl/base/CMakeFiles/log_severity.dir/build /usr/bin/make -f absl/numeric/CMakeFiles/int128.dir/build.make absl/numeric/CMakeFiles/int128.dir/build /usr/bin/make -f absl/time/CMakeFiles/time_zone.dir/build.make absl/time/CMakeFiles/time_zone.dir/build /usr/bin/make -f absl/debugging/CMakeFiles/leak_check.dir/build.make absl/debugging/CMakeFiles/leak_check.dir/build /usr/bin/make -f absl/debugging/CMakeFiles/leak_check_disable.dir/build.make absl/debugging/CMakeFiles/leak_check_disable.dir/build make[2]: Entering directory '/tmp/B.u4f9ex94/BUILD/abseil-cpp-20200923.3/build-static' [ 5%] Building CXX object absl/debugging/CMakeFiles/leak_check_disable.dir/leak_check_disable.cc.o cd /tmp/B.u4f9ex94/BUILD/abseil-cpp-20200923.3/build-static/absl/debugging && /usr/bin/i686-pld-linux-g++ -I/tmp/B.u4f9ex94/BUILD/abseil-cpp-20200923.3 -O2 -fwrapv -pipe -Wformat -Werror=format-security -gdwarf-4 -fno-debug-types-section -fvar-tracking-assignments -g2 -Wp,-D_FORTIFY_SOURCE=2 -fstack-protector-strong --param=ssp-buffer-size=4 -Werror=trampolines -fomit-frame-pointer -march=i686 -fasynchronous-unwind-tables -mtune=pentium4 -gdwarf-4 -fno-debug-types-section -fvar-tracking-assignments -g2 -DNDEBUG -DQT_NO_DEBUG -Wall -Wextra -Wcast-qual -Wconversion-null -Wmissing-declarations -Woverlength-strings -Wpointer-arith -Wundef -Wunused-local-typedefs -Wunused-result -Wvarargs -Wvla -Wwrite-strings -Wno-missing-field-initializers -Wno-sign-compare -DNOMINMAX -o CMakeFiles/leak_check_disable.dir/leak_check_disable.cc.o -c /tmp/B.u4f9ex94/BUILD/abseil-cpp-20200923.3/absl/debugging/leak_check_disable.cc make[2]: Leaving directory '/tmp/B.u4f9ex94/BUILD/abseil-cpp-20200923.3/build-static' make[2]: Entering directory '/tmp/B.u4f9ex94/BUILD/abseil-cpp-20200923.3/build-static' [ 4%] Building CXX object absl/debugging/CMakeFiles/leak_check.dir/leak_check.cc.o cd /tmp/B.u4f9ex94/BUILD/abseil-cpp-20200923.3/build-static/absl/debugging && /usr/bin/i686-pld-linux-g++ -I/tmp/B.u4f9ex94/BUILD/abseil-cpp-20200923.3 -O2 -fwrapv -pipe -Wformat -Werror=format-security -gdwarf-4 -fno-debug-types-section -fvar-tracking-assignments -g2 -Wp,-D_FORTIFY_SOURCE=2 -fstack-protector-strong --param=ssp-buffer-size=4 -Werror=trampolines -fomit-frame-pointer -march=i686 -fasynchronous-unwind-tables -mtune=pentium4 -gdwarf-4 -fno-debug-types-section -fvar-tracking-assignments -g2 -DNDEBUG -DQT_NO_DEBUG -Wall -Wextra -Wcast-qual -Wconversion-null -Wmissing-declarations -Woverlength-strings -Wpointer-arith -Wundef -Wunused-local-typedefs -Wunused-result -Wvarargs -Wvla -Wwrite-strings -Wno-missing-field-initializers -Wno-sign-compare -DNOMINMAX -o CMakeFiles/leak_check.dir/leak_check.cc.o -c /tmp/B.u4f9ex94/BUILD/abseil-cpp-20200923.3/absl/debugging/leak_check.cc make[2]: Leaving directory '/tmp/B.u4f9ex94/BUILD/abseil-cpp-20200923.3/build-static' make[2]: Entering directory '/tmp/B.u4f9ex94/BUILD/abseil-cpp-20200923.3/build-static' [ 6%] Linking CXX static library libabsl_leak_check_disable.a cd /tmp/B.u4f9ex94/BUILD/abseil-cpp-20200923.3/build-static/absl/debugging && /usr/bin/cmake -P CMakeFiles/leak_check_disable.dir/cmake_clean_target.cmake cd /tmp/B.u4f9ex94/BUILD/abseil-cpp-20200923.3/build-static/absl/debugging && /usr/bin/cmake -E cmake_link_script CMakeFiles/leak_check_disable.dir/link.txt --verbose=1 /usr/bin/ar qc libabsl_leak_check_disable.a CMakeFiles/leak_check_disable.dir/leak_check_disable.cc.o /usr/bin/ranlib libabsl_leak_check_disable.a make[2]: Leaving directory '/tmp/B.u4f9ex94/BUILD/abseil-cpp-20200923.3/build-static' make[2]: Entering directory '/tmp/B.u4f9ex94/BUILD/abseil-cpp-20200923.3/build-static' [ 1%] Building CXX object absl/base/CMakeFiles/spinlock_wait.dir/internal/spinlock_wait.cc.o cd /tmp/B.u4f9ex94/BUILD/abseil-cpp-20200923.3/build-static/absl/base && /usr/bin/i686-pld-linux-g++ -I/tmp/B.u4f9ex94/BUILD/abseil-cpp-20200923.3 -O2 -fwrapv -pipe -Wformat -Werror=format-security -gdwarf-4 -fno-debug-types-section -fvar-tracking-assignments -g2 -Wp,-D_FORTIFY_SOURCE=2 -fstack-protector-strong --param=ssp-buffer-size=4 -Werror=trampolines -fomit-frame-pointer -march=i686 -fasynchronous-unwind-tables -mtune=pentium4 -gdwarf-4 -fno-debug-types-section -fvar-tracking-assignments -g2 -DNDEBUG -DQT_NO_DEBUG -Wall -Wextra -Wcast-qual -Wconversion-null -Wmissing-declarations -Woverlength-strings -Wpointer-arith -Wundef -Wunused-local-typedefs -Wunused-result -Wvarargs -Wvla -Wwrite-strings -Wno-missing-field-initializers -Wno-sign-compare -DNOMINMAX -o CMakeFiles/spinlock_wait.dir/internal/spinlock_wait.cc.o -c /tmp/B.u4f9ex94/BUILD/abseil-cpp-20200923.3/absl/base/internal/spinlock_wait.cc make[2]: Leaving directory '/tmp/B.u4f9ex94/BUILD/abseil-cpp-20200923.3/build-static' make[2]: Entering directory '/tmp/B.u4f9ex94/BUILD/abseil-cpp-20200923.3/build-static' [ 6%] Linking CXX static library libabsl_leak_check.a cd /tmp/B.u4f9ex94/BUILD/abseil-cpp-20200923.3/build-static/absl/debugging && /usr/bin/cmake -P CMakeFiles/leak_check.dir/cmake_clean_target.cmake cd /tmp/B.u4f9ex94/BUILD/abseil-cpp-20200923.3/build-static/absl/debugging && /usr/bin/cmake -E cmake_link_script CMakeFiles/leak_check.dir/link.txt --verbose=1 /usr/bin/ar qc libabsl_leak_check.a CMakeFiles/leak_check.dir/leak_check.cc.o /usr/bin/ranlib libabsl_leak_check.a make[2]: Leaving directory '/tmp/B.u4f9ex94/BUILD/abseil-cpp-20200923.3/build-static' make[1]: Entering directory '/tmp/B.u4f9ex94/BUILD/abseil-cpp-20200923.3/build-static' [ 6%] Built target leak_check_disable make[1]: Leaving directory '/tmp/B.u4f9ex94/BUILD/abseil-cpp-20200923.3/build-static' /usr/bin/make -f absl/flags/CMakeFiles/flags_commandlineflag_internal.dir/build.make absl/flags/CMakeFiles/flags_commandlineflag_internal.dir/depend make[1]: Entering directory '/tmp/B.u4f9ex94/BUILD/abseil-cpp-20200923.3/build-static' [ 6%] Built target leak_check make[1]: Leaving directory '/tmp/B.u4f9ex94/BUILD/abseil-cpp-20200923.3/build-static' /usr/bin/make -f absl/hash/CMakeFiles/city.dir/build.make absl/hash/CMakeFiles/city.dir/depend make[2]: Entering directory '/tmp/B.u4f9ex94/BUILD/abseil-cpp-20200923.3/build-static' cd /tmp/B.u4f9ex94/BUILD/abseil-cpp-20200923.3/build-static && /usr/bin/cmake -E cmake_depends "Unix Makefiles" /tmp/B.u4f9ex94/BUILD/abseil-cpp-20200923.3 /tmp/B.u4f9ex94/BUILD/abseil-cpp-20200923.3/absl/hash /tmp/B.u4f9ex94/BUILD/abseil-cpp-20200923.3/build-static /tmp/B.u4f9ex94/BUILD/abseil-cpp-20200923.3/build-static/absl/hash /tmp/B.u4f9ex94/BUILD/abseil-cpp-20200923.3/build-static/absl/hash/CMakeFiles/city.dir/DependInfo.cmake --color= Scanning dependencies of target city make[2]: Leaving directory '/tmp/B.u4f9ex94/BUILD/abseil-cpp-20200923.3/build-static' /usr/bin/make -f absl/hash/CMakeFiles/city.dir/build.make absl/hash/CMakeFiles/city.dir/build make[2]: Entering directory '/tmp/B.u4f9ex94/BUILD/abseil-cpp-20200923.3/build-static' cd /tmp/B.u4f9ex94/BUILD/abseil-cpp-20200923.3/build-static && /usr/bin/cmake -E cmake_depends "Unix Makefiles" /tmp/B.u4f9ex94/BUILD/abseil-cpp-20200923.3 /tmp/B.u4f9ex94/BUILD/abseil-cpp-20200923.3/absl/flags /tmp/B.u4f9ex94/BUILD/abseil-cpp-20200923.3/build-static /tmp/B.u4f9ex94/BUILD/abseil-cpp-20200923.3/build-static/absl/flags /tmp/B.u4f9ex94/BUILD/abseil-cpp-20200923.3/build-static/absl/flags/CMakeFiles/flags_commandlineflag_internal.dir/DependInfo.cmake --color= Scanning dependencies of target flags_commandlineflag_internal make[2]: Leaving directory '/tmp/B.u4f9ex94/BUILD/abseil-cpp-20200923.3/build-static' /usr/bin/make -f absl/flags/CMakeFiles/flags_commandlineflag_internal.dir/build.make absl/flags/CMakeFiles/flags_commandlineflag_internal.dir/build make[2]: Entering directory '/tmp/B.u4f9ex94/BUILD/abseil-cpp-20200923.3/build-static' [ 6%] Linking CXX static library libabsl_spinlock_wait.a cd /tmp/B.u4f9ex94/BUILD/abseil-cpp-20200923.3/build-static/absl/base && /usr/bin/cmake -P CMakeFiles/spinlock_wait.dir/cmake_clean_target.cmake cd /tmp/B.u4f9ex94/BUILD/abseil-cpp-20200923.3/build-static/absl/base && /usr/bin/cmake -E cmake_link_script CMakeFiles/spinlock_wait.dir/link.txt --verbose=1 /usr/bin/ar qc libabsl_spinlock_wait.a CMakeFiles/spinlock_wait.dir/internal/spinlock_wait.cc.o /usr/bin/ranlib libabsl_spinlock_wait.a make[2]: Leaving directory '/tmp/B.u4f9ex94/BUILD/abseil-cpp-20200923.3/build-static' make[1]: Entering directory '/tmp/B.u4f9ex94/BUILD/abseil-cpp-20200923.3/build-static' [ 6%] Built target spinlock_wait make[1]: Leaving directory '/tmp/B.u4f9ex94/BUILD/abseil-cpp-20200923.3/build-static' /usr/bin/make -f absl/random/CMakeFiles/random_internal_platform.dir/build.make absl/random/CMakeFiles/random_internal_platform.dir/depend make[2]: Entering directory '/tmp/B.u4f9ex94/BUILD/abseil-cpp-20200923.3/build-static' [ 6%] Building CXX object absl/flags/CMakeFiles/flags_commandlineflag_internal.dir/internal/commandlineflag.cc.o cd /tmp/B.u4f9ex94/BUILD/abseil-cpp-20200923.3/build-static/absl/flags && /usr/bin/i686-pld-linux-g++ -I/tmp/B.u4f9ex94/BUILD/abseil-cpp-20200923.3 -O2 -fwrapv -pipe -Wformat -Werror=format-security -gdwarf-4 -fno-debug-types-section -fvar-tracking-assignments -g2 -Wp,-D_FORTIFY_SOURCE=2 -fstack-protector-strong --param=ssp-buffer-size=4 -Werror=trampolines -fomit-frame-pointer -march=i686 -fasynchronous-unwind-tables -mtune=pentium4 -gdwarf-4 -fno-debug-types-section -fvar-tracking-assignments -g2 -DNDEBUG -DQT_NO_DEBUG -Wall -Wextra -Wcast-qual -Wconversion-null -Wmissing-declarations -Woverlength-strings -Wpointer-arith -Wundef -Wunused-local-typedefs -Wunused-result -Wvarargs -Wvla -Wwrite-strings -Wno-missing-field-initializers -Wno-sign-compare -DNOMINMAX -o CMakeFiles/flags_commandlineflag_internal.dir/internal/commandlineflag.cc.o -c /tmp/B.u4f9ex94/BUILD/abseil-cpp-20200923.3/absl/flags/internal/commandlineflag.cc make[2]: Leaving directory '/tmp/B.u4f9ex94/BUILD/abseil-cpp-20200923.3/build-static' make[2]: Entering directory '/tmp/B.u4f9ex94/BUILD/abseil-cpp-20200923.3/build-static' cd /tmp/B.u4f9ex94/BUILD/abseil-cpp-20200923.3/build-static && /usr/bin/cmake -E cmake_depends "Unix Makefiles" /tmp/B.u4f9ex94/BUILD/abseil-cpp-20200923.3 /tmp/B.u4f9ex94/BUILD/abseil-cpp-20200923.3/absl/random /tmp/B.u4f9ex94/BUILD/abseil-cpp-20200923.3/build-static /tmp/B.u4f9ex94/BUILD/abseil-cpp-20200923.3/build-static/absl/random /tmp/B.u4f9ex94/BUILD/abseil-cpp-20200923.3/build-static/absl/random/CMakeFiles/random_internal_platform.dir/DependInfo.cmake --color= Scanning dependencies of target random_internal_platform make[2]: Leaving directory '/tmp/B.u4f9ex94/BUILD/abseil-cpp-20200923.3/build-static' /usr/bin/make -f absl/random/CMakeFiles/random_internal_platform.dir/build.make absl/random/CMakeFiles/random_internal_platform.dir/build make[2]: Entering directory '/tmp/B.u4f9ex94/BUILD/abseil-cpp-20200923.3/build-static' [ 7%] Building CXX object absl/random/CMakeFiles/random_internal_platform.dir/internal/randen_round_keys.cc.o cd /tmp/B.u4f9ex94/BUILD/abseil-cpp-20200923.3/build-static/absl/random && /usr/bin/i686-pld-linux-g++ -I/tmp/B.u4f9ex94/BUILD/abseil-cpp-20200923.3 -O2 -fwrapv -pipe -Wformat -Werror=format-security -gdwarf-4 -fno-debug-types-section -fvar-tracking-assignments -g2 -Wp,-D_FORTIFY_SOURCE=2 -fstack-protector-strong --param=ssp-buffer-size=4 -Werror=trampolines -fomit-frame-pointer -march=i686 -fasynchronous-unwind-tables -mtune=pentium4 -gdwarf-4 -fno-debug-types-section -fvar-tracking-assignments -g2 -DNDEBUG -DQT_NO_DEBUG -Wall -Wextra -Wcast-qual -Wconversion-null -Wmissing-declarations -Woverlength-strings -Wpointer-arith -Wundef -Wunused-local-typedefs -Wunused-result -Wvarargs -Wvla -Wwrite-strings -Wno-missing-field-initializers -Wno-sign-compare -DNOMINMAX -o CMakeFiles/random_internal_platform.dir/internal/randen_round_keys.cc.o -c /tmp/B.u4f9ex94/BUILD/abseil-cpp-20200923.3/absl/random/internal/randen_round_keys.cc make[2]: Leaving directory '/tmp/B.u4f9ex94/BUILD/abseil-cpp-20200923.3/build-static' make[2]: Entering directory '/tmp/B.u4f9ex94/BUILD/abseil-cpp-20200923.3/build-static' [ 7%] Linking CXX static library libabsl_flags_commandlineflag_internal.a cd /tmp/B.u4f9ex94/BUILD/abseil-cpp-20200923.3/build-static/absl/flags && /usr/bin/cmake -P CMakeFiles/flags_commandlineflag_internal.dir/cmake_clean_target.cmake cd /tmp/B.u4f9ex94/BUILD/abseil-cpp-20200923.3/build-static/absl/flags && /usr/bin/cmake -E cmake_link_script CMakeFiles/flags_commandlineflag_internal.dir/link.txt --verbose=1 /usr/bin/ar qc libabsl_flags_commandlineflag_internal.a CMakeFiles/flags_commandlineflag_internal.dir/internal/commandlineflag.cc.o /usr/bin/ranlib libabsl_flags_commandlineflag_internal.a make[2]: Leaving directory '/tmp/B.u4f9ex94/BUILD/abseil-cpp-20200923.3/build-static' make[2]: Entering directory '/tmp/B.u4f9ex94/BUILD/abseil-cpp-20200923.3/build-static' [ 0%] Building CXX object absl/base/CMakeFiles/strerror.dir/internal/strerror.cc.o cd /tmp/B.u4f9ex94/BUILD/abseil-cpp-20200923.3/build-static/absl/base && /usr/bin/i686-pld-linux-g++ -I/tmp/B.u4f9ex94/BUILD/abseil-cpp-20200923.3 -O2 -fwrapv -pipe -Wformat -Werror=format-security -gdwarf-4 -fno-debug-types-section -fvar-tracking-assignments -g2 -Wp,-D_FORTIFY_SOURCE=2 -fstack-protector-strong --param=ssp-buffer-size=4 -Werror=trampolines -fomit-frame-pointer -march=i686 -fasynchronous-unwind-tables -mtune=pentium4 -gdwarf-4 -fno-debug-types-section -fvar-tracking-assignments -g2 -DNDEBUG -DQT_NO_DEBUG -Wall -Wextra -Wcast-qual -Wconversion-null -Wmissing-declarations -Woverlength-strings -Wpointer-arith -Wundef -Wunused-local-typedefs -Wunused-result -Wvarargs -Wvla -Wwrite-strings -Wno-missing-field-initializers -Wno-sign-compare -DNOMINMAX -o CMakeFiles/strerror.dir/internal/strerror.cc.o -c /tmp/B.u4f9ex94/BUILD/abseil-cpp-20200923.3/absl/base/internal/strerror.cc make[2]: Leaving directory '/tmp/B.u4f9ex94/BUILD/abseil-cpp-20200923.3/build-static' make[1]: Entering directory '/tmp/B.u4f9ex94/BUILD/abseil-cpp-20200923.3/build-static' [ 8%] Built target flags_commandlineflag_internal make[1]: Leaving directory '/tmp/B.u4f9ex94/BUILD/abseil-cpp-20200923.3/build-static' make[2]: Entering directory '/tmp/B.u4f9ex94/BUILD/abseil-cpp-20200923.3/build-static' [ 2%] Building CXX object absl/base/CMakeFiles/log_severity.dir/log_severity.cc.o cd /tmp/B.u4f9ex94/BUILD/abseil-cpp-20200923.3/build-static/absl/base && /usr/bin/i686-pld-linux-g++ -I/tmp/B.u4f9ex94/BUILD/abseil-cpp-20200923.3 -O2 -fwrapv -pipe -Wformat -Werror=format-security -gdwarf-4 -fno-debug-types-section -fvar-tracking-assignments -g2 -Wp,-D_FORTIFY_SOURCE=2 -fstack-protector-strong --param=ssp-buffer-size=4 -Werror=trampolines -fomit-frame-pointer -march=i686 -fasynchronous-unwind-tables -mtune=pentium4 -gdwarf-4 -fno-debug-types-section -fvar-tracking-assignments -g2 -DNDEBUG -DQT_NO_DEBUG -Wall -Wextra -Wcast-qual -Wconversion-null -Wmissing-declarations -Woverlength-strings -Wpointer-arith -Wundef -Wunused-local-typedefs -Wunused-result -Wvarargs -Wvla -Wwrite-strings -Wno-missing-field-initializers -Wno-sign-compare -DNOMINMAX -o CMakeFiles/log_severity.dir/log_severity.cc.o -c /tmp/B.u4f9ex94/BUILD/abseil-cpp-20200923.3/absl/base/log_severity.cc make[2]: Leaving directory '/tmp/B.u4f9ex94/BUILD/abseil-cpp-20200923.3/build-static' /usr/bin/make -f absl/random/CMakeFiles/random_seed_gen_exception.dir/build.make absl/random/CMakeFiles/random_seed_gen_exception.dir/depend make[2]: Entering directory '/tmp/B.u4f9ex94/BUILD/abseil-cpp-20200923.3/build-static' [ 8%] Linking CXX static library libabsl_random_internal_platform.a cd /tmp/B.u4f9ex94/BUILD/abseil-cpp-20200923.3/build-static/absl/random && /usr/bin/cmake -P CMakeFiles/random_internal_platform.dir/cmake_clean_target.cmake cd /tmp/B.u4f9ex94/BUILD/abseil-cpp-20200923.3/build-static/absl/random && /usr/bin/cmake -E cmake_link_script CMakeFiles/random_internal_platform.dir/link.txt --verbose=1 /usr/bin/ar qc libabsl_random_internal_platform.a CMakeFiles/random_internal_platform.dir/internal/randen_round_keys.cc.o /usr/bin/ranlib libabsl_random_internal_platform.a make[2]: Leaving directory '/tmp/B.u4f9ex94/BUILD/abseil-cpp-20200923.3/build-static' make[2]: Entering directory '/tmp/B.u4f9ex94/BUILD/abseil-cpp-20200923.3/build-static' [ 9%] Linking CXX static library libabsl_strerror.a cd /tmp/B.u4f9ex94/BUILD/abseil-cpp-20200923.3/build-static/absl/base && /usr/bin/cmake -P CMakeFiles/strerror.dir/cmake_clean_target.cmake cd /tmp/B.u4f9ex94/BUILD/abseil-cpp-20200923.3/build-static/absl/base && /usr/bin/cmake -E cmake_link_script CMakeFiles/strerror.dir/link.txt --verbose=1 /usr/bin/ar qc libabsl_strerror.a CMakeFiles/strerror.dir/internal/strerror.cc.o /usr/bin/ranlib libabsl_strerror.a make[2]: Leaving directory '/tmp/B.u4f9ex94/BUILD/abseil-cpp-20200923.3/build-static' make[2]: Entering directory '/tmp/B.u4f9ex94/BUILD/abseil-cpp-20200923.3/build-static' cd /tmp/B.u4f9ex94/BUILD/abseil-cpp-20200923.3/build-static && /usr/bin/cmake -E cmake_depends "Unix Makefiles" /tmp/B.u4f9ex94/BUILD/abseil-cpp-20200923.3 /tmp/B.u4f9ex94/BUILD/abseil-cpp-20200923.3/absl/random /tmp/B.u4f9ex94/BUILD/abseil-cpp-20200923.3/build-static /tmp/B.u4f9ex94/BUILD/abseil-cpp-20200923.3/build-static/absl/random /tmp/B.u4f9ex94/BUILD/abseil-cpp-20200923.3/build-static/absl/random/CMakeFiles/random_seed_gen_exception.dir/DependInfo.cmake --color= Scanning dependencies of target random_seed_gen_exception make[2]: Leaving directory '/tmp/B.u4f9ex94/BUILD/abseil-cpp-20200923.3/build-static' /usr/bin/make -f absl/random/CMakeFiles/random_seed_gen_exception.dir/build.make absl/random/CMakeFiles/random_seed_gen_exception.dir/build make[1]: Entering directory '/tmp/B.u4f9ex94/BUILD/abseil-cpp-20200923.3/build-static' [ 10%] Built target random_internal_platform make[1]: Leaving directory '/tmp/B.u4f9ex94/BUILD/abseil-cpp-20200923.3/build-static' make[1]: Entering directory '/tmp/B.u4f9ex94/BUILD/abseil-cpp-20200923.3/build-static' [ 10%] Built target strerror make[1]: Leaving directory '/tmp/B.u4f9ex94/BUILD/abseil-cpp-20200923.3/build-static' /usr/bin/make -f absl/random/CMakeFiles/random_internal_randen_hwaes_impl.dir/build.make absl/random/CMakeFiles/random_internal_randen_hwaes_impl.dir/depend make[2]: Entering directory '/tmp/B.u4f9ex94/BUILD/abseil-cpp-20200923.3/build-static' cd /tmp/B.u4f9ex94/BUILD/abseil-cpp-20200923.3/build-static && /usr/bin/cmake -E cmake_depends "Unix Makefiles" /tmp/B.u4f9ex94/BUILD/abseil-cpp-20200923.3 /tmp/B.u4f9ex94/BUILD/abseil-cpp-20200923.3/absl/random /tmp/B.u4f9ex94/BUILD/abseil-cpp-20200923.3/build-static /tmp/B.u4f9ex94/BUILD/abseil-cpp-20200923.3/build-static/absl/random /tmp/B.u4f9ex94/BUILD/abseil-cpp-20200923.3/build-static/absl/random/CMakeFiles/random_internal_randen_hwaes_impl.dir/DependInfo.cmake --color= Scanning dependencies of target random_internal_randen_hwaes_impl make[2]: Leaving directory '/tmp/B.u4f9ex94/BUILD/abseil-cpp-20200923.3/build-static' /usr/bin/make -f absl/random/CMakeFiles/random_internal_randen_hwaes_impl.dir/build.make absl/random/CMakeFiles/random_internal_randen_hwaes_impl.dir/build make[2]: Entering directory '/tmp/B.u4f9ex94/BUILD/abseil-cpp-20200923.3/build-static' [ 10%] Linking CXX static library libabsl_log_severity.a cd /tmp/B.u4f9ex94/BUILD/abseil-cpp-20200923.3/build-static/absl/base && /usr/bin/cmake -P CMakeFiles/log_severity.dir/cmake_clean_target.cmake cd /tmp/B.u4f9ex94/BUILD/abseil-cpp-20200923.3/build-static/absl/base && /usr/bin/cmake -E cmake_link_script CMakeFiles/log_severity.dir/link.txt --verbose=1 /usr/bin/ar qc libabsl_log_severity.a CMakeFiles/log_severity.dir/log_severity.cc.o /usr/bin/ranlib libabsl_log_severity.a make[2]: Leaving directory '/tmp/B.u4f9ex94/BUILD/abseil-cpp-20200923.3/build-static' make[2]: Entering directory '/tmp/B.u4f9ex94/BUILD/abseil-cpp-20200923.3/build-static' [ 2%] Building CXX object absl/base/CMakeFiles/exponential_biased.dir/internal/exponential_biased.cc.o cd /tmp/B.u4f9ex94/BUILD/abseil-cpp-20200923.3/build-static/absl/base && /usr/bin/i686-pld-linux-g++ -I/tmp/B.u4f9ex94/BUILD/abseil-cpp-20200923.3 -O2 -fwrapv -pipe -Wformat -Werror=format-security -gdwarf-4 -fno-debug-types-section -fvar-tracking-assignments -g2 -Wp,-D_FORTIFY_SOURCE=2 -fstack-protector-strong --param=ssp-buffer-size=4 -Werror=trampolines -fomit-frame-pointer -march=i686 -fasynchronous-unwind-tables -mtune=pentium4 -gdwarf-4 -fno-debug-types-section -fvar-tracking-assignments -g2 -DNDEBUG -DQT_NO_DEBUG -Wall -Wextra -Wcast-qual -Wconversion-null -Wmissing-declarations -Woverlength-strings -Wpointer-arith -Wundef -Wunused-local-typedefs -Wunused-result -Wvarargs -Wvla -Wwrite-strings -Wno-missing-field-initializers -Wno-sign-compare -DNOMINMAX -o CMakeFiles/exponential_biased.dir/internal/exponential_biased.cc.o -c /tmp/B.u4f9ex94/BUILD/abseil-cpp-20200923.3/absl/base/internal/exponential_biased.cc make[2]: Leaving directory '/tmp/B.u4f9ex94/BUILD/abseil-cpp-20200923.3/build-static' make[1]: Entering directory '/tmp/B.u4f9ex94/BUILD/abseil-cpp-20200923.3/build-static' [ 12%] Built target log_severity make[1]: Leaving directory '/tmp/B.u4f9ex94/BUILD/abseil-cpp-20200923.3/build-static' make[2]: Entering directory '/tmp/B.u4f9ex94/BUILD/abseil-cpp-20200923.3/build-static' [ 12%] Building CXX object absl/random/CMakeFiles/random_internal_randen_hwaes_impl.dir/internal/randen_hwaes.cc.o cd /tmp/B.u4f9ex94/BUILD/abseil-cpp-20200923.3/build-static/absl/random && /usr/bin/i686-pld-linux-g++ -I/tmp/B.u4f9ex94/BUILD/abseil-cpp-20200923.3 -O2 -fwrapv -pipe -Wformat -Werror=format-security -gdwarf-4 -fno-debug-types-section -fvar-tracking-assignments -g2 -Wp,-D_FORTIFY_SOURCE=2 -fstack-protector-strong --param=ssp-buffer-size=4 -Werror=trampolines -fomit-frame-pointer -march=i686 -fasynchronous-unwind-tables -mtune=pentium4 -gdwarf-4 -fno-debug-types-section -fvar-tracking-assignments -g2 -DNDEBUG -DQT_NO_DEBUG -Wall -Wextra -Wcast-qual -Wconversion-null -Wmissing-declarations -Woverlength-strings -Wpointer-arith -Wundef -Wunused-local-typedefs -Wunused-result -Wvarargs -Wvla -Wwrite-strings -Wno-missing-field-initializers -Wno-sign-compare -DNOMINMAX -o CMakeFiles/random_internal_randen_hwaes_impl.dir/internal/randen_hwaes.cc.o -c /tmp/B.u4f9ex94/BUILD/abseil-cpp-20200923.3/absl/random/internal/randen_hwaes.cc make[2]: Leaving directory '/tmp/B.u4f9ex94/BUILD/abseil-cpp-20200923.3/build-static' make[2]: Entering directory '/tmp/B.u4f9ex94/BUILD/abseil-cpp-20200923.3/build-static' [ 13%] Linking CXX static library libabsl_random_internal_randen_hwaes_impl.a cd /tmp/B.u4f9ex94/BUILD/abseil-cpp-20200923.3/build-static/absl/random && /usr/bin/cmake -P CMakeFiles/random_internal_randen_hwaes_impl.dir/cmake_clean_target.cmake cd /tmp/B.u4f9ex94/BUILD/abseil-cpp-20200923.3/build-static/absl/random && /usr/bin/cmake -E cmake_link_script CMakeFiles/random_internal_randen_hwaes_impl.dir/link.txt --verbose=1 /usr/bin/ar qc libabsl_random_internal_randen_hwaes_impl.a CMakeFiles/random_internal_randen_hwaes_impl.dir/internal/randen_hwaes.cc.o /usr/bin/ranlib libabsl_random_internal_randen_hwaes_impl.a make[2]: Leaving directory '/tmp/B.u4f9ex94/BUILD/abseil-cpp-20200923.3/build-static' make[1]: Entering directory '/tmp/B.u4f9ex94/BUILD/abseil-cpp-20200923.3/build-static' [ 13%] Built target random_internal_randen_hwaes_impl make[1]: Leaving directory '/tmp/B.u4f9ex94/BUILD/abseil-cpp-20200923.3/build-static' make[2]: Entering directory '/tmp/B.u4f9ex94/BUILD/abseil-cpp-20200923.3/build-static' [ 13%] Linking CXX static library libabsl_exponential_biased.a cd /tmp/B.u4f9ex94/BUILD/abseil-cpp-20200923.3/build-static/absl/base && /usr/bin/cmake -P CMakeFiles/exponential_biased.dir/cmake_clean_target.cmake cd /tmp/B.u4f9ex94/BUILD/abseil-cpp-20200923.3/build-static/absl/base && /usr/bin/cmake -E cmake_link_script CMakeFiles/exponential_biased.dir/link.txt --verbose=1 /usr/bin/ar qc libabsl_exponential_biased.a CMakeFiles/exponential_biased.dir/internal/exponential_biased.cc.o /usr/bin/ranlib libabsl_exponential_biased.a make[2]: Leaving directory '/tmp/B.u4f9ex94/BUILD/abseil-cpp-20200923.3/build-static' make[1]: Entering directory '/tmp/B.u4f9ex94/BUILD/abseil-cpp-20200923.3/build-static' [ 14%] Built target exponential_biased make[1]: Leaving directory '/tmp/B.u4f9ex94/BUILD/abseil-cpp-20200923.3/build-static' make[2]: Entering directory '/tmp/B.u4f9ex94/BUILD/abseil-cpp-20200923.3/build-static' [ 6%] Building CXX object absl/hash/CMakeFiles/city.dir/internal/city.cc.o cd /tmp/B.u4f9ex94/BUILD/abseil-cpp-20200923.3/build-static/absl/hash && /usr/bin/i686-pld-linux-g++ -I/tmp/B.u4f9ex94/BUILD/abseil-cpp-20200923.3 -O2 -fwrapv -pipe -Wformat -Werror=format-security -gdwarf-4 -fno-debug-types-section -fvar-tracking-assignments -g2 -Wp,-D_FORTIFY_SOURCE=2 -fstack-protector-strong --param=ssp-buffer-size=4 -Werror=trampolines -fomit-frame-pointer -march=i686 -fasynchronous-unwind-tables -mtune=pentium4 -gdwarf-4 -fno-debug-types-section -fvar-tracking-assignments -g2 -DNDEBUG -DQT_NO_DEBUG -Wall -Wextra -Wcast-qual -Wconversion-null -Wmissing-declarations -Woverlength-strings -Wpointer-arith -Wundef -Wunused-local-typedefs -Wunused-result -Wvarargs -Wvla -Wwrite-strings -Wno-missing-field-initializers -Wno-sign-compare -DNOMINMAX -o CMakeFiles/city.dir/internal/city.cc.o -c /tmp/B.u4f9ex94/BUILD/abseil-cpp-20200923.3/absl/hash/internal/city.cc make[2]: Leaving directory '/tmp/B.u4f9ex94/BUILD/abseil-cpp-20200923.3/build-static' make[2]: Entering directory '/tmp/B.u4f9ex94/BUILD/abseil-cpp-20200923.3/build-static' [ 5%] Building CXX object absl/time/CMakeFiles/time_zone.dir/internal/cctz/src/time_zone_fixed.cc.o cd /tmp/B.u4f9ex94/BUILD/abseil-cpp-20200923.3/build-static/absl/time && /usr/bin/i686-pld-linux-g++ -I/tmp/B.u4f9ex94/BUILD/abseil-cpp-20200923.3 -O2 -fwrapv -pipe -Wformat -Werror=format-security -gdwarf-4 -fno-debug-types-section -fvar-tracking-assignments -g2 -Wp,-D_FORTIFY_SOURCE=2 -fstack-protector-strong --param=ssp-buffer-size=4 -Werror=trampolines -fomit-frame-pointer -march=i686 -fasynchronous-unwind-tables -mtune=pentium4 -gdwarf-4 -fno-debug-types-section -fvar-tracking-assignments -g2 -DNDEBUG -DQT_NO_DEBUG -Wall -Wextra -Wcast-qual -Wconversion-null -Wmissing-declarations -Woverlength-strings -Wpointer-arith -Wundef -Wunused-local-typedefs -Wunused-result -Wvarargs -Wvla -Wwrite-strings -Wno-missing-field-initializers -Wno-sign-compare -DNOMINMAX -o CMakeFiles/time_zone.dir/internal/cctz/src/time_zone_fixed.cc.o -c /tmp/B.u4f9ex94/BUILD/abseil-cpp-20200923.3/absl/time/internal/cctz/src/time_zone_fixed.cc make[2]: Leaving directory '/tmp/B.u4f9ex94/BUILD/abseil-cpp-20200923.3/build-static' /usr/bin/make -f absl/random/CMakeFiles/random_internal_randen_slow.dir/build.make absl/random/CMakeFiles/random_internal_randen_slow.dir/depend make[2]: Entering directory '/tmp/B.u4f9ex94/BUILD/abseil-cpp-20200923.3/build-static' [ 16%] Linking CXX static library libabsl_city.a cd /tmp/B.u4f9ex94/BUILD/abseil-cpp-20200923.3/build-static/absl/hash && /usr/bin/cmake -P CMakeFiles/city.dir/cmake_clean_target.cmake cd /tmp/B.u4f9ex94/BUILD/abseil-cpp-20200923.3/build-static/absl/hash && /usr/bin/cmake -E cmake_link_script CMakeFiles/city.dir/link.txt --verbose=1 /usr/bin/ar qc libabsl_city.a CMakeFiles/city.dir/internal/city.cc.o /usr/bin/ranlib libabsl_city.a make[2]: Leaving directory '/tmp/B.u4f9ex94/BUILD/abseil-cpp-20200923.3/build-static' make[2]: Entering directory '/tmp/B.u4f9ex94/BUILD/abseil-cpp-20200923.3/build-static' [ 2%] Building CXX object absl/time/CMakeFiles/civil_time.dir/internal/cctz/src/civil_time_detail.cc.o cd /tmp/B.u4f9ex94/BUILD/abseil-cpp-20200923.3/build-static/absl/time && /usr/bin/i686-pld-linux-g++ -I/tmp/B.u4f9ex94/BUILD/abseil-cpp-20200923.3 -O2 -fwrapv -pipe -Wformat -Werror=format-security -gdwarf-4 -fno-debug-types-section -fvar-tracking-assignments -g2 -Wp,-D_FORTIFY_SOURCE=2 -fstack-protector-strong --param=ssp-buffer-size=4 -Werror=trampolines -fomit-frame-pointer -march=i686 -fasynchronous-unwind-tables -mtune=pentium4 -gdwarf-4 -fno-debug-types-section -fvar-tracking-assignments -g2 -DNDEBUG -DQT_NO_DEBUG -Wall -Wextra -Wcast-qual -Wconversion-null -Wmissing-declarations -Woverlength-strings -Wpointer-arith -Wundef -Wunused-local-typedefs -Wunused-result -Wvarargs -Wvla -Wwrite-strings -Wno-missing-field-initializers -Wno-sign-compare -DNOMINMAX -o CMakeFiles/civil_time.dir/internal/cctz/src/civil_time_detail.cc.o -c /tmp/B.u4f9ex94/BUILD/abseil-cpp-20200923.3/absl/time/internal/cctz/src/civil_time_detail.cc make[2]: Leaving directory '/tmp/B.u4f9ex94/BUILD/abseil-cpp-20200923.3/build-static' make[2]: Entering directory '/tmp/B.u4f9ex94/BUILD/abseil-cpp-20200923.3/build-static' cd /tmp/B.u4f9ex94/BUILD/abseil-cpp-20200923.3/build-static && /usr/bin/cmake -E cmake_depends "Unix Makefiles" /tmp/B.u4f9ex94/BUILD/abseil-cpp-20200923.3 /tmp/B.u4f9ex94/BUILD/abseil-cpp-20200923.3/absl/random /tmp/B.u4f9ex94/BUILD/abseil-cpp-20200923.3/build-static /tmp/B.u4f9ex94/BUILD/abseil-cpp-20200923.3/build-static/absl/random /tmp/B.u4f9ex94/BUILD/abseil-cpp-20200923.3/build-static/absl/random/CMakeFiles/random_internal_randen_slow.dir/DependInfo.cmake --color= Scanning dependencies of target random_internal_randen_slow make[2]: Leaving directory '/tmp/B.u4f9ex94/BUILD/abseil-cpp-20200923.3/build-static' /usr/bin/make -f absl/random/CMakeFiles/random_internal_randen_slow.dir/build.make absl/random/CMakeFiles/random_internal_randen_slow.dir/build make[1]: Entering directory '/tmp/B.u4f9ex94/BUILD/abseil-cpp-20200923.3/build-static' [ 16%] Built target city make[1]: Leaving directory '/tmp/B.u4f9ex94/BUILD/abseil-cpp-20200923.3/build-static' make[2]: Entering directory '/tmp/B.u4f9ex94/BUILD/abseil-cpp-20200923.3/build-static' [ 11%] Building CXX object absl/random/CMakeFiles/random_seed_gen_exception.dir/seed_gen_exception.cc.o cd /tmp/B.u4f9ex94/BUILD/abseil-cpp-20200923.3/build-static/absl/random && /usr/bin/i686-pld-linux-g++ -I/tmp/B.u4f9ex94/BUILD/abseil-cpp-20200923.3 -O2 -fwrapv -pipe -Wformat -Werror=format-security -gdwarf-4 -fno-debug-types-section -fvar-tracking-assignments -g2 -Wp,-D_FORTIFY_SOURCE=2 -fstack-protector-strong --param=ssp-buffer-size=4 -Werror=trampolines -fomit-frame-pointer -march=i686 -fasynchronous-unwind-tables -mtune=pentium4 -gdwarf-4 -fno-debug-types-section -fvar-tracking-assignments -g2 -DNDEBUG -DQT_NO_DEBUG -Wall -Wextra -Wcast-qual -Wconversion-null -Wmissing-declarations -Woverlength-strings -Wpointer-arith -Wundef -Wunused-local-typedefs -Wunused-result -Wvarargs -Wvla -Wwrite-strings -Wno-missing-field-initializers -Wno-sign-compare -DNOMINMAX -o CMakeFiles/random_seed_gen_exception.dir/seed_gen_exception.cc.o -c /tmp/B.u4f9ex94/BUILD/abseil-cpp-20200923.3/absl/random/seed_gen_exception.cc make[2]: Leaving directory '/tmp/B.u4f9ex94/BUILD/abseil-cpp-20200923.3/build-static' make[2]: Entering directory '/tmp/B.u4f9ex94/BUILD/abseil-cpp-20200923.3/build-static' [ 17%] Linking CXX static library libabsl_civil_time.a cd /tmp/B.u4f9ex94/BUILD/abseil-cpp-20200923.3/build-static/absl/time && /usr/bin/cmake -P CMakeFiles/civil_time.dir/cmake_clean_target.cmake cd /tmp/B.u4f9ex94/BUILD/abseil-cpp-20200923.3/build-static/absl/time && /usr/bin/cmake -E cmake_link_script CMakeFiles/civil_time.dir/link.txt --verbose=1 /usr/bin/ar qc libabsl_civil_time.a CMakeFiles/civil_time.dir/internal/cctz/src/civil_time_detail.cc.o /usr/bin/ranlib libabsl_civil_time.a make[2]: Leaving directory '/tmp/B.u4f9ex94/BUILD/abseil-cpp-20200923.3/build-static' make[2]: Entering directory '/tmp/B.u4f9ex94/BUILD/abseil-cpp-20200923.3/build-static' [ 17%] Linking CXX static library libabsl_random_seed_gen_exception.a cd /tmp/B.u4f9ex94/BUILD/abseil-cpp-20200923.3/build-static/absl/random && /usr/bin/cmake -P CMakeFiles/random_seed_gen_exception.dir/cmake_clean_target.cmake cd /tmp/B.u4f9ex94/BUILD/abseil-cpp-20200923.3/build-static/absl/random && /usr/bin/cmake -E cmake_link_script CMakeFiles/random_seed_gen_exception.dir/link.txt --verbose=1 /usr/bin/ar qc libabsl_random_seed_gen_exception.a CMakeFiles/random_seed_gen_exception.dir/seed_gen_exception.cc.o /usr/bin/ranlib libabsl_random_seed_gen_exception.a make[2]: Leaving directory '/tmp/B.u4f9ex94/BUILD/abseil-cpp-20200923.3/build-static' make[1]: Entering directory '/tmp/B.u4f9ex94/BUILD/abseil-cpp-20200923.3/build-static' [ 17%] Built target civil_time make[1]: Leaving directory '/tmp/B.u4f9ex94/BUILD/abseil-cpp-20200923.3/build-static' /usr/bin/make -f absl/base/CMakeFiles/raw_logging_internal.dir/build.make absl/base/CMakeFiles/raw_logging_internal.dir/depend make[1]: Entering directory '/tmp/B.u4f9ex94/BUILD/abseil-cpp-20200923.3/build-static' [ 17%] Built target random_seed_gen_exception make[1]: Leaving directory '/tmp/B.u4f9ex94/BUILD/abseil-cpp-20200923.3/build-static' make[2]: Entering directory '/tmp/B.u4f9ex94/BUILD/abseil-cpp-20200923.3/build-static' cd /tmp/B.u4f9ex94/BUILD/abseil-cpp-20200923.3/build-static && /usr/bin/cmake -E cmake_depends "Unix Makefiles" /tmp/B.u4f9ex94/BUILD/abseil-cpp-20200923.3 /tmp/B.u4f9ex94/BUILD/abseil-cpp-20200923.3/absl/base /tmp/B.u4f9ex94/BUILD/abseil-cpp-20200923.3/build-static /tmp/B.u4f9ex94/BUILD/abseil-cpp-20200923.3/build-static/absl/base /tmp/B.u4f9ex94/BUILD/abseil-cpp-20200923.3/build-static/absl/base/CMakeFiles/raw_logging_internal.dir/DependInfo.cmake --color= Scanning dependencies of target raw_logging_internal make[2]: Leaving directory '/tmp/B.u4f9ex94/BUILD/abseil-cpp-20200923.3/build-static' /usr/bin/make -f absl/base/CMakeFiles/raw_logging_internal.dir/build.make absl/base/CMakeFiles/raw_logging_internal.dir/build make[2]: Entering directory '/tmp/B.u4f9ex94/BUILD/abseil-cpp-20200923.3/build-static' [ 17%] Building CXX object absl/random/CMakeFiles/random_internal_randen_slow.dir/internal/randen_slow.cc.o cd /tmp/B.u4f9ex94/BUILD/abseil-cpp-20200923.3/build-static/absl/random && /usr/bin/i686-pld-linux-g++ -I/tmp/B.u4f9ex94/BUILD/abseil-cpp-20200923.3 -O2 -fwrapv -pipe -Wformat -Werror=format-security -gdwarf-4 -fno-debug-types-section -fvar-tracking-assignments -g2 -Wp,-D_FORTIFY_SOURCE=2 -fstack-protector-strong --param=ssp-buffer-size=4 -Werror=trampolines -fomit-frame-pointer -march=i686 -fasynchronous-unwind-tables -mtune=pentium4 -gdwarf-4 -fno-debug-types-section -fvar-tracking-assignments -g2 -DNDEBUG -DQT_NO_DEBUG -Wall -Wextra -Wcast-qual -Wconversion-null -Wmissing-declarations -Woverlength-strings -Wpointer-arith -Wundef -Wunused-local-typedefs -Wunused-result -Wvarargs -Wvla -Wwrite-strings -Wno-missing-field-initializers -Wno-sign-compare -DNOMINMAX -o CMakeFiles/random_internal_randen_slow.dir/internal/randen_slow.cc.o -c /tmp/B.u4f9ex94/BUILD/abseil-cpp-20200923.3/absl/random/internal/randen_slow.cc make[2]: Leaving directory '/tmp/B.u4f9ex94/BUILD/abseil-cpp-20200923.3/build-static' make[2]: Entering directory '/tmp/B.u4f9ex94/BUILD/abseil-cpp-20200923.3/build-static' [ 3%] Building CXX object absl/numeric/CMakeFiles/int128.dir/int128.cc.o cd /tmp/B.u4f9ex94/BUILD/abseil-cpp-20200923.3/build-static/absl/numeric && /usr/bin/i686-pld-linux-g++ -I/tmp/B.u4f9ex94/BUILD/abseil-cpp-20200923.3 -O2 -fwrapv -pipe -Wformat -Werror=format-security -gdwarf-4 -fno-debug-types-section -fvar-tracking-assignments -g2 -Wp,-D_FORTIFY_SOURCE=2 -fstack-protector-strong --param=ssp-buffer-size=4 -Werror=trampolines -fomit-frame-pointer -march=i686 -fasynchronous-unwind-tables -mtune=pentium4 -gdwarf-4 -fno-debug-types-section -fvar-tracking-assignments -g2 -DNDEBUG -DQT_NO_DEBUG -Wall -Wextra -Wcast-qual -Wconversion-null -Wmissing-declarations -Woverlength-strings -Wpointer-arith -Wundef -Wunused-local-typedefs -Wunused-result -Wvarargs -Wvla -Wwrite-strings -Wno-missing-field-initializers -Wno-sign-compare -DNOMINMAX -o CMakeFiles/int128.dir/int128.cc.o -c /tmp/B.u4f9ex94/BUILD/abseil-cpp-20200923.3/absl/numeric/int128.cc make[2]: Leaving directory '/tmp/B.u4f9ex94/BUILD/abseil-cpp-20200923.3/build-static' make[2]: Entering directory '/tmp/B.u4f9ex94/BUILD/abseil-cpp-20200923.3/build-static' [ 19%] Linking CXX static library libabsl_random_internal_randen_slow.a cd /tmp/B.u4f9ex94/BUILD/abseil-cpp-20200923.3/build-static/absl/random && /usr/bin/cmake -P CMakeFiles/random_internal_randen_slow.dir/cmake_clean_target.cmake cd /tmp/B.u4f9ex94/BUILD/abseil-cpp-20200923.3/build-static/absl/random && /usr/bin/cmake -E cmake_link_script CMakeFiles/random_internal_randen_slow.dir/link.txt --verbose=1 /usr/bin/ar qc libabsl_random_internal_randen_slow.a CMakeFiles/random_internal_randen_slow.dir/internal/randen_slow.cc.o /usr/bin/ranlib libabsl_random_internal_randen_slow.a make[2]: Leaving directory '/tmp/B.u4f9ex94/BUILD/abseil-cpp-20200923.3/build-static' make[1]: Entering directory '/tmp/B.u4f9ex94/BUILD/abseil-cpp-20200923.3/build-static' [ 19%] Built target random_internal_randen_slow make[1]: Leaving directory '/tmp/B.u4f9ex94/BUILD/abseil-cpp-20200923.3/build-static' make[2]: Entering directory '/tmp/B.u4f9ex94/BUILD/abseil-cpp-20200923.3/build-static' [ 19%] Linking CXX static library libabsl_int128.a cd /tmp/B.u4f9ex94/BUILD/abseil-cpp-20200923.3/build-static/absl/numeric && /usr/bin/cmake -P CMakeFiles/int128.dir/cmake_clean_target.cmake cd /tmp/B.u4f9ex94/BUILD/abseil-cpp-20200923.3/build-static/absl/numeric && /usr/bin/cmake -E cmake_link_script CMakeFiles/int128.dir/link.txt --verbose=1 /usr/bin/ar qc libabsl_int128.a CMakeFiles/int128.dir/int128.cc.o /usr/bin/ranlib libabsl_int128.a make[2]: Leaving directory '/tmp/B.u4f9ex94/BUILD/abseil-cpp-20200923.3/build-static' make[1]: Entering directory '/tmp/B.u4f9ex94/BUILD/abseil-cpp-20200923.3/build-static' [ 19%] Built target int128 make[1]: Leaving directory '/tmp/B.u4f9ex94/BUILD/abseil-cpp-20200923.3/build-static' /usr/bin/make -f absl/base/CMakeFiles/periodic_sampler.dir/build.make absl/base/CMakeFiles/periodic_sampler.dir/depend make[2]: Entering directory '/tmp/B.u4f9ex94/BUILD/abseil-cpp-20200923.3/build-static' cd /tmp/B.u4f9ex94/BUILD/abseil-cpp-20200923.3/build-static && /usr/bin/cmake -E cmake_depends "Unix Makefiles" /tmp/B.u4f9ex94/BUILD/abseil-cpp-20200923.3 /tmp/B.u4f9ex94/BUILD/abseil-cpp-20200923.3/absl/base /tmp/B.u4f9ex94/BUILD/abseil-cpp-20200923.3/build-static /tmp/B.u4f9ex94/BUILD/abseil-cpp-20200923.3/build-static/absl/base /tmp/B.u4f9ex94/BUILD/abseil-cpp-20200923.3/build-static/absl/base/CMakeFiles/periodic_sampler.dir/DependInfo.cmake --color= Scanning dependencies of target periodic_sampler make[2]: Leaving directory '/tmp/B.u4f9ex94/BUILD/abseil-cpp-20200923.3/build-static' /usr/bin/make -f absl/base/CMakeFiles/periodic_sampler.dir/build.make absl/base/CMakeFiles/periodic_sampler.dir/build make[2]: Entering directory '/tmp/B.u4f9ex94/BUILD/abseil-cpp-20200923.3/build-static' [ 18%] Building CXX object absl/base/CMakeFiles/raw_logging_internal.dir/internal/raw_logging.cc.o cd /tmp/B.u4f9ex94/BUILD/abseil-cpp-20200923.3/build-static/absl/base && /usr/bin/i686-pld-linux-g++ -I/tmp/B.u4f9ex94/BUILD/abseil-cpp-20200923.3 -O2 -fwrapv -pipe -Wformat -Werror=format-security -gdwarf-4 -fno-debug-types-section -fvar-tracking-assignments -g2 -Wp,-D_FORTIFY_SOURCE=2 -fstack-protector-strong --param=ssp-buffer-size=4 -Werror=trampolines -fomit-frame-pointer -march=i686 -fasynchronous-unwind-tables -mtune=pentium4 -gdwarf-4 -fno-debug-types-section -fvar-tracking-assignments -g2 -DNDEBUG -DQT_NO_DEBUG -Wall -Wextra -Wcast-qual -Wconversion-null -Wmissing-declarations -Woverlength-strings -Wpointer-arith -Wundef -Wunused-local-typedefs -Wunused-result -Wvarargs -Wvla -Wwrite-strings -Wno-missing-field-initializers -Wno-sign-compare -DNOMINMAX -o CMakeFiles/raw_logging_internal.dir/internal/raw_logging.cc.o -c /tmp/B.u4f9ex94/BUILD/abseil-cpp-20200923.3/absl/base/internal/raw_logging.cc make[2]: Leaving directory '/tmp/B.u4f9ex94/BUILD/abseil-cpp-20200923.3/build-static' make[2]: Entering directory '/tmp/B.u4f9ex94/BUILD/abseil-cpp-20200923.3/build-static' [ 12%] Building CXX object absl/time/CMakeFiles/time_zone.dir/internal/cctz/src/time_zone_if.cc.o cd /tmp/B.u4f9ex94/BUILD/abseil-cpp-20200923.3/build-static/absl/time && /usr/bin/i686-pld-linux-g++ -I/tmp/B.u4f9ex94/BUILD/abseil-cpp-20200923.3 -O2 -fwrapv -pipe -Wformat -Werror=format-security -gdwarf-4 -fno-debug-types-section -fvar-tracking-assignments -g2 -Wp,-D_FORTIFY_SOURCE=2 -fstack-protector-strong --param=ssp-buffer-size=4 -Werror=trampolines -fomit-frame-pointer -march=i686 -fasynchronous-unwind-tables -mtune=pentium4 -gdwarf-4 -fno-debug-types-section -fvar-tracking-assignments -g2 -DNDEBUG -DQT_NO_DEBUG -Wall -Wextra -Wcast-qual -Wconversion-null -Wmissing-declarations -Woverlength-strings -Wpointer-arith -Wundef -Wunused-local-typedefs -Wunused-result -Wvarargs -Wvla -Wwrite-strings -Wno-missing-field-initializers -Wno-sign-compare -DNOMINMAX -o CMakeFiles/time_zone.dir/internal/cctz/src/time_zone_if.cc.o -c /tmp/B.u4f9ex94/BUILD/abseil-cpp-20200923.3/absl/time/internal/cctz/src/time_zone_if.cc make[2]: Leaving directory '/tmp/B.u4f9ex94/BUILD/abseil-cpp-20200923.3/build-static' make[2]: Entering directory '/tmp/B.u4f9ex94/BUILD/abseil-cpp-20200923.3/build-static' [ 21%] Linking CXX static library libabsl_raw_logging_internal.a cd /tmp/B.u4f9ex94/BUILD/abseil-cpp-20200923.3/build-static/absl/base && /usr/bin/cmake -P CMakeFiles/raw_logging_internal.dir/cmake_clean_target.cmake cd /tmp/B.u4f9ex94/BUILD/abseil-cpp-20200923.3/build-static/absl/base && /usr/bin/cmake -E cmake_link_script CMakeFiles/raw_logging_internal.dir/link.txt --verbose=1 /usr/bin/ar qc libabsl_raw_logging_internal.a CMakeFiles/raw_logging_internal.dir/internal/raw_logging.cc.o /usr/bin/ranlib libabsl_raw_logging_internal.a make[2]: Leaving directory '/tmp/B.u4f9ex94/BUILD/abseil-cpp-20200923.3/build-static' make[1]: Entering directory '/tmp/B.u4f9ex94/BUILD/abseil-cpp-20200923.3/build-static' [ 22%] Built target raw_logging_internal make[1]: Leaving directory '/tmp/B.u4f9ex94/BUILD/abseil-cpp-20200923.3/build-static' /usr/bin/make -f absl/random/CMakeFiles/random_internal_randen_hwaes.dir/build.make absl/random/CMakeFiles/random_internal_randen_hwaes.dir/depend make[2]: Entering directory '/tmp/B.u4f9ex94/BUILD/abseil-cpp-20200923.3/build-static' [ 19%] Building CXX object absl/time/CMakeFiles/time_zone.dir/internal/cctz/src/time_zone_posix.cc.o cd /tmp/B.u4f9ex94/BUILD/abseil-cpp-20200923.3/build-static/absl/time && /usr/bin/i686-pld-linux-g++ -I/tmp/B.u4f9ex94/BUILD/abseil-cpp-20200923.3 -O2 -fwrapv -pipe -Wformat -Werror=format-security -gdwarf-4 -fno-debug-types-section -fvar-tracking-assignments -g2 -Wp,-D_FORTIFY_SOURCE=2 -fstack-protector-strong --param=ssp-buffer-size=4 -Werror=trampolines -fomit-frame-pointer -march=i686 -fasynchronous-unwind-tables -mtune=pentium4 -gdwarf-4 -fno-debug-types-section -fvar-tracking-assignments -g2 -DNDEBUG -DQT_NO_DEBUG -Wall -Wextra -Wcast-qual -Wconversion-null -Wmissing-declarations -Woverlength-strings -Wpointer-arith -Wundef -Wunused-local-typedefs -Wunused-result -Wvarargs -Wvla -Wwrite-strings -Wno-missing-field-initializers -Wno-sign-compare -DNOMINMAX -o CMakeFiles/time_zone.dir/internal/cctz/src/time_zone_posix.cc.o -c /tmp/B.u4f9ex94/BUILD/abseil-cpp-20200923.3/absl/time/internal/cctz/src/time_zone_posix.cc make[2]: Leaving directory '/tmp/B.u4f9ex94/BUILD/abseil-cpp-20200923.3/build-static' make[2]: Entering directory '/tmp/B.u4f9ex94/BUILD/abseil-cpp-20200923.3/build-static' [ 20%] Building CXX object absl/base/CMakeFiles/periodic_sampler.dir/internal/periodic_sampler.cc.o cd /tmp/B.u4f9ex94/BUILD/abseil-cpp-20200923.3/build-static/absl/base && /usr/bin/i686-pld-linux-g++ -I/tmp/B.u4f9ex94/BUILD/abseil-cpp-20200923.3 -O2 -fwrapv -pipe -Wformat -Werror=format-security -gdwarf-4 -fno-debug-types-section -fvar-tracking-assignments -g2 -Wp,-D_FORTIFY_SOURCE=2 -fstack-protector-strong --param=ssp-buffer-size=4 -Werror=trampolines -fomit-frame-pointer -march=i686 -fasynchronous-unwind-tables -mtune=pentium4 -gdwarf-4 -fno-debug-types-section -fvar-tracking-assignments -g2 -DNDEBUG -DQT_NO_DEBUG -Wall -Wextra -Wcast-qual -Wconversion-null -Wmissing-declarations -Woverlength-strings -Wpointer-arith -Wundef -Wunused-local-typedefs -Wunused-result -Wvarargs -Wvla -Wwrite-strings -Wno-missing-field-initializers -Wno-sign-compare -DNOMINMAX -o CMakeFiles/periodic_sampler.dir/internal/periodic_sampler.cc.o -c /tmp/B.u4f9ex94/BUILD/abseil-cpp-20200923.3/absl/base/internal/periodic_sampler.cc make[2]: Leaving directory '/tmp/B.u4f9ex94/BUILD/abseil-cpp-20200923.3/build-static' /usr/bin/make -f absl/types/CMakeFiles/bad_any_cast_impl.dir/build.make absl/types/CMakeFiles/bad_any_cast_impl.dir/depend make[2]: Entering directory '/tmp/B.u4f9ex94/BUILD/abseil-cpp-20200923.3/build-static' cd /tmp/B.u4f9ex94/BUILD/abseil-cpp-20200923.3/build-static && /usr/bin/cmake -E cmake_depends "Unix Makefiles" /tmp/B.u4f9ex94/BUILD/abseil-cpp-20200923.3 /tmp/B.u4f9ex94/BUILD/abseil-cpp-20200923.3/absl/random /tmp/B.u4f9ex94/BUILD/abseil-cpp-20200923.3/build-static /tmp/B.u4f9ex94/BUILD/abseil-cpp-20200923.3/build-static/absl/random /tmp/B.u4f9ex94/BUILD/abseil-cpp-20200923.3/build-static/absl/random/CMakeFiles/random_internal_randen_hwaes.dir/DependInfo.cmake --color= Scanning dependencies of target random_internal_randen_hwaes make[2]: Leaving directory '/tmp/B.u4f9ex94/BUILD/abseil-cpp-20200923.3/build-static' /usr/bin/make -f absl/random/CMakeFiles/random_internal_randen_hwaes.dir/build.make absl/random/CMakeFiles/random_internal_randen_hwaes.dir/build make[2]: Entering directory '/tmp/B.u4f9ex94/BUILD/abseil-cpp-20200923.3/build-static' cd /tmp/B.u4f9ex94/BUILD/abseil-cpp-20200923.3/build-static && /usr/bin/cmake -E cmake_depends "Unix Makefiles" /tmp/B.u4f9ex94/BUILD/abseil-cpp-20200923.3 /tmp/B.u4f9ex94/BUILD/abseil-cpp-20200923.3/absl/types /tmp/B.u4f9ex94/BUILD/abseil-cpp-20200923.3/build-static /tmp/B.u4f9ex94/BUILD/abseil-cpp-20200923.3/build-static/absl/types /tmp/B.u4f9ex94/BUILD/abseil-cpp-20200923.3/build-static/absl/types/CMakeFiles/bad_any_cast_impl.dir/DependInfo.cmake --color= Scanning dependencies of target bad_any_cast_impl make[2]: Leaving directory '/tmp/B.u4f9ex94/BUILD/abseil-cpp-20200923.3/build-static' /usr/bin/make -f absl/types/CMakeFiles/bad_any_cast_impl.dir/build.make absl/types/CMakeFiles/bad_any_cast_impl.dir/build make[2]: Entering directory '/tmp/B.u4f9ex94/BUILD/abseil-cpp-20200923.3/build-static' [ 23%] Building CXX object absl/random/CMakeFiles/random_internal_randen_hwaes.dir/internal/randen_detect.cc.o cd /tmp/B.u4f9ex94/BUILD/abseil-cpp-20200923.3/build-static/absl/random && /usr/bin/i686-pld-linux-g++ -I/tmp/B.u4f9ex94/BUILD/abseil-cpp-20200923.3 -O2 -fwrapv -pipe -Wformat -Werror=format-security -gdwarf-4 -fno-debug-types-section -fvar-tracking-assignments -g2 -Wp,-D_FORTIFY_SOURCE=2 -fstack-protector-strong --param=ssp-buffer-size=4 -Werror=trampolines -fomit-frame-pointer -march=i686 -fasynchronous-unwind-tables -mtune=pentium4 -gdwarf-4 -fno-debug-types-section -fvar-tracking-assignments -g2 -DNDEBUG -DQT_NO_DEBUG -Wall -Wextra -Wcast-qual -Wconversion-null -Wmissing-declarations -Woverlength-strings -Wpointer-arith -Wundef -Wunused-local-typedefs -Wunused-result -Wvarargs -Wvla -Wwrite-strings -Wno-missing-field-initializers -Wno-sign-compare -DNOMINMAX -o CMakeFiles/random_internal_randen_hwaes.dir/internal/randen_detect.cc.o -c /tmp/B.u4f9ex94/BUILD/abseil-cpp-20200923.3/absl/random/internal/randen_detect.cc make[2]: Leaving directory '/tmp/B.u4f9ex94/BUILD/abseil-cpp-20200923.3/build-static' make[2]: Entering directory '/tmp/B.u4f9ex94/BUILD/abseil-cpp-20200923.3/build-static' [ 22%] Linking CXX static library libabsl_periodic_sampler.a cd /tmp/B.u4f9ex94/BUILD/abseil-cpp-20200923.3/build-static/absl/base && /usr/bin/cmake -P CMakeFiles/periodic_sampler.dir/cmake_clean_target.cmake cd /tmp/B.u4f9ex94/BUILD/abseil-cpp-20200923.3/build-static/absl/base && /usr/bin/cmake -E cmake_link_script CMakeFiles/periodic_sampler.dir/link.txt --verbose=1 /usr/bin/ar qc libabsl_periodic_sampler.a CMakeFiles/periodic_sampler.dir/internal/periodic_sampler.cc.o /usr/bin/ranlib libabsl_periodic_sampler.a make[2]: Leaving directory '/tmp/B.u4f9ex94/BUILD/abseil-cpp-20200923.3/build-static' make[1]: Entering directory '/tmp/B.u4f9ex94/BUILD/abseil-cpp-20200923.3/build-static' [ 24%] Built target periodic_sampler make[1]: Leaving directory '/tmp/B.u4f9ex94/BUILD/abseil-cpp-20200923.3/build-static' /usr/bin/make -f absl/base/CMakeFiles/scoped_set_env.dir/build.make absl/base/CMakeFiles/scoped_set_env.dir/depend make[2]: Entering directory '/tmp/B.u4f9ex94/BUILD/abseil-cpp-20200923.3/build-static' [ 23%] Building CXX object absl/types/CMakeFiles/bad_any_cast_impl.dir/bad_any_cast.cc.o cd /tmp/B.u4f9ex94/BUILD/abseil-cpp-20200923.3/build-static/absl/types && /usr/bin/i686-pld-linux-g++ -I/tmp/B.u4f9ex94/BUILD/abseil-cpp-20200923.3 -O2 -fwrapv -pipe -Wformat -Werror=format-security -gdwarf-4 -fno-debug-types-section -fvar-tracking-assignments -g2 -Wp,-D_FORTIFY_SOURCE=2 -fstack-protector-strong --param=ssp-buffer-size=4 -Werror=trampolines -fomit-frame-pointer -march=i686 -fasynchronous-unwind-tables -mtune=pentium4 -gdwarf-4 -fno-debug-types-section -fvar-tracking-assignments -g2 -DNDEBUG -DQT_NO_DEBUG -Wall -Wextra -Wcast-qual -Wconversion-null -Wmissing-declarations -Woverlength-strings -Wpointer-arith -Wundef -Wunused-local-typedefs -Wunused-result -Wvarargs -Wvla -Wwrite-strings -Wno-missing-field-initializers -Wno-sign-compare -DNOMINMAX -o CMakeFiles/bad_any_cast_impl.dir/bad_any_cast.cc.o -c /tmp/B.u4f9ex94/BUILD/abseil-cpp-20200923.3/absl/types/bad_any_cast.cc make[2]: Leaving directory '/tmp/B.u4f9ex94/BUILD/abseil-cpp-20200923.3/build-static' make[2]: Entering directory '/tmp/B.u4f9ex94/BUILD/abseil-cpp-20200923.3/build-static' cd /tmp/B.u4f9ex94/BUILD/abseil-cpp-20200923.3/build-static && /usr/bin/cmake -E cmake_depends "Unix Makefiles" /tmp/B.u4f9ex94/BUILD/abseil-cpp-20200923.3 /tmp/B.u4f9ex94/BUILD/abseil-cpp-20200923.3/absl/base /tmp/B.u4f9ex94/BUILD/abseil-cpp-20200923.3/build-static /tmp/B.u4f9ex94/BUILD/abseil-cpp-20200923.3/build-static/absl/base /tmp/B.u4f9ex94/BUILD/abseil-cpp-20200923.3/build-static/absl/base/CMakeFiles/scoped_set_env.dir/DependInfo.cmake --color= Scanning dependencies of target scoped_set_env make[2]: Leaving directory '/tmp/B.u4f9ex94/BUILD/abseil-cpp-20200923.3/build-static' /usr/bin/make -f absl/base/CMakeFiles/scoped_set_env.dir/build.make absl/base/CMakeFiles/scoped_set_env.dir/build make[2]: Entering directory '/tmp/B.u4f9ex94/BUILD/abseil-cpp-20200923.3/build-static' [ 24%] Linking CXX static library libabsl_random_internal_randen_hwaes.a cd /tmp/B.u4f9ex94/BUILD/abseil-cpp-20200923.3/build-static/absl/random && /usr/bin/cmake -P CMakeFiles/random_internal_randen_hwaes.dir/cmake_clean_target.cmake cd /tmp/B.u4f9ex94/BUILD/abseil-cpp-20200923.3/build-static/absl/random && /usr/bin/cmake -E cmake_link_script CMakeFiles/random_internal_randen_hwaes.dir/link.txt --verbose=1 /usr/bin/ar qc libabsl_random_internal_randen_hwaes.a CMakeFiles/random_internal_randen_hwaes.dir/internal/randen_detect.cc.o /usr/bin/ranlib libabsl_random_internal_randen_hwaes.a make[2]: Leaving directory '/tmp/B.u4f9ex94/BUILD/abseil-cpp-20200923.3/build-static' make[1]: Entering directory '/tmp/B.u4f9ex94/BUILD/abseil-cpp-20200923.3/build-static' [ 26%] Built target random_internal_randen_hwaes make[1]: Leaving directory '/tmp/B.u4f9ex94/BUILD/abseil-cpp-20200923.3/build-static' /usr/bin/make -f absl/base/CMakeFiles/base.dir/build.make absl/base/CMakeFiles/base.dir/depend make[2]: Entering directory '/tmp/B.u4f9ex94/BUILD/abseil-cpp-20200923.3/build-static' cd /tmp/B.u4f9ex94/BUILD/abseil-cpp-20200923.3/build-static && /usr/bin/cmake -E cmake_depends "Unix Makefiles" /tmp/B.u4f9ex94/BUILD/abseil-cpp-20200923.3 /tmp/B.u4f9ex94/BUILD/abseil-cpp-20200923.3/absl/base /tmp/B.u4f9ex94/BUILD/abseil-cpp-20200923.3/build-static /tmp/B.u4f9ex94/BUILD/abseil-cpp-20200923.3/build-static/absl/base /tmp/B.u4f9ex94/BUILD/abseil-cpp-20200923.3/build-static/absl/base/CMakeFiles/base.dir/DependInfo.cmake --color= Scanning dependencies of target base make[2]: Leaving directory '/tmp/B.u4f9ex94/BUILD/abseil-cpp-20200923.3/build-static' /usr/bin/make -f absl/base/CMakeFiles/base.dir/build.make absl/base/CMakeFiles/base.dir/build make[2]: Entering directory '/tmp/B.u4f9ex94/BUILD/abseil-cpp-20200923.3/build-static' [ 25%] Linking CXX static library libabsl_bad_any_cast_impl.a cd /tmp/B.u4f9ex94/BUILD/abseil-cpp-20200923.3/build-static/absl/types && /usr/bin/cmake -P CMakeFiles/bad_any_cast_impl.dir/cmake_clean_target.cmake cd /tmp/B.u4f9ex94/BUILD/abseil-cpp-20200923.3/build-static/absl/types && /usr/bin/cmake -E cmake_link_script CMakeFiles/bad_any_cast_impl.dir/link.txt --verbose=1 /usr/bin/ar qc libabsl_bad_any_cast_impl.a CMakeFiles/bad_any_cast_impl.dir/bad_any_cast.cc.o /usr/bin/ranlib libabsl_bad_any_cast_impl.a make[2]: Leaving directory '/tmp/B.u4f9ex94/BUILD/abseil-cpp-20200923.3/build-static' make[1]: Entering directory '/tmp/B.u4f9ex94/BUILD/abseil-cpp-20200923.3/build-static' [ 27%] Built target bad_any_cast_impl make[1]: Leaving directory '/tmp/B.u4f9ex94/BUILD/abseil-cpp-20200923.3/build-static' /usr/bin/make -f absl/base/CMakeFiles/throw_delegate.dir/build.make absl/base/CMakeFiles/throw_delegate.dir/depend make[2]: Entering directory '/tmp/B.u4f9ex94/BUILD/abseil-cpp-20200923.3/build-static' cd /tmp/B.u4f9ex94/BUILD/abseil-cpp-20200923.3/build-static && /usr/bin/cmake -E cmake_depends "Unix Makefiles" /tmp/B.u4f9ex94/BUILD/abseil-cpp-20200923.3 /tmp/B.u4f9ex94/BUILD/abseil-cpp-20200923.3/absl/base /tmp/B.u4f9ex94/BUILD/abseil-cpp-20200923.3/build-static /tmp/B.u4f9ex94/BUILD/abseil-cpp-20200923.3/build-static/absl/base /tmp/B.u4f9ex94/BUILD/abseil-cpp-20200923.3/build-static/absl/base/CMakeFiles/throw_delegate.dir/DependInfo.cmake --color= Scanning dependencies of target throw_delegate make[2]: Leaving directory '/tmp/B.u4f9ex94/BUILD/abseil-cpp-20200923.3/build-static' /usr/bin/make -f absl/base/CMakeFiles/throw_delegate.dir/build.make absl/base/CMakeFiles/throw_delegate.dir/build make[2]: Entering directory '/tmp/B.u4f9ex94/BUILD/abseil-cpp-20200923.3/build-static' [ 17%] Building CXX object absl/time/CMakeFiles/time_zone.dir/internal/cctz/src/time_zone_libc.cc.o cd /tmp/B.u4f9ex94/BUILD/abseil-cpp-20200923.3/build-static/absl/time && /usr/bin/i686-pld-linux-g++ -I/tmp/B.u4f9ex94/BUILD/abseil-cpp-20200923.3 -O2 -fwrapv -pipe -Wformat -Werror=format-security -gdwarf-4 -fno-debug-types-section -fvar-tracking-assignments -g2 -Wp,-D_FORTIFY_SOURCE=2 -fstack-protector-strong --param=ssp-buffer-size=4 -Werror=trampolines -fomit-frame-pointer -march=i686 -fasynchronous-unwind-tables -mtune=pentium4 -gdwarf-4 -fno-debug-types-section -fvar-tracking-assignments -g2 -DNDEBUG -DQT_NO_DEBUG -Wall -Wextra -Wcast-qual -Wconversion-null -Wmissing-declarations -Woverlength-strings -Wpointer-arith -Wundef -Wunused-local-typedefs -Wunused-result -Wvarargs -Wvla -Wwrite-strings -Wno-missing-field-initializers -Wno-sign-compare -DNOMINMAX -o CMakeFiles/time_zone.dir/internal/cctz/src/time_zone_libc.cc.o -c /tmp/B.u4f9ex94/BUILD/abseil-cpp-20200923.3/absl/time/internal/cctz/src/time_zone_libc.cc make[2]: Leaving directory '/tmp/B.u4f9ex94/BUILD/abseil-cpp-20200923.3/build-static' /usr/bin/make -f absl/types/CMakeFiles/bad_optional_access.dir/build.make absl/types/CMakeFiles/bad_optional_access.dir/depend make[2]: Entering directory '/tmp/B.u4f9ex94/BUILD/abseil-cpp-20200923.3/build-static' cd /tmp/B.u4f9ex94/BUILD/abseil-cpp-20200923.3/build-static && /usr/bin/cmake -E cmake_depends "Unix Makefiles" /tmp/B.u4f9ex94/BUILD/abseil-cpp-20200923.3 /tmp/B.u4f9ex94/BUILD/abseil-cpp-20200923.3/absl/types /tmp/B.u4f9ex94/BUILD/abseil-cpp-20200923.3/build-static /tmp/B.u4f9ex94/BUILD/abseil-cpp-20200923.3/build-static/absl/types /tmp/B.u4f9ex94/BUILD/abseil-cpp-20200923.3/build-static/absl/types/CMakeFiles/bad_optional_access.dir/DependInfo.cmake --color= Scanning dependencies of target bad_optional_access make[2]: Leaving directory '/tmp/B.u4f9ex94/BUILD/abseil-cpp-20200923.3/build-static' /usr/bin/make -f absl/types/CMakeFiles/bad_optional_access.dir/build.make absl/types/CMakeFiles/bad_optional_access.dir/build make[2]: Entering directory '/tmp/B.u4f9ex94/BUILD/abseil-cpp-20200923.3/build-static' [ 18%] Building CXX object absl/time/CMakeFiles/time_zone.dir/internal/cctz/src/time_zone_lookup.cc.o cd /tmp/B.u4f9ex94/BUILD/abseil-cpp-20200923.3/build-static/absl/time && /usr/bin/i686-pld-linux-g++ -I/tmp/B.u4f9ex94/BUILD/abseil-cpp-20200923.3 -O2 -fwrapv -pipe -Wformat -Werror=format-security -gdwarf-4 -fno-debug-types-section -fvar-tracking-assignments -g2 -Wp,-D_FORTIFY_SOURCE=2 -fstack-protector-strong --param=ssp-buffer-size=4 -Werror=trampolines -fomit-frame-pointer -march=i686 -fasynchronous-unwind-tables -mtune=pentium4 -gdwarf-4 -fno-debug-types-section -fvar-tracking-assignments -g2 -DNDEBUG -DQT_NO_DEBUG -Wall -Wextra -Wcast-qual -Wconversion-null -Wmissing-declarations -Woverlength-strings -Wpointer-arith -Wundef -Wunused-local-typedefs -Wunused-result -Wvarargs -Wvla -Wwrite-strings -Wno-missing-field-initializers -Wno-sign-compare -DNOMINMAX -o CMakeFiles/time_zone.dir/internal/cctz/src/time_zone_lookup.cc.o -c /tmp/B.u4f9ex94/BUILD/abseil-cpp-20200923.3/absl/time/internal/cctz/src/time_zone_lookup.cc make[2]: Leaving directory '/tmp/B.u4f9ex94/BUILD/abseil-cpp-20200923.3/build-static' make[2]: Entering directory '/tmp/B.u4f9ex94/BUILD/abseil-cpp-20200923.3/build-static' [ 27%] Building CXX object absl/base/CMakeFiles/base.dir/internal/cycleclock.cc.o cd /tmp/B.u4f9ex94/BUILD/abseil-cpp-20200923.3/build-static/absl/base && /usr/bin/i686-pld-linux-g++ -I/tmp/B.u4f9ex94/BUILD/abseil-cpp-20200923.3 -O2 -fwrapv -pipe -Wformat -Werror=format-security -gdwarf-4 -fno-debug-types-section -fvar-tracking-assignments -g2 -Wp,-D_FORTIFY_SOURCE=2 -fstack-protector-strong --param=ssp-buffer-size=4 -Werror=trampolines -fomit-frame-pointer -march=i686 -fasynchronous-unwind-tables -mtune=pentium4 -gdwarf-4 -fno-debug-types-section -fvar-tracking-assignments -g2 -DNDEBUG -DQT_NO_DEBUG -Wall -Wextra -Wcast-qual -Wconversion-null -Wmissing-declarations -Woverlength-strings -Wpointer-arith -Wundef -Wunused-local-typedefs -Wunused-result -Wvarargs -Wvla -Wwrite-strings -Wno-missing-field-initializers -Wno-sign-compare -DNOMINMAX -o CMakeFiles/base.dir/internal/cycleclock.cc.o -c /tmp/B.u4f9ex94/BUILD/abseil-cpp-20200923.3/absl/base/internal/cycleclock.cc make[2]: Leaving directory '/tmp/B.u4f9ex94/BUILD/abseil-cpp-20200923.3/build-static' make[2]: Entering directory '/tmp/B.u4f9ex94/BUILD/abseil-cpp-20200923.3/build-static' [ 14%] Building CXX object absl/time/CMakeFiles/time_zone.dir/internal/cctz/src/time_zone_impl.cc.o cd /tmp/B.u4f9ex94/BUILD/abseil-cpp-20200923.3/build-static/absl/time && /usr/bin/i686-pld-linux-g++ -I/tmp/B.u4f9ex94/BUILD/abseil-cpp-20200923.3 -O2 -fwrapv -pipe -Wformat -Werror=format-security -gdwarf-4 -fno-debug-types-section -fvar-tracking-assignments -g2 -Wp,-D_FORTIFY_SOURCE=2 -fstack-protector-strong --param=ssp-buffer-size=4 -Werror=trampolines -fomit-frame-pointer -march=i686 -fasynchronous-unwind-tables -mtune=pentium4 -gdwarf-4 -fno-debug-types-section -fvar-tracking-assignments -g2 -DNDEBUG -DQT_NO_DEBUG -Wall -Wextra -Wcast-qual -Wconversion-null -Wmissing-declarations -Woverlength-strings -Wpointer-arith -Wundef -Wunused-local-typedefs -Wunused-result -Wvarargs -Wvla -Wwrite-strings -Wno-missing-field-initializers -Wno-sign-compare -DNOMINMAX -o CMakeFiles/time_zone.dir/internal/cctz/src/time_zone_impl.cc.o -c /tmp/B.u4f9ex94/BUILD/abseil-cpp-20200923.3/absl/time/internal/cctz/src/time_zone_impl.cc make[2]: Leaving directory '/tmp/B.u4f9ex94/BUILD/abseil-cpp-20200923.3/build-static' make[2]: Entering directory '/tmp/B.u4f9ex94/BUILD/abseil-cpp-20200923.3/build-static' [ 22%] Building CXX object absl/time/CMakeFiles/time_zone.dir/internal/cctz/src/zone_info_source.cc.o cd /tmp/B.u4f9ex94/BUILD/abseil-cpp-20200923.3/build-static/absl/time && /usr/bin/i686-pld-linux-g++ -I/tmp/B.u4f9ex94/BUILD/abseil-cpp-20200923.3 -O2 -fwrapv -pipe -Wformat -Werror=format-security -gdwarf-4 -fno-debug-types-section -fvar-tracking-assignments -g2 -Wp,-D_FORTIFY_SOURCE=2 -fstack-protector-strong --param=ssp-buffer-size=4 -Werror=trampolines -fomit-frame-pointer -march=i686 -fasynchronous-unwind-tables -mtune=pentium4 -gdwarf-4 -fno-debug-types-section -fvar-tracking-assignments -g2 -DNDEBUG -DQT_NO_DEBUG -Wall -Wextra -Wcast-qual -Wconversion-null -Wmissing-declarations -Woverlength-strings -Wpointer-arith -Wundef -Wunused-local-typedefs -Wunused-result -Wvarargs -Wvla -Wwrite-strings -Wno-missing-field-initializers -Wno-sign-compare -DNOMINMAX -o CMakeFiles/time_zone.dir/internal/cctz/src/zone_info_source.cc.o -c /tmp/B.u4f9ex94/BUILD/abseil-cpp-20200923.3/absl/time/internal/cctz/src/zone_info_source.cc make[2]: Leaving directory '/tmp/B.u4f9ex94/BUILD/abseil-cpp-20200923.3/build-static' make[2]: Entering directory '/tmp/B.u4f9ex94/BUILD/abseil-cpp-20200923.3/build-static' [ 26%] Building CXX object absl/base/CMakeFiles/scoped_set_env.dir/internal/scoped_set_env.cc.o cd /tmp/B.u4f9ex94/BUILD/abseil-cpp-20200923.3/build-static/absl/base && /usr/bin/i686-pld-linux-g++ -I/tmp/B.u4f9ex94/BUILD/abseil-cpp-20200923.3 -O2 -fwrapv -pipe -Wformat -Werror=format-security -gdwarf-4 -fno-debug-types-section -fvar-tracking-assignments -g2 -Wp,-D_FORTIFY_SOURCE=2 -fstack-protector-strong --param=ssp-buffer-size=4 -Werror=trampolines -fomit-frame-pointer -march=i686 -fasynchronous-unwind-tables -mtune=pentium4 -gdwarf-4 -fno-debug-types-section -fvar-tracking-assignments -g2 -DNDEBUG -DQT_NO_DEBUG -Wall -Wextra -Wcast-qual -Wconversion-null -Wmissing-declarations -Woverlength-strings -Wpointer-arith -Wundef -Wunused-local-typedefs -Wunused-result -Wvarargs -Wvla -Wwrite-strings -Wno-missing-field-initializers -Wno-sign-compare -DNOMINMAX -o CMakeFiles/scoped_set_env.dir/internal/scoped_set_env.cc.o -c /tmp/B.u4f9ex94/BUILD/abseil-cpp-20200923.3/absl/base/internal/scoped_set_env.cc make[2]: Leaving directory '/tmp/B.u4f9ex94/BUILD/abseil-cpp-20200923.3/build-static' make[2]: Entering directory '/tmp/B.u4f9ex94/BUILD/abseil-cpp-20200923.3/build-static' [ 29%] Building CXX object absl/base/CMakeFiles/base.dir/internal/unscaledcycleclock.cc.o cd /tmp/B.u4f9ex94/BUILD/abseil-cpp-20200923.3/build-static/absl/base && /usr/bin/i686-pld-linux-g++ -I/tmp/B.u4f9ex94/BUILD/abseil-cpp-20200923.3 -O2 -fwrapv -pipe -Wformat -Werror=format-security -gdwarf-4 -fno-debug-types-section -fvar-tracking-assignments -g2 -Wp,-D_FORTIFY_SOURCE=2 -fstack-protector-strong --param=ssp-buffer-size=4 -Werror=trampolines -fomit-frame-pointer -march=i686 -fasynchronous-unwind-tables -mtune=pentium4 -gdwarf-4 -fno-debug-types-section -fvar-tracking-assignments -g2 -DNDEBUG -DQT_NO_DEBUG -Wall -Wextra -Wcast-qual -Wconversion-null -Wmissing-declarations -Woverlength-strings -Wpointer-arith -Wundef -Wunused-local-typedefs -Wunused-result -Wvarargs -Wvla -Wwrite-strings -Wno-missing-field-initializers -Wno-sign-compare -DNOMINMAX -o CMakeFiles/base.dir/internal/unscaledcycleclock.cc.o -c /tmp/B.u4f9ex94/BUILD/abseil-cpp-20200923.3/absl/base/internal/unscaledcycleclock.cc make[2]: Leaving directory '/tmp/B.u4f9ex94/BUILD/abseil-cpp-20200923.3/build-static' /usr/bin/make -f absl/strings/CMakeFiles/strings_internal.dir/build.make absl/strings/CMakeFiles/strings_internal.dir/depend make[2]: Entering directory '/tmp/B.u4f9ex94/BUILD/abseil-cpp-20200923.3/build-static' [ 27%] Building CXX object absl/types/CMakeFiles/bad_optional_access.dir/bad_optional_access.cc.o cd /tmp/B.u4f9ex94/BUILD/abseil-cpp-20200923.3/build-static/absl/types && /usr/bin/i686-pld-linux-g++ -I/tmp/B.u4f9ex94/BUILD/abseil-cpp-20200923.3 -O2 -fwrapv -pipe -Wformat -Werror=format-security -gdwarf-4 -fno-debug-types-section -fvar-tracking-assignments -g2 -Wp,-D_FORTIFY_SOURCE=2 -fstack-protector-strong --param=ssp-buffer-size=4 -Werror=trampolines -fomit-frame-pointer -march=i686 -fasynchronous-unwind-tables -mtune=pentium4 -gdwarf-4 -fno-debug-types-section -fvar-tracking-assignments -g2 -DNDEBUG -DQT_NO_DEBUG -Wall -Wextra -Wcast-qual -Wconversion-null -Wmissing-declarations -Woverlength-strings -Wpointer-arith -Wundef -Wunused-local-typedefs -Wunused-result -Wvarargs -Wvla -Wwrite-strings -Wno-missing-field-initializers -Wno-sign-compare -DNOMINMAX -o CMakeFiles/bad_optional_access.dir/bad_optional_access.cc.o -c /tmp/B.u4f9ex94/BUILD/abseil-cpp-20200923.3/absl/types/bad_optional_access.cc make[2]: Leaving directory '/tmp/B.u4f9ex94/BUILD/abseil-cpp-20200923.3/build-static' make[2]: Entering directory '/tmp/B.u4f9ex94/BUILD/abseil-cpp-20200923.3/build-static' cd /tmp/B.u4f9ex94/BUILD/abseil-cpp-20200923.3/build-static && /usr/bin/cmake -E cmake_depends "Unix Makefiles" /tmp/B.u4f9ex94/BUILD/abseil-cpp-20200923.3 /tmp/B.u4f9ex94/BUILD/abseil-cpp-20200923.3/absl/strings /tmp/B.u4f9ex94/BUILD/abseil-cpp-20200923.3/build-static /tmp/B.u4f9ex94/BUILD/abseil-cpp-20200923.3/build-static/absl/strings /tmp/B.u4f9ex94/BUILD/abseil-cpp-20200923.3/build-static/absl/strings/CMakeFiles/strings_internal.dir/DependInfo.cmake --color= Scanning dependencies of target strings_internal make[2]: Leaving directory '/tmp/B.u4f9ex94/BUILD/abseil-cpp-20200923.3/build-static' /usr/bin/make -f absl/strings/CMakeFiles/strings_internal.dir/build.make absl/strings/CMakeFiles/strings_internal.dir/build make[2]: Entering directory '/tmp/B.u4f9ex94/BUILD/abseil-cpp-20200923.3/build-static' [ 29%] Linking CXX static library libabsl_scoped_set_env.a cd /tmp/B.u4f9ex94/BUILD/abseil-cpp-20200923.3/build-static/absl/base && /usr/bin/cmake -P CMakeFiles/scoped_set_env.dir/cmake_clean_target.cmake cd /tmp/B.u4f9ex94/BUILD/abseil-cpp-20200923.3/build-static/absl/base && /usr/bin/cmake -E cmake_link_script CMakeFiles/scoped_set_env.dir/link.txt --verbose=1 /usr/bin/ar qc libabsl_scoped_set_env.a CMakeFiles/scoped_set_env.dir/internal/scoped_set_env.cc.o /usr/bin/ranlib libabsl_scoped_set_env.a make[2]: Leaving directory '/tmp/B.u4f9ex94/BUILD/abseil-cpp-20200923.3/build-static' make[1]: Entering directory '/tmp/B.u4f9ex94/BUILD/abseil-cpp-20200923.3/build-static' [ 31%] Built target scoped_set_env make[1]: Leaving directory '/tmp/B.u4f9ex94/BUILD/abseil-cpp-20200923.3/build-static' /usr/bin/make -f absl/debugging/CMakeFiles/debugging_internal.dir/build.make absl/debugging/CMakeFiles/debugging_internal.dir/depend make[2]: Entering directory '/tmp/B.u4f9ex94/BUILD/abseil-cpp-20200923.3/build-static' cd /tmp/B.u4f9ex94/BUILD/abseil-cpp-20200923.3/build-static && /usr/bin/cmake -E cmake_depends "Unix Makefiles" /tmp/B.u4f9ex94/BUILD/abseil-cpp-20200923.3 /tmp/B.u4f9ex94/BUILD/abseil-cpp-20200923.3/absl/debugging /tmp/B.u4f9ex94/BUILD/abseil-cpp-20200923.3/build-static /tmp/B.u4f9ex94/BUILD/abseil-cpp-20200923.3/build-static/absl/debugging /tmp/B.u4f9ex94/BUILD/abseil-cpp-20200923.3/build-static/absl/debugging/CMakeFiles/debugging_internal.dir/DependInfo.cmake --color= Scanning dependencies of target debugging_internal make[2]: Leaving directory '/tmp/B.u4f9ex94/BUILD/abseil-cpp-20200923.3/build-static' /usr/bin/make -f absl/debugging/CMakeFiles/debugging_internal.dir/build.make absl/debugging/CMakeFiles/debugging_internal.dir/build make[2]: Entering directory '/tmp/B.u4f9ex94/BUILD/abseil-cpp-20200923.3/build-static' [ 31%] Linking CXX static library libabsl_bad_optional_access.a cd /tmp/B.u4f9ex94/BUILD/abseil-cpp-20200923.3/build-static/absl/types && /usr/bin/cmake -P CMakeFiles/bad_optional_access.dir/cmake_clean_target.cmake cd /tmp/B.u4f9ex94/BUILD/abseil-cpp-20200923.3/build-static/absl/types && /usr/bin/cmake -E cmake_link_script CMakeFiles/bad_optional_access.dir/link.txt --verbose=1 /usr/bin/ar qc libabsl_bad_optional_access.a CMakeFiles/bad_optional_access.dir/bad_optional_access.cc.o /usr/bin/ranlib libabsl_bad_optional_access.a make[2]: Leaving directory '/tmp/B.u4f9ex94/BUILD/abseil-cpp-20200923.3/build-static' make[1]: Entering directory '/tmp/B.u4f9ex94/BUILD/abseil-cpp-20200923.3/build-static' [ 32%] Built target bad_optional_access make[1]: Leaving directory '/tmp/B.u4f9ex94/BUILD/abseil-cpp-20200923.3/build-static' /usr/bin/make -f absl/types/CMakeFiles/bad_variant_access.dir/build.make absl/types/CMakeFiles/bad_variant_access.dir/depend make[2]: Entering directory '/tmp/B.u4f9ex94/BUILD/abseil-cpp-20200923.3/build-static' [ 12%] Building CXX object absl/time/CMakeFiles/time_zone.dir/internal/cctz/src/time_zone_format.cc.o cd /tmp/B.u4f9ex94/BUILD/abseil-cpp-20200923.3/build-static/absl/time && /usr/bin/i686-pld-linux-g++ -I/tmp/B.u4f9ex94/BUILD/abseil-cpp-20200923.3 -O2 -fwrapv -pipe -Wformat -Werror=format-security -gdwarf-4 -fno-debug-types-section -fvar-tracking-assignments -g2 -Wp,-D_FORTIFY_SOURCE=2 -fstack-protector-strong --param=ssp-buffer-size=4 -Werror=trampolines -fomit-frame-pointer -march=i686 -fasynchronous-unwind-tables -mtune=pentium4 -gdwarf-4 -fno-debug-types-section -fvar-tracking-assignments -g2 -DNDEBUG -DQT_NO_DEBUG -Wall -Wextra -Wcast-qual -Wconversion-null -Wmissing-declarations -Woverlength-strings -Wpointer-arith -Wundef -Wunused-local-typedefs -Wunused-result -Wvarargs -Wvla -Wwrite-strings -Wno-missing-field-initializers -Wno-sign-compare -DNOMINMAX -o CMakeFiles/time_zone.dir/internal/cctz/src/time_zone_format.cc.o -c /tmp/B.u4f9ex94/BUILD/abseil-cpp-20200923.3/absl/time/internal/cctz/src/time_zone_format.cc make[2]: Leaving directory '/tmp/B.u4f9ex94/BUILD/abseil-cpp-20200923.3/build-static' /usr/bin/make -f absl/random/CMakeFiles/random_internal_randen.dir/build.make absl/random/CMakeFiles/random_internal_randen.dir/depend make[2]: Entering directory '/tmp/B.u4f9ex94/BUILD/abseil-cpp-20200923.3/build-static' cd /tmp/B.u4f9ex94/BUILD/abseil-cpp-20200923.3/build-static && /usr/bin/cmake -E cmake_depends "Unix Makefiles" /tmp/B.u4f9ex94/BUILD/abseil-cpp-20200923.3 /tmp/B.u4f9ex94/BUILD/abseil-cpp-20200923.3/absl/types /tmp/B.u4f9ex94/BUILD/abseil-cpp-20200923.3/build-static /tmp/B.u4f9ex94/BUILD/abseil-cpp-20200923.3/build-static/absl/types /tmp/B.u4f9ex94/BUILD/abseil-cpp-20200923.3/build-static/absl/types/CMakeFiles/bad_variant_access.dir/DependInfo.cmake --color= Scanning dependencies of target bad_variant_access make[2]: Leaving directory '/tmp/B.u4f9ex94/BUILD/abseil-cpp-20200923.3/build-static' /usr/bin/make -f absl/types/CMakeFiles/bad_variant_access.dir/build.make absl/types/CMakeFiles/bad_variant_access.dir/build make[2]: Entering directory '/tmp/B.u4f9ex94/BUILD/abseil-cpp-20200923.3/build-static' cd /tmp/B.u4f9ex94/BUILD/abseil-cpp-20200923.3/build-static && /usr/bin/cmake -E cmake_depends "Unix Makefiles" /tmp/B.u4f9ex94/BUILD/abseil-cpp-20200923.3 /tmp/B.u4f9ex94/BUILD/abseil-cpp-20200923.3/absl/random /tmp/B.u4f9ex94/BUILD/abseil-cpp-20200923.3/build-static /tmp/B.u4f9ex94/BUILD/abseil-cpp-20200923.3/build-static/absl/random /tmp/B.u4f9ex94/BUILD/abseil-cpp-20200923.3/build-static/absl/random/CMakeFiles/random_internal_randen.dir/DependInfo.cmake --color= Scanning dependencies of target random_internal_randen make[2]: Leaving directory '/tmp/B.u4f9ex94/BUILD/abseil-cpp-20200923.3/build-static' /usr/bin/make -f absl/random/CMakeFiles/random_internal_randen.dir/build.make absl/random/CMakeFiles/random_internal_randen.dir/build make[2]: Entering directory '/tmp/B.u4f9ex94/BUILD/abseil-cpp-20200923.3/build-static' [ 27%] Building CXX object absl/base/CMakeFiles/throw_delegate.dir/internal/throw_delegate.cc.o cd /tmp/B.u4f9ex94/BUILD/abseil-cpp-20200923.3/build-static/absl/base && /usr/bin/i686-pld-linux-g++ -I/tmp/B.u4f9ex94/BUILD/abseil-cpp-20200923.3 -O2 -fwrapv -pipe -Wformat -Werror=format-security -gdwarf-4 -fno-debug-types-section -fvar-tracking-assignments -g2 -Wp,-D_FORTIFY_SOURCE=2 -fstack-protector-strong --param=ssp-buffer-size=4 -Werror=trampolines -fomit-frame-pointer -march=i686 -fasynchronous-unwind-tables -mtune=pentium4 -gdwarf-4 -fno-debug-types-section -fvar-tracking-assignments -g2 -DNDEBUG -DQT_NO_DEBUG -Wall -Wextra -Wcast-qual -Wconversion-null -Wmissing-declarations -Woverlength-strings -Wpointer-arith -Wundef -Wunused-local-typedefs -Wunused-result -Wvarargs -Wvla -Wwrite-strings -Wno-missing-field-initializers -Wno-sign-compare -DNOMINMAX -o CMakeFiles/throw_delegate.dir/internal/throw_delegate.cc.o -c /tmp/B.u4f9ex94/BUILD/abseil-cpp-20200923.3/absl/base/internal/throw_delegate.cc make[2]: Leaving directory '/tmp/B.u4f9ex94/BUILD/abseil-cpp-20200923.3/build-static' make[2]: Entering directory '/tmp/B.u4f9ex94/BUILD/abseil-cpp-20200923.3/build-static' [ 27%] Building CXX object absl/base/CMakeFiles/base.dir/internal/spinlock.cc.o cd /tmp/B.u4f9ex94/BUILD/abseil-cpp-20200923.3/build-static/absl/base && /usr/bin/i686-pld-linux-g++ -I/tmp/B.u4f9ex94/BUILD/abseil-cpp-20200923.3 -O2 -fwrapv -pipe -Wformat -Werror=format-security -gdwarf-4 -fno-debug-types-section -fvar-tracking-assignments -g2 -Wp,-D_FORTIFY_SOURCE=2 -fstack-protector-strong --param=ssp-buffer-size=4 -Werror=trampolines -fomit-frame-pointer -march=i686 -fasynchronous-unwind-tables -mtune=pentium4 -gdwarf-4 -fno-debug-types-section -fvar-tracking-assignments -g2 -DNDEBUG -DQT_NO_DEBUG -Wall -Wextra -Wcast-qual -Wconversion-null -Wmissing-declarations -Woverlength-strings -Wpointer-arith -Wundef -Wunused-local-typedefs -Wunused-result -Wvarargs -Wvla -Wwrite-strings -Wno-missing-field-initializers -Wno-sign-compare -DNOMINMAX -o CMakeFiles/base.dir/internal/spinlock.cc.o -c /tmp/B.u4f9ex94/BUILD/abseil-cpp-20200923.3/absl/base/internal/spinlock.cc make[2]: Leaving directory '/tmp/B.u4f9ex94/BUILD/abseil-cpp-20200923.3/build-static' make[2]: Entering directory '/tmp/B.u4f9ex94/BUILD/abseil-cpp-20200923.3/build-static' [ 32%] Building CXX object absl/types/CMakeFiles/bad_variant_access.dir/bad_variant_access.cc.o cd /tmp/B.u4f9ex94/BUILD/abseil-cpp-20200923.3/build-static/absl/types && /usr/bin/i686-pld-linux-g++ -I/tmp/B.u4f9ex94/BUILD/abseil-cpp-20200923.3 -O2 -fwrapv -pipe -Wformat -Werror=format-security -gdwarf-4 -fno-debug-types-section -fvar-tracking-assignments -g2 -Wp,-D_FORTIFY_SOURCE=2 -fstack-protector-strong --param=ssp-buffer-size=4 -Werror=trampolines -fomit-frame-pointer -march=i686 -fasynchronous-unwind-tables -mtune=pentium4 -gdwarf-4 -fno-debug-types-section -fvar-tracking-assignments -g2 -DNDEBUG -DQT_NO_DEBUG -Wall -Wextra -Wcast-qual -Wconversion-null -Wmissing-declarations -Woverlength-strings -Wpointer-arith -Wundef -Wunused-local-typedefs -Wunused-result -Wvarargs -Wvla -Wwrite-strings -Wno-missing-field-initializers -Wno-sign-compare -DNOMINMAX -o CMakeFiles/bad_variant_access.dir/bad_variant_access.cc.o -c /tmp/B.u4f9ex94/BUILD/abseil-cpp-20200923.3/absl/types/bad_variant_access.cc make[2]: Leaving directory '/tmp/B.u4f9ex94/BUILD/abseil-cpp-20200923.3/build-static' make[2]: Entering directory '/tmp/B.u4f9ex94/BUILD/abseil-cpp-20200923.3/build-static' [ 30%] Building CXX object absl/strings/CMakeFiles/strings_internal.dir/internal/ostringstream.cc.o cd /tmp/B.u4f9ex94/BUILD/abseil-cpp-20200923.3/build-static/absl/strings && /usr/bin/i686-pld-linux-g++ -I/tmp/B.u4f9ex94/BUILD/abseil-cpp-20200923.3 -O2 -fwrapv -pipe -Wformat -Werror=format-security -gdwarf-4 -fno-debug-types-section -fvar-tracking-assignments -g2 -Wp,-D_FORTIFY_SOURCE=2 -fstack-protector-strong --param=ssp-buffer-size=4 -Werror=trampolines -fomit-frame-pointer -march=i686 -fasynchronous-unwind-tables -mtune=pentium4 -gdwarf-4 -fno-debug-types-section -fvar-tracking-assignments -g2 -DNDEBUG -DQT_NO_DEBUG -Wall -Wextra -Wcast-qual -Wconversion-null -Wmissing-declarations -Woverlength-strings -Wpointer-arith -Wundef -Wunused-local-typedefs -Wunused-result -Wvarargs -Wvla -Wwrite-strings -Wno-missing-field-initializers -Wno-sign-compare -DNOMINMAX -o CMakeFiles/strings_internal.dir/internal/ostringstream.cc.o -c /tmp/B.u4f9ex94/BUILD/abseil-cpp-20200923.3/absl/strings/internal/ostringstream.cc make[2]: Leaving directory '/tmp/B.u4f9ex94/BUILD/abseil-cpp-20200923.3/build-static' make[2]: Entering directory '/tmp/B.u4f9ex94/BUILD/abseil-cpp-20200923.3/build-static' [ 34%] Building CXX object absl/strings/CMakeFiles/strings_internal.dir/internal/utf8.cc.o cd /tmp/B.u4f9ex94/BUILD/abseil-cpp-20200923.3/build-static/absl/strings && /usr/bin/i686-pld-linux-g++ -I/tmp/B.u4f9ex94/BUILD/abseil-cpp-20200923.3 -O2 -fwrapv -pipe -Wformat -Werror=format-security -gdwarf-4 -fno-debug-types-section -fvar-tracking-assignments -g2 -Wp,-D_FORTIFY_SOURCE=2 -fstack-protector-strong --param=ssp-buffer-size=4 -Werror=trampolines -fomit-frame-pointer -march=i686 -fasynchronous-unwind-tables -mtune=pentium4 -gdwarf-4 -fno-debug-types-section -fvar-tracking-assignments -g2 -DNDEBUG -DQT_NO_DEBUG -Wall -Wextra -Wcast-qual -Wconversion-null -Wmissing-declarations -Woverlength-strings -Wpointer-arith -Wundef -Wunused-local-typedefs -Wunused-result -Wvarargs -Wvla -Wwrite-strings -Wno-missing-field-initializers -Wno-sign-compare -DNOMINMAX -o CMakeFiles/strings_internal.dir/internal/utf8.cc.o -c /tmp/B.u4f9ex94/BUILD/abseil-cpp-20200923.3/absl/strings/internal/utf8.cc make[2]: Leaving directory '/tmp/B.u4f9ex94/BUILD/abseil-cpp-20200923.3/build-static' make[2]: Entering directory '/tmp/B.u4f9ex94/BUILD/abseil-cpp-20200923.3/build-static' [ 35%] Linking CXX static library libabsl_throw_delegate.a cd /tmp/B.u4f9ex94/BUILD/abseil-cpp-20200923.3/build-static/absl/base && /usr/bin/cmake -P CMakeFiles/throw_delegate.dir/cmake_clean_target.cmake cd /tmp/B.u4f9ex94/BUILD/abseil-cpp-20200923.3/build-static/absl/base && /usr/bin/cmake -E cmake_link_script CMakeFiles/throw_delegate.dir/link.txt --verbose=1 /usr/bin/ar qc libabsl_throw_delegate.a CMakeFiles/throw_delegate.dir/internal/throw_delegate.cc.o /usr/bin/ranlib libabsl_throw_delegate.a make[2]: Leaving directory '/tmp/B.u4f9ex94/BUILD/abseil-cpp-20200923.3/build-static' make[1]: Entering directory '/tmp/B.u4f9ex94/BUILD/abseil-cpp-20200923.3/build-static' [ 36%] Built target throw_delegate make[1]: Leaving directory '/tmp/B.u4f9ex94/BUILD/abseil-cpp-20200923.3/build-static' make[2]: Entering directory '/tmp/B.u4f9ex94/BUILD/abseil-cpp-20200923.3/build-static' [ 36%] Linking CXX static library libabsl_bad_variant_access.a cd /tmp/B.u4f9ex94/BUILD/abseil-cpp-20200923.3/build-static/absl/types && /usr/bin/cmake -P CMakeFiles/bad_variant_access.dir/cmake_clean_target.cmake cd /tmp/B.u4f9ex94/BUILD/abseil-cpp-20200923.3/build-static/absl/types && /usr/bin/cmake -E cmake_link_script CMakeFiles/bad_variant_access.dir/link.txt --verbose=1 /usr/bin/ar qc libabsl_bad_variant_access.a CMakeFiles/bad_variant_access.dir/bad_variant_access.cc.o /usr/bin/ranlib libabsl_bad_variant_access.a make[2]: Leaving directory '/tmp/B.u4f9ex94/BUILD/abseil-cpp-20200923.3/build-static' make[2]: Entering directory '/tmp/B.u4f9ex94/BUILD/abseil-cpp-20200923.3/build-static' [ 28%] Building CXX object absl/base/CMakeFiles/base.dir/internal/sysinfo.cc.o cd /tmp/B.u4f9ex94/BUILD/abseil-cpp-20200923.3/build-static/absl/base && /usr/bin/i686-pld-linux-g++ -I/tmp/B.u4f9ex94/BUILD/abseil-cpp-20200923.3 -O2 -fwrapv -pipe -Wformat -Werror=format-security -gdwarf-4 -fno-debug-types-section -fvar-tracking-assignments -g2 -Wp,-D_FORTIFY_SOURCE=2 -fstack-protector-strong --param=ssp-buffer-size=4 -Werror=trampolines -fomit-frame-pointer -march=i686 -fasynchronous-unwind-tables -mtune=pentium4 -gdwarf-4 -fno-debug-types-section -fvar-tracking-assignments -g2 -DNDEBUG -DQT_NO_DEBUG -Wall -Wextra -Wcast-qual -Wconversion-null -Wmissing-declarations -Woverlength-strings -Wpointer-arith -Wundef -Wunused-local-typedefs -Wunused-result -Wvarargs -Wvla -Wwrite-strings -Wno-missing-field-initializers -Wno-sign-compare -DNOMINMAX -o CMakeFiles/base.dir/internal/sysinfo.cc.o -c /tmp/B.u4f9ex94/BUILD/abseil-cpp-20200923.3/absl/base/internal/sysinfo.cc make[2]: Leaving directory '/tmp/B.u4f9ex94/BUILD/abseil-cpp-20200923.3/build-static' make[1]: Entering directory '/tmp/B.u4f9ex94/BUILD/abseil-cpp-20200923.3/build-static' [ 37%] Built target bad_variant_access make[1]: Leaving directory '/tmp/B.u4f9ex94/BUILD/abseil-cpp-20200923.3/build-static' make[2]: Entering directory '/tmp/B.u4f9ex94/BUILD/abseil-cpp-20200923.3/build-static' [ 32%] Building CXX object absl/debugging/CMakeFiles/debugging_internal.dir/internal/address_is_readable.cc.o cd /tmp/B.u4f9ex94/BUILD/abseil-cpp-20200923.3/build-static/absl/debugging && /usr/bin/i686-pld-linux-g++ -I/tmp/B.u4f9ex94/BUILD/abseil-cpp-20200923.3 -O2 -fwrapv -pipe -Wformat -Werror=format-security -gdwarf-4 -fno-debug-types-section -fvar-tracking-assignments -g2 -Wp,-D_FORTIFY_SOURCE=2 -fstack-protector-strong --param=ssp-buffer-size=4 -Werror=trampolines -fomit-frame-pointer -march=i686 -fasynchronous-unwind-tables -mtune=pentium4 -gdwarf-4 -fno-debug-types-section -fvar-tracking-assignments -g2 -DNDEBUG -DQT_NO_DEBUG -Wall -Wextra -Wcast-qual -Wconversion-null -Wmissing-declarations -Woverlength-strings -Wpointer-arith -Wundef -Wunused-local-typedefs -Wunused-result -Wvarargs -Wvla -Wwrite-strings -Wno-missing-field-initializers -Wno-sign-compare -DNOMINMAX -o CMakeFiles/debugging_internal.dir/internal/address_is_readable.cc.o -c /tmp/B.u4f9ex94/BUILD/abseil-cpp-20200923.3/absl/debugging/internal/address_is_readable.cc make[2]: Leaving directory '/tmp/B.u4f9ex94/BUILD/abseil-cpp-20200923.3/build-static' make[2]: Entering directory '/tmp/B.u4f9ex94/BUILD/abseil-cpp-20200923.3/build-static' [ 28%] Building CXX object absl/base/CMakeFiles/base.dir/internal/thread_identity.cc.o cd /tmp/B.u4f9ex94/BUILD/abseil-cpp-20200923.3/build-static/absl/base && /usr/bin/i686-pld-linux-g++ -I/tmp/B.u4f9ex94/BUILD/abseil-cpp-20200923.3 -O2 -fwrapv -pipe -Wformat -Werror=format-security -gdwarf-4 -fno-debug-types-section -fvar-tracking-assignments -g2 -Wp,-D_FORTIFY_SOURCE=2 -fstack-protector-strong --param=ssp-buffer-size=4 -Werror=trampolines -fomit-frame-pointer -march=i686 -fasynchronous-unwind-tables -mtune=pentium4 -gdwarf-4 -fno-debug-types-section -fvar-tracking-assignments -g2 -DNDEBUG -DQT_NO_DEBUG -Wall -Wextra -Wcast-qual -Wconversion-null -Wmissing-declarations -Woverlength-strings -Wpointer-arith -Wundef -Wunused-local-typedefs -Wunused-result -Wvarargs -Wvla -Wwrite-strings -Wno-missing-field-initializers -Wno-sign-compare -DNOMINMAX -o CMakeFiles/base.dir/internal/thread_identity.cc.o -c /tmp/B.u4f9ex94/BUILD/abseil-cpp-20200923.3/absl/base/internal/thread_identity.cc make[2]: Leaving directory '/tmp/B.u4f9ex94/BUILD/abseil-cpp-20200923.3/build-static' make[2]: Entering directory '/tmp/B.u4f9ex94/BUILD/abseil-cpp-20200923.3/build-static' [ 38%] Linking CXX static library libabsl_base.a cd /tmp/B.u4f9ex94/BUILD/abseil-cpp-20200923.3/build-static/absl/base && /usr/bin/cmake -P CMakeFiles/base.dir/cmake_clean_target.cmake cd /tmp/B.u4f9ex94/BUILD/abseil-cpp-20200923.3/build-static/absl/base && /usr/bin/cmake -E cmake_link_script CMakeFiles/base.dir/link.txt --verbose=1 /usr/bin/ar qc libabsl_base.a CMakeFiles/base.dir/internal/cycleclock.cc.o CMakeFiles/base.dir/internal/spinlock.cc.o CMakeFiles/base.dir/internal/sysinfo.cc.o CMakeFiles/base.dir/internal/thread_identity.cc.o CMakeFiles/base.dir/internal/unscaledcycleclock.cc.o /usr/bin/ranlib libabsl_base.a make[2]: Leaving directory '/tmp/B.u4f9ex94/BUILD/abseil-cpp-20200923.3/build-static' make[1]: Entering directory '/tmp/B.u4f9ex94/BUILD/abseil-cpp-20200923.3/build-static' [ 38%] Built target base make[1]: Leaving directory '/tmp/B.u4f9ex94/BUILD/abseil-cpp-20200923.3/build-static' /usr/bin/make -f absl/base/CMakeFiles/malloc_internal.dir/build.make absl/base/CMakeFiles/malloc_internal.dir/depend /usr/bin/make -f absl/debugging/CMakeFiles/demangle_internal.dir/build.make absl/debugging/CMakeFiles/demangle_internal.dir/depend make[2]: Entering directory '/tmp/B.u4f9ex94/BUILD/abseil-cpp-20200923.3/build-static' cd /tmp/B.u4f9ex94/BUILD/abseil-cpp-20200923.3/build-static && /usr/bin/cmake -E cmake_depends "Unix Makefiles" /tmp/B.u4f9ex94/BUILD/abseil-cpp-20200923.3 /tmp/B.u4f9ex94/BUILD/abseil-cpp-20200923.3/absl/debugging /tmp/B.u4f9ex94/BUILD/abseil-cpp-20200923.3/build-static /tmp/B.u4f9ex94/BUILD/abseil-cpp-20200923.3/build-static/absl/debugging /tmp/B.u4f9ex94/BUILD/abseil-cpp-20200923.3/build-static/absl/debugging/CMakeFiles/demangle_internal.dir/DependInfo.cmake --color= Scanning dependencies of target demangle_internal make[2]: Leaving directory '/tmp/B.u4f9ex94/BUILD/abseil-cpp-20200923.3/build-static' /usr/bin/make -f absl/debugging/CMakeFiles/demangle_internal.dir/build.make absl/debugging/CMakeFiles/demangle_internal.dir/build make[2]: Entering directory '/tmp/B.u4f9ex94/BUILD/abseil-cpp-20200923.3/build-static' cd /tmp/B.u4f9ex94/BUILD/abseil-cpp-20200923.3/build-static && /usr/bin/cmake -E cmake_depends "Unix Makefiles" /tmp/B.u4f9ex94/BUILD/abseil-cpp-20200923.3 /tmp/B.u4f9ex94/BUILD/abseil-cpp-20200923.3/absl/base /tmp/B.u4f9ex94/BUILD/abseil-cpp-20200923.3/build-static /tmp/B.u4f9ex94/BUILD/abseil-cpp-20200923.3/build-static/absl/base /tmp/B.u4f9ex94/BUILD/abseil-cpp-20200923.3/build-static/absl/base/CMakeFiles/malloc_internal.dir/DependInfo.cmake --color= Scanning dependencies of target malloc_internal make[2]: Leaving directory '/tmp/B.u4f9ex94/BUILD/abseil-cpp-20200923.3/build-static' /usr/bin/make -f absl/base/CMakeFiles/malloc_internal.dir/build.make absl/base/CMakeFiles/malloc_internal.dir/build make[2]: Entering directory '/tmp/B.u4f9ex94/BUILD/abseil-cpp-20200923.3/build-static' [ 33%] Building CXX object absl/random/CMakeFiles/random_internal_randen.dir/internal/randen.cc.o cd /tmp/B.u4f9ex94/BUILD/abseil-cpp-20200923.3/build-static/absl/random && /usr/bin/i686-pld-linux-g++ -I/tmp/B.u4f9ex94/BUILD/abseil-cpp-20200923.3 -O2 -fwrapv -pipe -Wformat -Werror=format-security -gdwarf-4 -fno-debug-types-section -fvar-tracking-assignments -g2 -Wp,-D_FORTIFY_SOURCE=2 -fstack-protector-strong --param=ssp-buffer-size=4 -Werror=trampolines -fomit-frame-pointer -march=i686 -fasynchronous-unwind-tables -mtune=pentium4 -gdwarf-4 -fno-debug-types-section -fvar-tracking-assignments -g2 -DNDEBUG -DQT_NO_DEBUG -Wall -Wextra -Wcast-qual -Wconversion-null -Wmissing-declarations -Woverlength-strings -Wpointer-arith -Wundef -Wunused-local-typedefs -Wunused-result -Wvarargs -Wvla -Wwrite-strings -Wno-missing-field-initializers -Wno-sign-compare -DNOMINMAX -o CMakeFiles/random_internal_randen.dir/internal/randen.cc.o -c /tmp/B.u4f9ex94/BUILD/abseil-cpp-20200923.3/absl/random/internal/randen.cc make[2]: Leaving directory '/tmp/B.u4f9ex94/BUILD/abseil-cpp-20200923.3/build-static' make[2]: Entering directory '/tmp/B.u4f9ex94/BUILD/abseil-cpp-20200923.3/build-static' [ 38%] Linking CXX static library libabsl_random_internal_randen.a cd /tmp/B.u4f9ex94/BUILD/abseil-cpp-20200923.3/build-static/absl/random && /usr/bin/cmake -P CMakeFiles/random_internal_randen.dir/cmake_clean_target.cmake cd /tmp/B.u4f9ex94/BUILD/abseil-cpp-20200923.3/build-static/absl/random && /usr/bin/cmake -E cmake_link_script CMakeFiles/random_internal_randen.dir/link.txt --verbose=1 /usr/bin/ar qc libabsl_random_internal_randen.a CMakeFiles/random_internal_randen.dir/internal/randen.cc.o /usr/bin/ranlib libabsl_random_internal_randen.a make[2]: Leaving directory '/tmp/B.u4f9ex94/BUILD/abseil-cpp-20200923.3/build-static' make[1]: Entering directory '/tmp/B.u4f9ex94/BUILD/abseil-cpp-20200923.3/build-static' [ 38%] Built target random_internal_randen make[1]: Leaving directory '/tmp/B.u4f9ex94/BUILD/abseil-cpp-20200923.3/build-static' make[2]: Entering directory '/tmp/B.u4f9ex94/BUILD/abseil-cpp-20200923.3/build-static' [ 37%] Building CXX object absl/debugging/CMakeFiles/debugging_internal.dir/internal/vdso_support.cc.o cd /tmp/B.u4f9ex94/BUILD/abseil-cpp-20200923.3/build-static/absl/debugging && /usr/bin/i686-pld-linux-g++ -I/tmp/B.u4f9ex94/BUILD/abseil-cpp-20200923.3 -O2 -fwrapv -pipe -Wformat -Werror=format-security -gdwarf-4 -fno-debug-types-section -fvar-tracking-assignments -g2 -Wp,-D_FORTIFY_SOURCE=2 -fstack-protector-strong --param=ssp-buffer-size=4 -Werror=trampolines -fomit-frame-pointer -march=i686 -fasynchronous-unwind-tables -mtune=pentium4 -gdwarf-4 -fno-debug-types-section -fvar-tracking-assignments -g2 -DNDEBUG -DQT_NO_DEBUG -Wall -Wextra -Wcast-qual -Wconversion-null -Wmissing-declarations -Woverlength-strings -Wpointer-arith -Wundef -Wunused-local-typedefs -Wunused-result -Wvarargs -Wvla -Wwrite-strings -Wno-missing-field-initializers -Wno-sign-compare -DNOMINMAX -o CMakeFiles/debugging_internal.dir/internal/vdso_support.cc.o -c /tmp/B.u4f9ex94/BUILD/abseil-cpp-20200923.3/absl/debugging/internal/vdso_support.cc make[2]: Leaving directory '/tmp/B.u4f9ex94/BUILD/abseil-cpp-20200923.3/build-static' make[2]: Entering directory '/tmp/B.u4f9ex94/BUILD/abseil-cpp-20200923.3/build-static' [ 36%] Building CXX object absl/debugging/CMakeFiles/debugging_internal.dir/internal/elf_mem_image.cc.o cd /tmp/B.u4f9ex94/BUILD/abseil-cpp-20200923.3/build-static/absl/debugging && /usr/bin/i686-pld-linux-g++ -I/tmp/B.u4f9ex94/BUILD/abseil-cpp-20200923.3 -O2 -fwrapv -pipe -Wformat -Werror=format-security -gdwarf-4 -fno-debug-types-section -fvar-tracking-assignments -g2 -Wp,-D_FORTIFY_SOURCE=2 -fstack-protector-strong --param=ssp-buffer-size=4 -Werror=trampolines -fomit-frame-pointer -march=i686 -fasynchronous-unwind-tables -mtune=pentium4 -gdwarf-4 -fno-debug-types-section -fvar-tracking-assignments -g2 -DNDEBUG -DQT_NO_DEBUG -Wall -Wextra -Wcast-qual -Wconversion-null -Wmissing-declarations -Woverlength-strings -Wpointer-arith -Wundef -Wunused-local-typedefs -Wunused-result -Wvarargs -Wvla -Wwrite-strings -Wno-missing-field-initializers -Wno-sign-compare -DNOMINMAX -o CMakeFiles/debugging_internal.dir/internal/elf_mem_image.cc.o -c /tmp/B.u4f9ex94/BUILD/abseil-cpp-20200923.3/absl/debugging/internal/elf_mem_image.cc make[2]: Leaving directory '/tmp/B.u4f9ex94/BUILD/abseil-cpp-20200923.3/build-static' make[2]: Entering directory '/tmp/B.u4f9ex94/BUILD/abseil-cpp-20200923.3/build-static' [ 39%] Linking CXX static library libabsl_debugging_internal.a cd /tmp/B.u4f9ex94/BUILD/abseil-cpp-20200923.3/build-static/absl/debugging && /usr/bin/cmake -P CMakeFiles/debugging_internal.dir/cmake_clean_target.cmake cd /tmp/B.u4f9ex94/BUILD/abseil-cpp-20200923.3/build-static/absl/debugging && /usr/bin/cmake -E cmake_link_script CMakeFiles/debugging_internal.dir/link.txt --verbose=1 /usr/bin/ar qc libabsl_debugging_internal.a CMakeFiles/debugging_internal.dir/internal/address_is_readable.cc.o CMakeFiles/debugging_internal.dir/internal/elf_mem_image.cc.o CMakeFiles/debugging_internal.dir/internal/vdso_support.cc.o /usr/bin/ranlib libabsl_debugging_internal.a make[2]: Leaving directory '/tmp/B.u4f9ex94/BUILD/abseil-cpp-20200923.3/build-static' make[1]: Entering directory '/tmp/B.u4f9ex94/BUILD/abseil-cpp-20200923.3/build-static' [ 39%] Built target debugging_internal make[1]: Leaving directory '/tmp/B.u4f9ex94/BUILD/abseil-cpp-20200923.3/build-static' /usr/bin/make -f absl/debugging/CMakeFiles/stacktrace.dir/build.make absl/debugging/CMakeFiles/stacktrace.dir/depend make[2]: Entering directory '/tmp/B.u4f9ex94/BUILD/abseil-cpp-20200923.3/build-static' [ 15%] Building CXX object absl/time/CMakeFiles/time_zone.dir/internal/cctz/src/time_zone_info.cc.o cd /tmp/B.u4f9ex94/BUILD/abseil-cpp-20200923.3/build-static/absl/time && /usr/bin/i686-pld-linux-g++ -I/tmp/B.u4f9ex94/BUILD/abseil-cpp-20200923.3 -O2 -fwrapv -pipe -Wformat -Werror=format-security -gdwarf-4 -fno-debug-types-section -fvar-tracking-assignments -g2 -Wp,-D_FORTIFY_SOURCE=2 -fstack-protector-strong --param=ssp-buffer-size=4 -Werror=trampolines -fomit-frame-pointer -march=i686 -fasynchronous-unwind-tables -mtune=pentium4 -gdwarf-4 -fno-debug-types-section -fvar-tracking-assignments -g2 -DNDEBUG -DQT_NO_DEBUG -Wall -Wextra -Wcast-qual -Wconversion-null -Wmissing-declarations -Woverlength-strings -Wpointer-arith -Wundef -Wunused-local-typedefs -Wunused-result -Wvarargs -Wvla -Wwrite-strings -Wno-missing-field-initializers -Wno-sign-compare -DNOMINMAX -o CMakeFiles/time_zone.dir/internal/cctz/src/time_zone_info.cc.o -c /tmp/B.u4f9ex94/BUILD/abseil-cpp-20200923.3/absl/time/internal/cctz/src/time_zone_info.cc make[2]: Leaving directory '/tmp/B.u4f9ex94/BUILD/abseil-cpp-20200923.3/build-static' make[2]: Entering directory '/tmp/B.u4f9ex94/BUILD/abseil-cpp-20200923.3/build-static' cd /tmp/B.u4f9ex94/BUILD/abseil-cpp-20200923.3/build-static && /usr/bin/cmake -E cmake_depends "Unix Makefiles" /tmp/B.u4f9ex94/BUILD/abseil-cpp-20200923.3 /tmp/B.u4f9ex94/BUILD/abseil-cpp-20200923.3/absl/debugging /tmp/B.u4f9ex94/BUILD/abseil-cpp-20200923.3/build-static /tmp/B.u4f9ex94/BUILD/abseil-cpp-20200923.3/build-static/absl/debugging /tmp/B.u4f9ex94/BUILD/abseil-cpp-20200923.3/build-static/absl/debugging/CMakeFiles/stacktrace.dir/DependInfo.cmake --color= Scanning dependencies of target stacktrace make[2]: Leaving directory '/tmp/B.u4f9ex94/BUILD/abseil-cpp-20200923.3/build-static' /usr/bin/make -f absl/debugging/CMakeFiles/stacktrace.dir/build.make absl/debugging/CMakeFiles/stacktrace.dir/build make[2]: Entering directory '/tmp/B.u4f9ex94/BUILD/abseil-cpp-20200923.3/build-static' [ 36%] Building CXX object absl/strings/CMakeFiles/strings_internal.dir/internal/escaping.cc.o cd /tmp/B.u4f9ex94/BUILD/abseil-cpp-20200923.3/build-static/absl/strings && /usr/bin/i686-pld-linux-g++ -I/tmp/B.u4f9ex94/BUILD/abseil-cpp-20200923.3 -O2 -fwrapv -pipe -Wformat -Werror=format-security -gdwarf-4 -fno-debug-types-section -fvar-tracking-assignments -g2 -Wp,-D_FORTIFY_SOURCE=2 -fstack-protector-strong --param=ssp-buffer-size=4 -Werror=trampolines -fomit-frame-pointer -march=i686 -fasynchronous-unwind-tables -mtune=pentium4 -gdwarf-4 -fno-debug-types-section -fvar-tracking-assignments -g2 -DNDEBUG -DQT_NO_DEBUG -Wall -Wextra -Wcast-qual -Wconversion-null -Wmissing-declarations -Woverlength-strings -Wpointer-arith -Wundef -Wunused-local-typedefs -Wunused-result -Wvarargs -Wvla -Wwrite-strings -Wno-missing-field-initializers -Wno-sign-compare -DNOMINMAX -o CMakeFiles/strings_internal.dir/internal/escaping.cc.o -c /tmp/B.u4f9ex94/BUILD/abseil-cpp-20200923.3/absl/strings/internal/escaping.cc make[2]: Leaving directory '/tmp/B.u4f9ex94/BUILD/abseil-cpp-20200923.3/build-static' make[2]: Entering directory '/tmp/B.u4f9ex94/BUILD/abseil-cpp-20200923.3/build-static' [ 40%] Linking CXX static library libabsl_time_zone.a cd /tmp/B.u4f9ex94/BUILD/abseil-cpp-20200923.3/build-static/absl/time && /usr/bin/cmake -P CMakeFiles/time_zone.dir/cmake_clean_target.cmake cd /tmp/B.u4f9ex94/BUILD/abseil-cpp-20200923.3/build-static/absl/time && /usr/bin/cmake -E cmake_link_script CMakeFiles/time_zone.dir/link.txt --verbose=1 /usr/bin/ar qc libabsl_time_zone.a CMakeFiles/time_zone.dir/internal/cctz/src/time_zone_fixed.cc.o CMakeFiles/time_zone.dir/internal/cctz/src/time_zone_format.cc.o CMakeFiles/time_zone.dir/internal/cctz/src/time_zone_if.cc.o CMakeFiles/time_zone.dir/internal/cctz/src/time_zone_impl.cc.o CMakeFiles/time_zone.dir/internal/cctz/src/time_zone_info.cc.o CMakeFiles/time_zone.dir/internal/cctz/src/time_zone_libc.cc.o CMakeFiles/time_zone.dir/internal/cctz/src/time_zone_lookup.cc.o CMakeFiles/time_zone.dir/internal/cctz/src/time_zone_posix.cc.o CMakeFiles/time_zone.dir/internal/cctz/src/zone_info_source.cc.o /usr/bin/ranlib libabsl_time_zone.a make[2]: Leaving directory '/tmp/B.u4f9ex94/BUILD/abseil-cpp-20200923.3/build-static' make[2]: Entering directory '/tmp/B.u4f9ex94/BUILD/abseil-cpp-20200923.3/build-static' [ 42%] Linking CXX static library libabsl_strings_internal.a cd /tmp/B.u4f9ex94/BUILD/abseil-cpp-20200923.3/build-static/absl/strings && /usr/bin/cmake -P CMakeFiles/strings_internal.dir/cmake_clean_target.cmake cd /tmp/B.u4f9ex94/BUILD/abseil-cpp-20200923.3/build-static/absl/strings && /usr/bin/cmake -E cmake_link_script CMakeFiles/strings_internal.dir/link.txt --verbose=1 /usr/bin/ar qc libabsl_strings_internal.a CMakeFiles/strings_internal.dir/internal/ostringstream.cc.o CMakeFiles/strings_internal.dir/internal/utf8.cc.o CMakeFiles/strings_internal.dir/internal/escaping.cc.o /usr/bin/ranlib libabsl_strings_internal.a make[2]: Leaving directory '/tmp/B.u4f9ex94/BUILD/abseil-cpp-20200923.3/build-static' make[1]: Entering directory '/tmp/B.u4f9ex94/BUILD/abseil-cpp-20200923.3/build-static' [ 42%] Built target strings_internal make[1]: Leaving directory '/tmp/B.u4f9ex94/BUILD/abseil-cpp-20200923.3/build-static' /usr/bin/make -f absl/strings/CMakeFiles/strings.dir/build.make absl/strings/CMakeFiles/strings.dir/depend make[1]: Entering directory '/tmp/B.u4f9ex94/BUILD/abseil-cpp-20200923.3/build-static' [ 42%] Built target time_zone make[1]: Leaving directory '/tmp/B.u4f9ex94/BUILD/abseil-cpp-20200923.3/build-static' make[2]: Entering directory '/tmp/B.u4f9ex94/BUILD/abseil-cpp-20200923.3/build-static' cd /tmp/B.u4f9ex94/BUILD/abseil-cpp-20200923.3/build-static && /usr/bin/cmake -E cmake_depends "Unix Makefiles" /tmp/B.u4f9ex94/BUILD/abseil-cpp-20200923.3 /tmp/B.u4f9ex94/BUILD/abseil-cpp-20200923.3/absl/strings /tmp/B.u4f9ex94/BUILD/abseil-cpp-20200923.3/build-static /tmp/B.u4f9ex94/BUILD/abseil-cpp-20200923.3/build-static/absl/strings /tmp/B.u4f9ex94/BUILD/abseil-cpp-20200923.3/build-static/absl/strings/CMakeFiles/strings.dir/DependInfo.cmake --color= Scanning dependencies of target strings make[2]: Leaving directory '/tmp/B.u4f9ex94/BUILD/abseil-cpp-20200923.3/build-static' /usr/bin/make -f absl/strings/CMakeFiles/strings.dir/build.make absl/strings/CMakeFiles/strings.dir/build make[2]: Entering directory '/tmp/B.u4f9ex94/BUILD/abseil-cpp-20200923.3/build-static' [ 38%] Building CXX object absl/base/CMakeFiles/malloc_internal.dir/internal/low_level_alloc.cc.o cd /tmp/B.u4f9ex94/BUILD/abseil-cpp-20200923.3/build-static/absl/base && /usr/bin/i686-pld-linux-g++ -I/tmp/B.u4f9ex94/BUILD/abseil-cpp-20200923.3 -O2 -fwrapv -pipe -Wformat -Werror=format-security -gdwarf-4 -fno-debug-types-section -fvar-tracking-assignments -g2 -Wp,-D_FORTIFY_SOURCE=2 -fstack-protector-strong --param=ssp-buffer-size=4 -Werror=trampolines -fomit-frame-pointer -march=i686 -fasynchronous-unwind-tables -mtune=pentium4 -gdwarf-4 -fno-debug-types-section -fvar-tracking-assignments -g2 -DNDEBUG -DQT_NO_DEBUG -Wall -Wextra -Wcast-qual -Wconversion-null -Wmissing-declarations -Woverlength-strings -Wpointer-arith -Wundef -Wunused-local-typedefs -Wunused-result -Wvarargs -Wvla -Wwrite-strings -Wno-missing-field-initializers -Wno-sign-compare -DNOMINMAX -o CMakeFiles/malloc_internal.dir/internal/low_level_alloc.cc.o -c /tmp/B.u4f9ex94/BUILD/abseil-cpp-20200923.3/absl/base/internal/low_level_alloc.cc make[2]: Leaving directory '/tmp/B.u4f9ex94/BUILD/abseil-cpp-20200923.3/build-static' make[2]: Entering directory '/tmp/B.u4f9ex94/BUILD/abseil-cpp-20200923.3/build-static' [ 38%] Building CXX object absl/debugging/CMakeFiles/demangle_internal.dir/internal/demangle.cc.o cd /tmp/B.u4f9ex94/BUILD/abseil-cpp-20200923.3/build-static/absl/debugging && /usr/bin/i686-pld-linux-g++ -I/tmp/B.u4f9ex94/BUILD/abseil-cpp-20200923.3 -O2 -fwrapv -pipe -Wformat -Werror=format-security -gdwarf-4 -fno-debug-types-section -fvar-tracking-assignments -g2 -Wp,-D_FORTIFY_SOURCE=2 -fstack-protector-strong --param=ssp-buffer-size=4 -Werror=trampolines -fomit-frame-pointer -march=i686 -fasynchronous-unwind-tables -mtune=pentium4 -gdwarf-4 -fno-debug-types-section -fvar-tracking-assignments -g2 -DNDEBUG -DQT_NO_DEBUG -Wall -Wextra -Wcast-qual -Wconversion-null -Wmissing-declarations -Woverlength-strings -Wpointer-arith -Wundef -Wunused-local-typedefs -Wunused-result -Wvarargs -Wvla -Wwrite-strings -Wno-missing-field-initializers -Wno-sign-compare -DNOMINMAX -o CMakeFiles/demangle_internal.dir/internal/demangle.cc.o -c /tmp/B.u4f9ex94/BUILD/abseil-cpp-20200923.3/absl/debugging/internal/demangle.cc make[2]: Leaving directory '/tmp/B.u4f9ex94/BUILD/abseil-cpp-20200923.3/build-static' make[2]: Entering directory '/tmp/B.u4f9ex94/BUILD/abseil-cpp-20200923.3/build-static' [ 41%] Building CXX object absl/debugging/CMakeFiles/stacktrace.dir/stacktrace.cc.o cd /tmp/B.u4f9ex94/BUILD/abseil-cpp-20200923.3/build-static/absl/debugging && /usr/bin/i686-pld-linux-g++ -I/tmp/B.u4f9ex94/BUILD/abseil-cpp-20200923.3 -O2 -fwrapv -pipe -Wformat -Werror=format-security -gdwarf-4 -fno-debug-types-section -fvar-tracking-assignments -g2 -Wp,-D_FORTIFY_SOURCE=2 -fstack-protector-strong --param=ssp-buffer-size=4 -Werror=trampolines -fomit-frame-pointer -march=i686 -fasynchronous-unwind-tables -mtune=pentium4 -gdwarf-4 -fno-debug-types-section -fvar-tracking-assignments -g2 -DNDEBUG -DQT_NO_DEBUG -Wall -Wextra -Wcast-qual -Wconversion-null -Wmissing-declarations -Woverlength-strings -Wpointer-arith -Wundef -Wunused-local-typedefs -Wunused-result -Wvarargs -Wvla -Wwrite-strings -Wno-missing-field-initializers -Wno-sign-compare -DNOMINMAX -o CMakeFiles/stacktrace.dir/stacktrace.cc.o -c /tmp/B.u4f9ex94/BUILD/abseil-cpp-20200923.3/absl/debugging/stacktrace.cc make[2]: Leaving directory '/tmp/B.u4f9ex94/BUILD/abseil-cpp-20200923.3/build-static' make[2]: Entering directory '/tmp/B.u4f9ex94/BUILD/abseil-cpp-20200923.3/build-static' [ 47%] Linking CXX static library libabsl_malloc_internal.a cd /tmp/B.u4f9ex94/BUILD/abseil-cpp-20200923.3/build-static/absl/base && /usr/bin/cmake -P CMakeFiles/malloc_internal.dir/cmake_clean_target.cmake cd /tmp/B.u4f9ex94/BUILD/abseil-cpp-20200923.3/build-static/absl/base && /usr/bin/cmake -E cmake_link_script CMakeFiles/malloc_internal.dir/link.txt --verbose=1 /usr/bin/ar qc libabsl_malloc_internal.a CMakeFiles/malloc_internal.dir/internal/low_level_alloc.cc.o /usr/bin/ranlib libabsl_malloc_internal.a make[2]: Leaving directory '/tmp/B.u4f9ex94/BUILD/abseil-cpp-20200923.3/build-static' make[2]: Entering directory '/tmp/B.u4f9ex94/BUILD/abseil-cpp-20200923.3/build-static' [ 48%] Linking CXX static library libabsl_demangle_internal.a cd /tmp/B.u4f9ex94/BUILD/abseil-cpp-20200923.3/build-static/absl/debugging && /usr/bin/cmake -P CMakeFiles/demangle_internal.dir/cmake_clean_target.cmake cd /tmp/B.u4f9ex94/BUILD/abseil-cpp-20200923.3/build-static/absl/debugging && /usr/bin/cmake -E cmake_link_script CMakeFiles/demangle_internal.dir/link.txt --verbose=1 /usr/bin/ar qc libabsl_demangle_internal.a CMakeFiles/demangle_internal.dir/internal/demangle.cc.o /usr/bin/ranlib libabsl_demangle_internal.a make[2]: Leaving directory '/tmp/B.u4f9ex94/BUILD/abseil-cpp-20200923.3/build-static' make[1]: Entering directory '/tmp/B.u4f9ex94/BUILD/abseil-cpp-20200923.3/build-static' [ 49%] Built target malloc_internal make[1]: Leaving directory '/tmp/B.u4f9ex94/BUILD/abseil-cpp-20200923.3/build-static' make[2]: Entering directory '/tmp/B.u4f9ex94/BUILD/abseil-cpp-20200923.3/build-static' [ 49%] Linking CXX static library libabsl_stacktrace.a cd /tmp/B.u4f9ex94/BUILD/abseil-cpp-20200923.3/build-static/absl/debugging && /usr/bin/cmake -P CMakeFiles/stacktrace.dir/cmake_clean_target.cmake cd /tmp/B.u4f9ex94/BUILD/abseil-cpp-20200923.3/build-static/absl/debugging && /usr/bin/cmake -E cmake_link_script CMakeFiles/stacktrace.dir/link.txt --verbose=1 /usr/bin/ar qc libabsl_stacktrace.a CMakeFiles/stacktrace.dir/stacktrace.cc.o /usr/bin/ranlib libabsl_stacktrace.a make[2]: Leaving directory '/tmp/B.u4f9ex94/BUILD/abseil-cpp-20200923.3/build-static' make[1]: Entering directory '/tmp/B.u4f9ex94/BUILD/abseil-cpp-20200923.3/build-static' [ 49%] Built target demangle_internal make[1]: Leaving directory '/tmp/B.u4f9ex94/BUILD/abseil-cpp-20200923.3/build-static' make[1]: Entering directory '/tmp/B.u4f9ex94/BUILD/abseil-cpp-20200923.3/build-static' [ 49%] Built target stacktrace make[1]: Leaving directory '/tmp/B.u4f9ex94/BUILD/abseil-cpp-20200923.3/build-static' /usr/bin/make -f absl/synchronization/CMakeFiles/graphcycles_internal.dir/build.make absl/synchronization/CMakeFiles/graphcycles_internal.dir/depend make[2]: Entering directory '/tmp/B.u4f9ex94/BUILD/abseil-cpp-20200923.3/build-static' cd /tmp/B.u4f9ex94/BUILD/abseil-cpp-20200923.3/build-static && /usr/bin/cmake -E cmake_depends "Unix Makefiles" /tmp/B.u4f9ex94/BUILD/abseil-cpp-20200923.3 /tmp/B.u4f9ex94/BUILD/abseil-cpp-20200923.3/absl/synchronization /tmp/B.u4f9ex94/BUILD/abseil-cpp-20200923.3/build-static /tmp/B.u4f9ex94/BUILD/abseil-cpp-20200923.3/build-static/absl/synchronization /tmp/B.u4f9ex94/BUILD/abseil-cpp-20200923.3/build-static/absl/synchronization/CMakeFiles/graphcycles_internal.dir/DependInfo.cmake --color= Scanning dependencies of target graphcycles_internal make[2]: Leaving directory '/tmp/B.u4f9ex94/BUILD/abseil-cpp-20200923.3/build-static' /usr/bin/make -f absl/synchronization/CMakeFiles/graphcycles_internal.dir/build.make absl/synchronization/CMakeFiles/graphcycles_internal.dir/build make[2]: Entering directory '/tmp/B.u4f9ex94/BUILD/abseil-cpp-20200923.3/build-static' [ 43%] Building CXX object absl/strings/CMakeFiles/strings.dir/ascii.cc.o cd /tmp/B.u4f9ex94/BUILD/abseil-cpp-20200923.3/build-static/absl/strings && /usr/bin/i686-pld-linux-g++ -I/tmp/B.u4f9ex94/BUILD/abseil-cpp-20200923.3 -O2 -fwrapv -pipe -Wformat -Werror=format-security -gdwarf-4 -fno-debug-types-section -fvar-tracking-assignments -g2 -Wp,-D_FORTIFY_SOURCE=2 -fstack-protector-strong --param=ssp-buffer-size=4 -Werror=trampolines -fomit-frame-pointer -march=i686 -fasynchronous-unwind-tables -mtune=pentium4 -gdwarf-4 -fno-debug-types-section -fvar-tracking-assignments -g2 -DNDEBUG -DQT_NO_DEBUG -Wall -Wextra -Wcast-qual -Wconversion-null -Wmissing-declarations -Woverlength-strings -Wpointer-arith -Wundef -Wunused-local-typedefs -Wunused-result -Wvarargs -Wvla -Wwrite-strings -Wno-missing-field-initializers -Wno-sign-compare -DNOMINMAX -o CMakeFiles/strings.dir/ascii.cc.o -c /tmp/B.u4f9ex94/BUILD/abseil-cpp-20200923.3/absl/strings/ascii.cc make[2]: Leaving directory '/tmp/B.u4f9ex94/BUILD/abseil-cpp-20200923.3/build-static' make[2]: Entering directory '/tmp/B.u4f9ex94/BUILD/abseil-cpp-20200923.3/build-static' [ 46%] Building CXX object absl/strings/CMakeFiles/strings.dir/internal/memutil.cc.o cd /tmp/B.u4f9ex94/BUILD/abseil-cpp-20200923.3/build-static/absl/strings && /usr/bin/i686-pld-linux-g++ -I/tmp/B.u4f9ex94/BUILD/abseil-cpp-20200923.3 -O2 -fwrapv -pipe -Wformat -Werror=format-security -gdwarf-4 -fno-debug-types-section -fvar-tracking-assignments -g2 -Wp,-D_FORTIFY_SOURCE=2 -fstack-protector-strong --param=ssp-buffer-size=4 -Werror=trampolines -fomit-frame-pointer -march=i686 -fasynchronous-unwind-tables -mtune=pentium4 -gdwarf-4 -fno-debug-types-section -fvar-tracking-assignments -g2 -DNDEBUG -DQT_NO_DEBUG -Wall -Wextra -Wcast-qual -Wconversion-null -Wmissing-declarations -Woverlength-strings -Wpointer-arith -Wundef -Wunused-local-typedefs -Wunused-result -Wvarargs -Wvla -Wwrite-strings -Wno-missing-field-initializers -Wno-sign-compare -DNOMINMAX -o CMakeFiles/strings.dir/internal/memutil.cc.o -c /tmp/B.u4f9ex94/BUILD/abseil-cpp-20200923.3/absl/strings/internal/memutil.cc make[2]: Leaving directory '/tmp/B.u4f9ex94/BUILD/abseil-cpp-20200923.3/build-static' make[2]: Entering directory '/tmp/B.u4f9ex94/BUILD/abseil-cpp-20200923.3/build-static' [ 45%] Building CXX object absl/strings/CMakeFiles/strings.dir/internal/charconv_parse.cc.o cd /tmp/B.u4f9ex94/BUILD/abseil-cpp-20200923.3/build-static/absl/strings && /usr/bin/i686-pld-linux-g++ -I/tmp/B.u4f9ex94/BUILD/abseil-cpp-20200923.3 -O2 -fwrapv -pipe -Wformat -Werror=format-security -gdwarf-4 -fno-debug-types-section -fvar-tracking-assignments -g2 -Wp,-D_FORTIFY_SOURCE=2 -fstack-protector-strong --param=ssp-buffer-size=4 -Werror=trampolines -fomit-frame-pointer -march=i686 -fasynchronous-unwind-tables -mtune=pentium4 -gdwarf-4 -fno-debug-types-section -fvar-tracking-assignments -g2 -DNDEBUG -DQT_NO_DEBUG -Wall -Wextra -Wcast-qual -Wconversion-null -Wmissing-declarations -Woverlength-strings -Wpointer-arith -Wundef -Wunused-local-typedefs -Wunused-result -Wvarargs -Wvla -Wwrite-strings -Wno-missing-field-initializers -Wno-sign-compare -DNOMINMAX -o CMakeFiles/strings.dir/internal/charconv_parse.cc.o -c /tmp/B.u4f9ex94/BUILD/abseil-cpp-20200923.3/absl/strings/internal/charconv_parse.cc make[2]: Leaving directory '/tmp/B.u4f9ex94/BUILD/abseil-cpp-20200923.3/build-static' make[2]: Entering directory '/tmp/B.u4f9ex94/BUILD/abseil-cpp-20200923.3/build-static' [ 49%] Building CXX object absl/strings/CMakeFiles/strings.dir/match.cc.o cd /tmp/B.u4f9ex94/BUILD/abseil-cpp-20200923.3/build-static/absl/strings && /usr/bin/i686-pld-linux-g++ -I/tmp/B.u4f9ex94/BUILD/abseil-cpp-20200923.3 -O2 -fwrapv -pipe -Wformat -Werror=format-security -gdwarf-4 -fno-debug-types-section -fvar-tracking-assignments -g2 -Wp,-D_FORTIFY_SOURCE=2 -fstack-protector-strong --param=ssp-buffer-size=4 -Werror=trampolines -fomit-frame-pointer -march=i686 -fasynchronous-unwind-tables -mtune=pentium4 -gdwarf-4 -fno-debug-types-section -fvar-tracking-assignments -g2 -DNDEBUG -DQT_NO_DEBUG -Wall -Wextra -Wcast-qual -Wconversion-null -Wmissing-declarations -Woverlength-strings -Wpointer-arith -Wundef -Wunused-local-typedefs -Wunused-result -Wvarargs -Wvla -Wwrite-strings -Wno-missing-field-initializers -Wno-sign-compare -DNOMINMAX -o CMakeFiles/strings.dir/match.cc.o -c /tmp/B.u4f9ex94/BUILD/abseil-cpp-20200923.3/absl/strings/match.cc make[2]: Leaving directory '/tmp/B.u4f9ex94/BUILD/abseil-cpp-20200923.3/build-static' make[2]: Entering directory '/tmp/B.u4f9ex94/BUILD/abseil-cpp-20200923.3/build-static' [ 43%] Building CXX object absl/strings/CMakeFiles/strings.dir/charconv.cc.o cd /tmp/B.u4f9ex94/BUILD/abseil-cpp-20200923.3/build-static/absl/strings && /usr/bin/i686-pld-linux-g++ -I/tmp/B.u4f9ex94/BUILD/abseil-cpp-20200923.3 -O2 -fwrapv -pipe -Wformat -Werror=format-security -gdwarf-4 -fno-debug-types-section -fvar-tracking-assignments -g2 -Wp,-D_FORTIFY_SOURCE=2 -fstack-protector-strong --param=ssp-buffer-size=4 -Werror=trampolines -fomit-frame-pointer -march=i686 -fasynchronous-unwind-tables -mtune=pentium4 -gdwarf-4 -fno-debug-types-section -fvar-tracking-assignments -g2 -DNDEBUG -DQT_NO_DEBUG -Wall -Wextra -Wcast-qual -Wconversion-null -Wmissing-declarations -Woverlength-strings -Wpointer-arith -Wundef -Wunused-local-typedefs -Wunused-result -Wvarargs -Wvla -Wwrite-strings -Wno-missing-field-initializers -Wno-sign-compare -DNOMINMAX -o CMakeFiles/strings.dir/charconv.cc.o -c /tmp/B.u4f9ex94/BUILD/abseil-cpp-20200923.3/absl/strings/charconv.cc make[2]: Leaving directory '/tmp/B.u4f9ex94/BUILD/abseil-cpp-20200923.3/build-static' make[2]: Entering directory '/tmp/B.u4f9ex94/BUILD/abseil-cpp-20200923.3/build-static' [ 44%] Building CXX object absl/strings/CMakeFiles/strings.dir/escaping.cc.o cd /tmp/B.u4f9ex94/BUILD/abseil-cpp-20200923.3/build-static/absl/strings && /usr/bin/i686-pld-linux-g++ -I/tmp/B.u4f9ex94/BUILD/abseil-cpp-20200923.3 -O2 -fwrapv -pipe -Wformat -Werror=format-security -gdwarf-4 -fno-debug-types-section -fvar-tracking-assignments -g2 -Wp,-D_FORTIFY_SOURCE=2 -fstack-protector-strong --param=ssp-buffer-size=4 -Werror=trampolines -fomit-frame-pointer -march=i686 -fasynchronous-unwind-tables -mtune=pentium4 -gdwarf-4 -fno-debug-types-section -fvar-tracking-assignments -g2 -DNDEBUG -DQT_NO_DEBUG -Wall -Wextra -Wcast-qual -Wconversion-null -Wmissing-declarations -Woverlength-strings -Wpointer-arith -Wundef -Wunused-local-typedefs -Wunused-result -Wvarargs -Wvla -Wwrite-strings -Wno-missing-field-initializers -Wno-sign-compare -DNOMINMAX -o CMakeFiles/strings.dir/escaping.cc.o -c /tmp/B.u4f9ex94/BUILD/abseil-cpp-20200923.3/absl/strings/escaping.cc make[2]: Leaving directory '/tmp/B.u4f9ex94/BUILD/abseil-cpp-20200923.3/build-static' make[2]: Entering directory '/tmp/B.u4f9ex94/BUILD/abseil-cpp-20200923.3/build-static' [ 45%] Building CXX object absl/strings/CMakeFiles/strings.dir/internal/charconv_bigint.cc.o cd /tmp/B.u4f9ex94/BUILD/abseil-cpp-20200923.3/build-static/absl/strings && /usr/bin/i686-pld-linux-g++ -I/tmp/B.u4f9ex94/BUILD/abseil-cpp-20200923.3 -O2 -fwrapv -pipe -Wformat -Werror=format-security -gdwarf-4 -fno-debug-types-section -fvar-tracking-assignments -g2 -Wp,-D_FORTIFY_SOURCE=2 -fstack-protector-strong --param=ssp-buffer-size=4 -Werror=trampolines -fomit-frame-pointer -march=i686 -fasynchronous-unwind-tables -mtune=pentium4 -gdwarf-4 -fno-debug-types-section -fvar-tracking-assignments -g2 -DNDEBUG -DQT_NO_DEBUG -Wall -Wextra -Wcast-qual -Wconversion-null -Wmissing-declarations -Woverlength-strings -Wpointer-arith -Wundef -Wunused-local-typedefs -Wunused-result -Wvarargs -Wvla -Wwrite-strings -Wno-missing-field-initializers -Wno-sign-compare -DNOMINMAX -o CMakeFiles/strings.dir/internal/charconv_bigint.cc.o -c /tmp/B.u4f9ex94/BUILD/abseil-cpp-20200923.3/absl/strings/internal/charconv_bigint.cc make[2]: Leaving directory '/tmp/B.u4f9ex94/BUILD/abseil-cpp-20200923.3/build-static' make[2]: Entering directory '/tmp/B.u4f9ex94/BUILD/abseil-cpp-20200923.3/build-static' [ 52%] Building CXX object absl/strings/CMakeFiles/strings.dir/string_view.cc.o cd /tmp/B.u4f9ex94/BUILD/abseil-cpp-20200923.3/build-static/absl/strings && /usr/bin/i686-pld-linux-g++ -I/tmp/B.u4f9ex94/BUILD/abseil-cpp-20200923.3 -O2 -fwrapv -pipe -Wformat -Werror=format-security -gdwarf-4 -fno-debug-types-section -fvar-tracking-assignments -g2 -Wp,-D_FORTIFY_SOURCE=2 -fstack-protector-strong --param=ssp-buffer-size=4 -Werror=trampolines -fomit-frame-pointer -march=i686 -fasynchronous-unwind-tables -mtune=pentium4 -gdwarf-4 -fno-debug-types-section -fvar-tracking-assignments -g2 -DNDEBUG -DQT_NO_DEBUG -Wall -Wextra -Wcast-qual -Wconversion-null -Wmissing-declarations -Woverlength-strings -Wpointer-arith -Wundef -Wunused-local-typedefs -Wunused-result -Wvarargs -Wvla -Wwrite-strings -Wno-missing-field-initializers -Wno-sign-compare -DNOMINMAX -o CMakeFiles/strings.dir/string_view.cc.o -c /tmp/B.u4f9ex94/BUILD/abseil-cpp-20200923.3/absl/strings/string_view.cc make[2]: Leaving directory '/tmp/B.u4f9ex94/BUILD/abseil-cpp-20200923.3/build-static' make[2]: Entering directory '/tmp/B.u4f9ex94/BUILD/abseil-cpp-20200923.3/build-static' [ 51%] Building CXX object absl/strings/CMakeFiles/strings.dir/str_replace.cc.o cd /tmp/B.u4f9ex94/BUILD/abseil-cpp-20200923.3/build-static/absl/strings && /usr/bin/i686-pld-linux-g++ -I/tmp/B.u4f9ex94/BUILD/abseil-cpp-20200923.3 -O2 -fwrapv -pipe -Wformat -Werror=format-security -gdwarf-4 -fno-debug-types-section -fvar-tracking-assignments -g2 -Wp,-D_FORTIFY_SOURCE=2 -fstack-protector-strong --param=ssp-buffer-size=4 -Werror=trampolines -fomit-frame-pointer -march=i686 -fasynchronous-unwind-tables -mtune=pentium4 -gdwarf-4 -fno-debug-types-section -fvar-tracking-assignments -g2 -DNDEBUG -DQT_NO_DEBUG -Wall -Wextra -Wcast-qual -Wconversion-null -Wmissing-declarations -Woverlength-strings -Wpointer-arith -Wundef -Wunused-local-typedefs -Wunused-result -Wvarargs -Wvla -Wwrite-strings -Wno-missing-field-initializers -Wno-sign-compare -DNOMINMAX -o CMakeFiles/strings.dir/str_replace.cc.o -c /tmp/B.u4f9ex94/BUILD/abseil-cpp-20200923.3/absl/strings/str_replace.cc make[2]: Leaving directory '/tmp/B.u4f9ex94/BUILD/abseil-cpp-20200923.3/build-static' make[2]: Entering directory '/tmp/B.u4f9ex94/BUILD/abseil-cpp-20200923.3/build-static' [ 50%] Building CXX object absl/strings/CMakeFiles/strings.dir/numbers.cc.o cd /tmp/B.u4f9ex94/BUILD/abseil-cpp-20200923.3/build-static/absl/strings && /usr/bin/i686-pld-linux-g++ -I/tmp/B.u4f9ex94/BUILD/abseil-cpp-20200923.3 -O2 -fwrapv -pipe -Wformat -Werror=format-security -gdwarf-4 -fno-debug-types-section -fvar-tracking-assignments -g2 -Wp,-D_FORTIFY_SOURCE=2 -fstack-protector-strong --param=ssp-buffer-size=4 -Werror=trampolines -fomit-frame-pointer -march=i686 -fasynchronous-unwind-tables -mtune=pentium4 -gdwarf-4 -fno-debug-types-section -fvar-tracking-assignments -g2 -DNDEBUG -DQT_NO_DEBUG -Wall -Wextra -Wcast-qual -Wconversion-null -Wmissing-declarations -Woverlength-strings -Wpointer-arith -Wundef -Wunused-local-typedefs -Wunused-result -Wvarargs -Wvla -Wwrite-strings -Wno-missing-field-initializers -Wno-sign-compare -DNOMINMAX -o CMakeFiles/strings.dir/numbers.cc.o -c /tmp/B.u4f9ex94/BUILD/abseil-cpp-20200923.3/absl/strings/numbers.cc make[2]: Leaving directory '/tmp/B.u4f9ex94/BUILD/abseil-cpp-20200923.3/build-static' make[2]: Entering directory '/tmp/B.u4f9ex94/BUILD/abseil-cpp-20200923.3/build-static' [ 50%] Building CXX object absl/strings/CMakeFiles/strings.dir/str_cat.cc.o cd /tmp/B.u4f9ex94/BUILD/abseil-cpp-20200923.3/build-static/absl/strings && /usr/bin/i686-pld-linux-g++ -I/tmp/B.u4f9ex94/BUILD/abseil-cpp-20200923.3 -O2 -fwrapv -pipe -Wformat -Werror=format-security -gdwarf-4 -fno-debug-types-section -fvar-tracking-assignments -g2 -Wp,-D_FORTIFY_SOURCE=2 -fstack-protector-strong --param=ssp-buffer-size=4 -Werror=trampolines -fomit-frame-pointer -march=i686 -fasynchronous-unwind-tables -mtune=pentium4 -gdwarf-4 -fno-debug-types-section -fvar-tracking-assignments -g2 -DNDEBUG -DQT_NO_DEBUG -Wall -Wextra -Wcast-qual -Wconversion-null -Wmissing-declarations -Woverlength-strings -Wpointer-arith -Wundef -Wunused-local-typedefs -Wunused-result -Wvarargs -Wvla -Wwrite-strings -Wno-missing-field-initializers -Wno-sign-compare -DNOMINMAX -o CMakeFiles/strings.dir/str_cat.cc.o -c /tmp/B.u4f9ex94/BUILD/abseil-cpp-20200923.3/absl/strings/str_cat.cc make[2]: Leaving directory '/tmp/B.u4f9ex94/BUILD/abseil-cpp-20200923.3/build-static' make[2]: Entering directory '/tmp/B.u4f9ex94/BUILD/abseil-cpp-20200923.3/build-static' [ 50%] Building CXX object absl/synchronization/CMakeFiles/graphcycles_internal.dir/internal/graphcycles.cc.o cd /tmp/B.u4f9ex94/BUILD/abseil-cpp-20200923.3/build-static/absl/synchronization && /usr/bin/i686-pld-linux-g++ -I/tmp/B.u4f9ex94/BUILD/abseil-cpp-20200923.3 -O2 -fwrapv -pipe -Wformat -Werror=format-security -gdwarf-4 -fno-debug-types-section -fvar-tracking-assignments -g2 -Wp,-D_FORTIFY_SOURCE=2 -fstack-protector-strong --param=ssp-buffer-size=4 -Werror=trampolines -fomit-frame-pointer -march=i686 -fasynchronous-unwind-tables -mtune=pentium4 -gdwarf-4 -fno-debug-types-section -fvar-tracking-assignments -g2 -DNDEBUG -DQT_NO_DEBUG -Wall -Wextra -Wcast-qual -Wconversion-null -Wmissing-declarations -Woverlength-strings -Wpointer-arith -Wundef -Wunused-local-typedefs -Wunused-result -Wvarargs -Wvla -Wwrite-strings -Wno-missing-field-initializers -Wno-sign-compare -DNOMINMAX -o CMakeFiles/graphcycles_internal.dir/internal/graphcycles.cc.o -c /tmp/B.u4f9ex94/BUILD/abseil-cpp-20200923.3/absl/synchronization/internal/graphcycles.cc make[2]: Leaving directory '/tmp/B.u4f9ex94/BUILD/abseil-cpp-20200923.3/build-static' make[2]: Entering directory '/tmp/B.u4f9ex94/BUILD/abseil-cpp-20200923.3/build-static' [ 52%] Building CXX object absl/strings/CMakeFiles/strings.dir/str_split.cc.o cd /tmp/B.u4f9ex94/BUILD/abseil-cpp-20200923.3/build-static/absl/strings && /usr/bin/i686-pld-linux-g++ -I/tmp/B.u4f9ex94/BUILD/abseil-cpp-20200923.3 -O2 -fwrapv -pipe -Wformat -Werror=format-security -gdwarf-4 -fno-debug-types-section -fvar-tracking-assignments -g2 -Wp,-D_FORTIFY_SOURCE=2 -fstack-protector-strong --param=ssp-buffer-size=4 -Werror=trampolines -fomit-frame-pointer -march=i686 -fasynchronous-unwind-tables -mtune=pentium4 -gdwarf-4 -fno-debug-types-section -fvar-tracking-assignments -g2 -DNDEBUG -DQT_NO_DEBUG -Wall -Wextra -Wcast-qual -Wconversion-null -Wmissing-declarations -Woverlength-strings -Wpointer-arith -Wundef -Wunused-local-typedefs -Wunused-result -Wvarargs -Wvla -Wwrite-strings -Wno-missing-field-initializers -Wno-sign-compare -DNOMINMAX -o CMakeFiles/strings.dir/str_split.cc.o -c /tmp/B.u4f9ex94/BUILD/abseil-cpp-20200923.3/absl/strings/str_split.cc make[2]: Leaving directory '/tmp/B.u4f9ex94/BUILD/abseil-cpp-20200923.3/build-static' make[2]: Entering directory '/tmp/B.u4f9ex94/BUILD/abseil-cpp-20200923.3/build-static' [ 54%] Linking CXX static library libabsl_graphcycles_internal.a cd /tmp/B.u4f9ex94/BUILD/abseil-cpp-20200923.3/build-static/absl/synchronization && /usr/bin/cmake -P CMakeFiles/graphcycles_internal.dir/cmake_clean_target.cmake cd /tmp/B.u4f9ex94/BUILD/abseil-cpp-20200923.3/build-static/absl/synchronization && /usr/bin/cmake -E cmake_link_script CMakeFiles/graphcycles_internal.dir/link.txt --verbose=1 /usr/bin/ar qc libabsl_graphcycles_internal.a CMakeFiles/graphcycles_internal.dir/internal/graphcycles.cc.o /usr/bin/ranlib libabsl_graphcycles_internal.a make[2]: Leaving directory '/tmp/B.u4f9ex94/BUILD/abseil-cpp-20200923.3/build-static' make[1]: Entering directory '/tmp/B.u4f9ex94/BUILD/abseil-cpp-20200923.3/build-static' [ 54%] Built target graphcycles_internal make[1]: Leaving directory '/tmp/B.u4f9ex94/BUILD/abseil-cpp-20200923.3/build-static' make[2]: Entering directory '/tmp/B.u4f9ex94/BUILD/abseil-cpp-20200923.3/build-static' [ 53%] Building CXX object absl/strings/CMakeFiles/strings.dir/substitute.cc.o cd /tmp/B.u4f9ex94/BUILD/abseil-cpp-20200923.3/build-static/absl/strings && /usr/bin/i686-pld-linux-g++ -I/tmp/B.u4f9ex94/BUILD/abseil-cpp-20200923.3 -O2 -fwrapv -pipe -Wformat -Werror=format-security -gdwarf-4 -fno-debug-types-section -fvar-tracking-assignments -g2 -Wp,-D_FORTIFY_SOURCE=2 -fstack-protector-strong --param=ssp-buffer-size=4 -Werror=trampolines -fomit-frame-pointer -march=i686 -fasynchronous-unwind-tables -mtune=pentium4 -gdwarf-4 -fno-debug-types-section -fvar-tracking-assignments -g2 -DNDEBUG -DQT_NO_DEBUG -Wall -Wextra -Wcast-qual -Wconversion-null -Wmissing-declarations -Woverlength-strings -Wpointer-arith -Wundef -Wunused-local-typedefs -Wunused-result -Wvarargs -Wvla -Wwrite-strings -Wno-missing-field-initializers -Wno-sign-compare -DNOMINMAX -o CMakeFiles/strings.dir/substitute.cc.o -c /tmp/B.u4f9ex94/BUILD/abseil-cpp-20200923.3/absl/strings/substitute.cc make[2]: Leaving directory '/tmp/B.u4f9ex94/BUILD/abseil-cpp-20200923.3/build-static' make[2]: Entering directory '/tmp/B.u4f9ex94/BUILD/abseil-cpp-20200923.3/build-static' [ 54%] Linking CXX static library libabsl_strings.a cd /tmp/B.u4f9ex94/BUILD/abseil-cpp-20200923.3/build-static/absl/strings && /usr/bin/cmake -P CMakeFiles/strings.dir/cmake_clean_target.cmake cd /tmp/B.u4f9ex94/BUILD/abseil-cpp-20200923.3/build-static/absl/strings && /usr/bin/cmake -E cmake_link_script CMakeFiles/strings.dir/link.txt --verbose=1 /usr/bin/ar qc libabsl_strings.a CMakeFiles/strings.dir/ascii.cc.o CMakeFiles/strings.dir/charconv.cc.o CMakeFiles/strings.dir/escaping.cc.o CMakeFiles/strings.dir/internal/charconv_bigint.cc.o CMakeFiles/strings.dir/internal/charconv_parse.cc.o CMakeFiles/strings.dir/internal/memutil.cc.o CMakeFiles/strings.dir/match.cc.o CMakeFiles/strings.dir/numbers.cc.o CMakeFiles/strings.dir/str_cat.cc.o CMakeFiles/strings.dir/str_replace.cc.o CMakeFiles/strings.dir/str_split.cc.o CMakeFiles/strings.dir/string_view.cc.o CMakeFiles/strings.dir/substitute.cc.o /usr/bin/ranlib libabsl_strings.a make[2]: Leaving directory '/tmp/B.u4f9ex94/BUILD/abseil-cpp-20200923.3/build-static' make[1]: Entering directory '/tmp/B.u4f9ex94/BUILD/abseil-cpp-20200923.3/build-static' [ 54%] Built target strings make[1]: Leaving directory '/tmp/B.u4f9ex94/BUILD/abseil-cpp-20200923.3/build-static' /usr/bin/make -f absl/time/CMakeFiles/time.dir/build.make absl/time/CMakeFiles/time.dir/depend /usr/bin/make -f absl/debugging/CMakeFiles/symbolize.dir/build.make absl/debugging/CMakeFiles/symbolize.dir/depend /usr/bin/make -f absl/flags/CMakeFiles/flags_commandlineflag.dir/build.make absl/flags/CMakeFiles/flags_commandlineflag.dir/depend /usr/bin/make -f absl/strings/CMakeFiles/str_format_internal.dir/build.make absl/strings/CMakeFiles/str_format_internal.dir/depend /usr/bin/make -f absl/hash/CMakeFiles/hash.dir/build.make absl/hash/CMakeFiles/hash.dir/depend /usr/bin/make -f absl/strings/CMakeFiles/cord.dir/build.make absl/strings/CMakeFiles/cord.dir/depend /usr/bin/make -f absl/random/CMakeFiles/random_internal_seed_material.dir/build.make absl/random/CMakeFiles/random_internal_seed_material.dir/depend /usr/bin/make -f absl/random/CMakeFiles/random_distributions.dir/build.make absl/random/CMakeFiles/random_distributions.dir/depend make[2]: Entering directory '/tmp/B.u4f9ex94/BUILD/abseil-cpp-20200923.3/build-static' cd /tmp/B.u4f9ex94/BUILD/abseil-cpp-20200923.3/build-static && /usr/bin/cmake -E cmake_depends "Unix Makefiles" /tmp/B.u4f9ex94/BUILD/abseil-cpp-20200923.3 /tmp/B.u4f9ex94/BUILD/abseil-cpp-20200923.3/absl/flags /tmp/B.u4f9ex94/BUILD/abseil-cpp-20200923.3/build-static /tmp/B.u4f9ex94/BUILD/abseil-cpp-20200923.3/build-static/absl/flags /tmp/B.u4f9ex94/BUILD/abseil-cpp-20200923.3/build-static/absl/flags/CMakeFiles/flags_commandlineflag.dir/DependInfo.cmake --color= Scanning dependencies of target flags_commandlineflag make[2]: Leaving directory '/tmp/B.u4f9ex94/BUILD/abseil-cpp-20200923.3/build-static' /usr/bin/make -f absl/flags/CMakeFiles/flags_commandlineflag.dir/build.make absl/flags/CMakeFiles/flags_commandlineflag.dir/build make[2]: Entering directory '/tmp/B.u4f9ex94/BUILD/abseil-cpp-20200923.3/build-static' cd /tmp/B.u4f9ex94/BUILD/abseil-cpp-20200923.3/build-static && /usr/bin/cmake -E cmake_depends "Unix Makefiles" /tmp/B.u4f9ex94/BUILD/abseil-cpp-20200923.3 /tmp/B.u4f9ex94/BUILD/abseil-cpp-20200923.3/absl/random /tmp/B.u4f9ex94/BUILD/abseil-cpp-20200923.3/build-static /tmp/B.u4f9ex94/BUILD/abseil-cpp-20200923.3/build-static/absl/random /tmp/B.u4f9ex94/BUILD/abseil-cpp-20200923.3/build-static/absl/random/CMakeFiles/random_distributions.dir/DependInfo.cmake --color= Scanning dependencies of target random_distributions make[2]: Leaving directory '/tmp/B.u4f9ex94/BUILD/abseil-cpp-20200923.3/build-static' make[2]: Entering directory '/tmp/B.u4f9ex94/BUILD/abseil-cpp-20200923.3/build-static' cd /tmp/B.u4f9ex94/BUILD/abseil-cpp-20200923.3/build-static && /usr/bin/cmake -E cmake_depends "Unix Makefiles" /tmp/B.u4f9ex94/BUILD/abseil-cpp-20200923.3 /tmp/B.u4f9ex94/BUILD/abseil-cpp-20200923.3/absl/debugging /tmp/B.u4f9ex94/BUILD/abseil-cpp-20200923.3/build-static /tmp/B.u4f9ex94/BUILD/abseil-cpp-20200923.3/build-static/absl/debugging /tmp/B.u4f9ex94/BUILD/abseil-cpp-20200923.3/build-static/absl/debugging/CMakeFiles/symbolize.dir/DependInfo.cmake --color= Scanning dependencies of target symbolize make[2]: Leaving directory '/tmp/B.u4f9ex94/BUILD/abseil-cpp-20200923.3/build-static' make[2]: Entering directory '/tmp/B.u4f9ex94/BUILD/abseil-cpp-20200923.3/build-static' cd /tmp/B.u4f9ex94/BUILD/abseil-cpp-20200923.3/build-static && /usr/bin/cmake -E cmake_depends "Unix Makefiles" /tmp/B.u4f9ex94/BUILD/abseil-cpp-20200923.3 /tmp/B.u4f9ex94/BUILD/abseil-cpp-20200923.3/absl/random /tmp/B.u4f9ex94/BUILD/abseil-cpp-20200923.3/build-static /tmp/B.u4f9ex94/BUILD/abseil-cpp-20200923.3/build-static/absl/random /tmp/B.u4f9ex94/BUILD/abseil-cpp-20200923.3/build-static/absl/random/CMakeFiles/random_internal_seed_material.dir/DependInfo.cmake --color= Scanning dependencies of target random_internal_seed_material make[2]: Leaving directory '/tmp/B.u4f9ex94/BUILD/abseil-cpp-20200923.3/build-static' /usr/bin/make -f absl/random/CMakeFiles/random_distributions.dir/build.make absl/random/CMakeFiles/random_distributions.dir/build make[2]: Entering directory '/tmp/B.u4f9ex94/BUILD/abseil-cpp-20200923.3/build-static' cd /tmp/B.u4f9ex94/BUILD/abseil-cpp-20200923.3/build-static && /usr/bin/cmake -E cmake_depends "Unix Makefiles" /tmp/B.u4f9ex94/BUILD/abseil-cpp-20200923.3 /tmp/B.u4f9ex94/BUILD/abseil-cpp-20200923.3/absl/hash /tmp/B.u4f9ex94/BUILD/abseil-cpp-20200923.3/build-static /tmp/B.u4f9ex94/BUILD/abseil-cpp-20200923.3/build-static/absl/hash /tmp/B.u4f9ex94/BUILD/abseil-cpp-20200923.3/build-static/absl/hash/CMakeFiles/hash.dir/DependInfo.cmake --color= Scanning dependencies of target hash make[2]: Leaving directory '/tmp/B.u4f9ex94/BUILD/abseil-cpp-20200923.3/build-static' /usr/bin/make -f absl/debugging/CMakeFiles/symbolize.dir/build.make absl/debugging/CMakeFiles/symbolize.dir/build make[2]: Entering directory '/tmp/B.u4f9ex94/BUILD/abseil-cpp-20200923.3/build-static' cd /tmp/B.u4f9ex94/BUILD/abseil-cpp-20200923.3/build-static && /usr/bin/cmake -E cmake_depends "Unix Makefiles" /tmp/B.u4f9ex94/BUILD/abseil-cpp-20200923.3 /tmp/B.u4f9ex94/BUILD/abseil-cpp-20200923.3/absl/time /tmp/B.u4f9ex94/BUILD/abseil-cpp-20200923.3/build-static /tmp/B.u4f9ex94/BUILD/abseil-cpp-20200923.3/build-static/absl/time /tmp/B.u4f9ex94/BUILD/abseil-cpp-20200923.3/build-static/absl/time/CMakeFiles/time.dir/DependInfo.cmake --color= Scanning dependencies of target time make[2]: Leaving directory '/tmp/B.u4f9ex94/BUILD/abseil-cpp-20200923.3/build-static' /usr/bin/make -f absl/hash/CMakeFiles/hash.dir/build.make absl/hash/CMakeFiles/hash.dir/build make[2]: Entering directory '/tmp/B.u4f9ex94/BUILD/abseil-cpp-20200923.3/build-static' cd /tmp/B.u4f9ex94/BUILD/abseil-cpp-20200923.3/build-static && /usr/bin/cmake -E cmake_depends "Unix Makefiles" /tmp/B.u4f9ex94/BUILD/abseil-cpp-20200923.3 /tmp/B.u4f9ex94/BUILD/abseil-cpp-20200923.3/absl/strings /tmp/B.u4f9ex94/BUILD/abseil-cpp-20200923.3/build-static /tmp/B.u4f9ex94/BUILD/abseil-cpp-20200923.3/build-static/absl/strings /tmp/B.u4f9ex94/BUILD/abseil-cpp-20200923.3/build-static/absl/strings/CMakeFiles/cord.dir/DependInfo.cmake --color= Scanning dependencies of target cord make[2]: Leaving directory '/tmp/B.u4f9ex94/BUILD/abseil-cpp-20200923.3/build-static' /usr/bin/make -f absl/random/CMakeFiles/random_internal_seed_material.dir/build.make absl/random/CMakeFiles/random_internal_seed_material.dir/build /usr/bin/make -f absl/strings/CMakeFiles/cord.dir/build.make absl/strings/CMakeFiles/cord.dir/build /usr/bin/make -f absl/time/CMakeFiles/time.dir/build.make absl/time/CMakeFiles/time.dir/build make[2]: Entering directory '/tmp/B.u4f9ex94/BUILD/abseil-cpp-20200923.3/build-static' cd /tmp/B.u4f9ex94/BUILD/abseil-cpp-20200923.3/build-static && /usr/bin/cmake -E cmake_depends "Unix Makefiles" /tmp/B.u4f9ex94/BUILD/abseil-cpp-20200923.3 /tmp/B.u4f9ex94/BUILD/abseil-cpp-20200923.3/absl/strings /tmp/B.u4f9ex94/BUILD/abseil-cpp-20200923.3/build-static /tmp/B.u4f9ex94/BUILD/abseil-cpp-20200923.3/build-static/absl/strings /tmp/B.u4f9ex94/BUILD/abseil-cpp-20200923.3/build-static/absl/strings/CMakeFiles/str_format_internal.dir/DependInfo.cmake --color= Scanning dependencies of target str_format_internal make[2]: Leaving directory '/tmp/B.u4f9ex94/BUILD/abseil-cpp-20200923.3/build-static' /usr/bin/make -f absl/strings/CMakeFiles/str_format_internal.dir/build.make absl/strings/CMakeFiles/str_format_internal.dir/build make[2]: Entering directory '/tmp/B.u4f9ex94/BUILD/abseil-cpp-20200923.3/build-static' [ 54%] Building CXX object absl/flags/CMakeFiles/flags_commandlineflag.dir/commandlineflag.cc.o cd /tmp/B.u4f9ex94/BUILD/abseil-cpp-20200923.3/build-static/absl/flags && /usr/bin/i686-pld-linux-g++ -I/tmp/B.u4f9ex94/BUILD/abseil-cpp-20200923.3 -O2 -fwrapv -pipe -Wformat -Werror=format-security -gdwarf-4 -fno-debug-types-section -fvar-tracking-assignments -g2 -Wp,-D_FORTIFY_SOURCE=2 -fstack-protector-strong --param=ssp-buffer-size=4 -Werror=trampolines -fomit-frame-pointer -march=i686 -fasynchronous-unwind-tables -mtune=pentium4 -gdwarf-4 -fno-debug-types-section -fvar-tracking-assignments -g2 -DNDEBUG -DQT_NO_DEBUG -Wall -Wextra -Wcast-qual -Wconversion-null -Wmissing-declarations -Woverlength-strings -Wpointer-arith -Wundef -Wunused-local-typedefs -Wunused-result -Wvarargs -Wvla -Wwrite-strings -Wno-missing-field-initializers -Wno-sign-compare -DNOMINMAX -o CMakeFiles/flags_commandlineflag.dir/commandlineflag.cc.o -c /tmp/B.u4f9ex94/BUILD/abseil-cpp-20200923.3/absl/flags/commandlineflag.cc make[2]: Leaving directory '/tmp/B.u4f9ex94/BUILD/abseil-cpp-20200923.3/build-static' make[2]: Entering directory '/tmp/B.u4f9ex94/BUILD/abseil-cpp-20200923.3/build-static' [ 57%] Building CXX object absl/random/CMakeFiles/random_distributions.dir/gaussian_distribution.cc.o cd /tmp/B.u4f9ex94/BUILD/abseil-cpp-20200923.3/build-static/absl/random && /usr/bin/i686-pld-linux-g++ -I/tmp/B.u4f9ex94/BUILD/abseil-cpp-20200923.3 -O2 -fwrapv -pipe -Wformat -Werror=format-security -gdwarf-4 -fno-debug-types-section -fvar-tracking-assignments -g2 -Wp,-D_FORTIFY_SOURCE=2 -fstack-protector-strong --param=ssp-buffer-size=4 -Werror=trampolines -fomit-frame-pointer -march=i686 -fasynchronous-unwind-tables -mtune=pentium4 -gdwarf-4 -fno-debug-types-section -fvar-tracking-assignments -g2 -DNDEBUG -DQT_NO_DEBUG -Wall -Wextra -Wcast-qual -Wconversion-null -Wmissing-declarations -Woverlength-strings -Wpointer-arith -Wundef -Wunused-local-typedefs -Wunused-result -Wvarargs -Wvla -Wwrite-strings -Wno-missing-field-initializers -Wno-sign-compare -DNOMINMAX -o CMakeFiles/random_distributions.dir/gaussian_distribution.cc.o -c /tmp/B.u4f9ex94/BUILD/abseil-cpp-20200923.3/absl/random/gaussian_distribution.cc make[2]: Leaving directory '/tmp/B.u4f9ex94/BUILD/abseil-cpp-20200923.3/build-static' make[2]: Entering directory '/tmp/B.u4f9ex94/BUILD/abseil-cpp-20200923.3/build-static' [ 60%] Linking CXX static library libabsl_flags_commandlineflag.a cd /tmp/B.u4f9ex94/BUILD/abseil-cpp-20200923.3/build-static/absl/flags && /usr/bin/cmake -P CMakeFiles/flags_commandlineflag.dir/cmake_clean_target.cmake cd /tmp/B.u4f9ex94/BUILD/abseil-cpp-20200923.3/build-static/absl/flags && /usr/bin/cmake -E cmake_link_script CMakeFiles/flags_commandlineflag.dir/link.txt --verbose=1 /usr/bin/ar qc libabsl_flags_commandlineflag.a CMakeFiles/flags_commandlineflag.dir/commandlineflag.cc.o /usr/bin/ranlib libabsl_flags_commandlineflag.a make[2]: Leaving directory '/tmp/B.u4f9ex94/BUILD/abseil-cpp-20200923.3/build-static' make[1]: Entering directory '/tmp/B.u4f9ex94/BUILD/abseil-cpp-20200923.3/build-static' [ 61%] Built target flags_commandlineflag make[1]: Leaving directory '/tmp/B.u4f9ex94/BUILD/abseil-cpp-20200923.3/build-static' make[2]: Entering directory '/tmp/B.u4f9ex94/BUILD/abseil-cpp-20200923.3/build-static' [ 57%] Building CXX object absl/random/CMakeFiles/random_internal_seed_material.dir/internal/seed_material.cc.o cd /tmp/B.u4f9ex94/BUILD/abseil-cpp-20200923.3/build-static/absl/random && /usr/bin/i686-pld-linux-g++ -I/tmp/B.u4f9ex94/BUILD/abseil-cpp-20200923.3 -O2 -fwrapv -pipe -Wformat -Werror=format-security -gdwarf-4 -fno-debug-types-section -fvar-tracking-assignments -g2 -Wp,-D_FORTIFY_SOURCE=2 -fstack-protector-strong --param=ssp-buffer-size=4 -Werror=trampolines -fomit-frame-pointer -march=i686 -fasynchronous-unwind-tables -mtune=pentium4 -gdwarf-4 -fno-debug-types-section -fvar-tracking-assignments -g2 -DNDEBUG -DQT_NO_DEBUG -Wall -Wextra -Wcast-qual -Wconversion-null -Wmissing-declarations -Woverlength-strings -Wpointer-arith -Wundef -Wunused-local-typedefs -Wunused-result -Wvarargs -Wvla -Wwrite-strings -Wno-missing-field-initializers -Wno-sign-compare -DNOMINMAX -o CMakeFiles/random_internal_seed_material.dir/internal/seed_material.cc.o -c /tmp/B.u4f9ex94/BUILD/abseil-cpp-20200923.3/absl/random/internal/seed_material.cc make[2]: Leaving directory '/tmp/B.u4f9ex94/BUILD/abseil-cpp-20200923.3/build-static' make[2]: Entering directory '/tmp/B.u4f9ex94/BUILD/abseil-cpp-20200923.3/build-static' [ 55%] Building CXX object absl/random/CMakeFiles/random_distributions.dir/discrete_distribution.cc.o cd /tmp/B.u4f9ex94/BUILD/abseil-cpp-20200923.3/build-static/absl/random && /usr/bin/i686-pld-linux-g++ -I/tmp/B.u4f9ex94/BUILD/abseil-cpp-20200923.3 -O2 -fwrapv -pipe -Wformat -Werror=format-security -gdwarf-4 -fno-debug-types-section -fvar-tracking-assignments -g2 -Wp,-D_FORTIFY_SOURCE=2 -fstack-protector-strong --param=ssp-buffer-size=4 -Werror=trampolines -fomit-frame-pointer -march=i686 -fasynchronous-unwind-tables -mtune=pentium4 -gdwarf-4 -fno-debug-types-section -fvar-tracking-assignments -g2 -DNDEBUG -DQT_NO_DEBUG -Wall -Wextra -Wcast-qual -Wconversion-null -Wmissing-declarations -Woverlength-strings -Wpointer-arith -Wundef -Wunused-local-typedefs -Wunused-result -Wvarargs -Wvla -Wwrite-strings -Wno-missing-field-initializers -Wno-sign-compare -DNOMINMAX -o CMakeFiles/random_distributions.dir/discrete_distribution.cc.o -c /tmp/B.u4f9ex94/BUILD/abseil-cpp-20200923.3/absl/random/discrete_distribution.cc make[2]: Leaving directory '/tmp/B.u4f9ex94/BUILD/abseil-cpp-20200923.3/build-static' make[2]: Entering directory '/tmp/B.u4f9ex94/BUILD/abseil-cpp-20200923.3/build-static' [ 62%] Linking CXX static library libabsl_random_distributions.a cd /tmp/B.u4f9ex94/BUILD/abseil-cpp-20200923.3/build-static/absl/random && /usr/bin/cmake -P CMakeFiles/random_distributions.dir/cmake_clean_target.cmake cd /tmp/B.u4f9ex94/BUILD/abseil-cpp-20200923.3/build-static/absl/random && /usr/bin/cmake -E cmake_link_script CMakeFiles/random_distributions.dir/link.txt --verbose=1 /usr/bin/ar qc libabsl_random_distributions.a CMakeFiles/random_distributions.dir/discrete_distribution.cc.o CMakeFiles/random_distributions.dir/gaussian_distribution.cc.o /usr/bin/ranlib libabsl_random_distributions.a make[2]: Leaving directory '/tmp/B.u4f9ex94/BUILD/abseil-cpp-20200923.3/build-static' make[2]: Entering directory '/tmp/B.u4f9ex94/BUILD/abseil-cpp-20200923.3/build-static' [ 61%] Linking CXX static library libabsl_random_internal_seed_material.a cd /tmp/B.u4f9ex94/BUILD/abseil-cpp-20200923.3/build-static/absl/random && /usr/bin/cmake -P CMakeFiles/random_internal_seed_material.dir/cmake_clean_target.cmake cd /tmp/B.u4f9ex94/BUILD/abseil-cpp-20200923.3/build-static/absl/random && /usr/bin/cmake -E cmake_link_script CMakeFiles/random_internal_seed_material.dir/link.txt --verbose=1 /usr/bin/ar qc libabsl_random_internal_seed_material.a CMakeFiles/random_internal_seed_material.dir/internal/seed_material.cc.o /usr/bin/ranlib libabsl_random_internal_seed_material.a make[2]: Leaving directory '/tmp/B.u4f9ex94/BUILD/abseil-cpp-20200923.3/build-static' make[1]: Entering directory '/tmp/B.u4f9ex94/BUILD/abseil-cpp-20200923.3/build-static' [ 62%] Built target random_distributions make[1]: Leaving directory '/tmp/B.u4f9ex94/BUILD/abseil-cpp-20200923.3/build-static' /usr/bin/make -f absl/flags/CMakeFiles/flags_private_handle_accessor.dir/build.make absl/flags/CMakeFiles/flags_private_handle_accessor.dir/depend make[1]: Entering directory '/tmp/B.u4f9ex94/BUILD/abseil-cpp-20200923.3/build-static' [ 62%] Built target random_internal_seed_material make[1]: Leaving directory '/tmp/B.u4f9ex94/BUILD/abseil-cpp-20200923.3/build-static' make[2]: Entering directory '/tmp/B.u4f9ex94/BUILD/abseil-cpp-20200923.3/build-static' cd /tmp/B.u4f9ex94/BUILD/abseil-cpp-20200923.3/build-static && /usr/bin/cmake -E cmake_depends "Unix Makefiles" /tmp/B.u4f9ex94/BUILD/abseil-cpp-20200923.3 /tmp/B.u4f9ex94/BUILD/abseil-cpp-20200923.3/absl/flags /tmp/B.u4f9ex94/BUILD/abseil-cpp-20200923.3/build-static /tmp/B.u4f9ex94/BUILD/abseil-cpp-20200923.3/build-static/absl/flags /tmp/B.u4f9ex94/BUILD/abseil-cpp-20200923.3/build-static/absl/flags/CMakeFiles/flags_private_handle_accessor.dir/DependInfo.cmake --color= Scanning dependencies of target flags_private_handle_accessor make[2]: Leaving directory '/tmp/B.u4f9ex94/BUILD/abseil-cpp-20200923.3/build-static' /usr/bin/make -f absl/flags/CMakeFiles/flags_private_handle_accessor.dir/build.make absl/flags/CMakeFiles/flags_private_handle_accessor.dir/build make[2]: Entering directory '/tmp/B.u4f9ex94/BUILD/abseil-cpp-20200923.3/build-static' [ 56%] Building CXX object absl/hash/CMakeFiles/hash.dir/internal/hash.cc.o cd /tmp/B.u4f9ex94/BUILD/abseil-cpp-20200923.3/build-static/absl/hash && /usr/bin/i686-pld-linux-g++ -I/tmp/B.u4f9ex94/BUILD/abseil-cpp-20200923.3 -O2 -fwrapv -pipe -Wformat -Werror=format-security -gdwarf-4 -fno-debug-types-section -fvar-tracking-assignments -g2 -Wp,-D_FORTIFY_SOURCE=2 -fstack-protector-strong --param=ssp-buffer-size=4 -Werror=trampolines -fomit-frame-pointer -march=i686 -fasynchronous-unwind-tables -mtune=pentium4 -gdwarf-4 -fno-debug-types-section -fvar-tracking-assignments -g2 -DNDEBUG -DQT_NO_DEBUG -Wall -Wextra -Wcast-qual -Wconversion-null -Wmissing-declarations -Woverlength-strings -Wpointer-arith -Wundef -Wunused-local-typedefs -Wunused-result -Wvarargs -Wvla -Wwrite-strings -Wno-missing-field-initializers -Wno-sign-compare -DNOMINMAX -o CMakeFiles/hash.dir/internal/hash.cc.o -c /tmp/B.u4f9ex94/BUILD/abseil-cpp-20200923.3/absl/hash/internal/hash.cc make[2]: Leaving directory '/tmp/B.u4f9ex94/BUILD/abseil-cpp-20200923.3/build-static' make[2]: Entering directory '/tmp/B.u4f9ex94/BUILD/abseil-cpp-20200923.3/build-static' [ 62%] Linking CXX static library libabsl_hash.a cd /tmp/B.u4f9ex94/BUILD/abseil-cpp-20200923.3/build-static/absl/hash && /usr/bin/cmake -P CMakeFiles/hash.dir/cmake_clean_target.cmake cd /tmp/B.u4f9ex94/BUILD/abseil-cpp-20200923.3/build-static/absl/hash && /usr/bin/cmake -E cmake_link_script CMakeFiles/hash.dir/link.txt --verbose=1 /usr/bin/ar qc libabsl_hash.a CMakeFiles/hash.dir/internal/hash.cc.o /usr/bin/ranlib libabsl_hash.a make[2]: Leaving directory '/tmp/B.u4f9ex94/BUILD/abseil-cpp-20200923.3/build-static' make[2]: Entering directory '/tmp/B.u4f9ex94/BUILD/abseil-cpp-20200923.3/build-static' [ 55%] Building CXX object absl/debugging/CMakeFiles/symbolize.dir/symbolize.cc.o cd /tmp/B.u4f9ex94/BUILD/abseil-cpp-20200923.3/build-static/absl/debugging && /usr/bin/i686-pld-linux-g++ -I/tmp/B.u4f9ex94/BUILD/abseil-cpp-20200923.3 -O2 -fwrapv -pipe -Wformat -Werror=format-security -gdwarf-4 -fno-debug-types-section -fvar-tracking-assignments -g2 -Wp,-D_FORTIFY_SOURCE=2 -fstack-protector-strong --param=ssp-buffer-size=4 -Werror=trampolines -fomit-frame-pointer -march=i686 -fasynchronous-unwind-tables -mtune=pentium4 -gdwarf-4 -fno-debug-types-section -fvar-tracking-assignments -g2 -DNDEBUG -DQT_NO_DEBUG -Wall -Wextra -Wcast-qual -Wconversion-null -Wmissing-declarations -Woverlength-strings -Wpointer-arith -Wundef -Wunused-local-typedefs -Wunused-result -Wvarargs -Wvla -Wwrite-strings -Wno-missing-field-initializers -Wno-sign-compare -DNOMINMAX -o CMakeFiles/symbolize.dir/symbolize.cc.o -c /tmp/B.u4f9ex94/BUILD/abseil-cpp-20200923.3/absl/debugging/symbolize.cc make[2]: Leaving directory '/tmp/B.u4f9ex94/BUILD/abseil-cpp-20200923.3/build-static' make[1]: Entering directory '/tmp/B.u4f9ex94/BUILD/abseil-cpp-20200923.3/build-static' [ 62%] Built target hash make[1]: Leaving directory '/tmp/B.u4f9ex94/BUILD/abseil-cpp-20200923.3/build-static' make[2]: Entering directory '/tmp/B.u4f9ex94/BUILD/abseil-cpp-20200923.3/build-static' [ 63%] Linking CXX static library libabsl_symbolize.a cd /tmp/B.u4f9ex94/BUILD/abseil-cpp-20200923.3/build-static/absl/debugging && /usr/bin/cmake -P CMakeFiles/symbolize.dir/cmake_clean_target.cmake cd /tmp/B.u4f9ex94/BUILD/abseil-cpp-20200923.3/build-static/absl/debugging && /usr/bin/cmake -E cmake_link_script CMakeFiles/symbolize.dir/link.txt --verbose=1 /usr/bin/ar qc libabsl_symbolize.a CMakeFiles/symbolize.dir/symbolize.cc.o /usr/bin/ranlib libabsl_symbolize.a make[2]: Leaving directory '/tmp/B.u4f9ex94/BUILD/abseil-cpp-20200923.3/build-static' make[1]: Entering directory '/tmp/B.u4f9ex94/BUILD/abseil-cpp-20200923.3/build-static' [ 64%] Built target symbolize make[1]: Leaving directory '/tmp/B.u4f9ex94/BUILD/abseil-cpp-20200923.3/build-static' /usr/bin/make -f absl/random/CMakeFiles/random_internal_pool_urbg.dir/build.make absl/random/CMakeFiles/random_internal_pool_urbg.dir/depend make[2]: Entering directory '/tmp/B.u4f9ex94/BUILD/abseil-cpp-20200923.3/build-static' cd /tmp/B.u4f9ex94/BUILD/abseil-cpp-20200923.3/build-static && /usr/bin/cmake -E cmake_depends "Unix Makefiles" /tmp/B.u4f9ex94/BUILD/abseil-cpp-20200923.3 /tmp/B.u4f9ex94/BUILD/abseil-cpp-20200923.3/absl/random /tmp/B.u4f9ex94/BUILD/abseil-cpp-20200923.3/build-static /tmp/B.u4f9ex94/BUILD/abseil-cpp-20200923.3/build-static/absl/random /tmp/B.u4f9ex94/BUILD/abseil-cpp-20200923.3/build-static/absl/random/CMakeFiles/random_internal_pool_urbg.dir/DependInfo.cmake --color= Scanning dependencies of target random_internal_pool_urbg make[2]: Leaving directory '/tmp/B.u4f9ex94/BUILD/abseil-cpp-20200923.3/build-static' /usr/bin/make -f absl/random/CMakeFiles/random_internal_pool_urbg.dir/build.make absl/random/CMakeFiles/random_internal_pool_urbg.dir/build make[2]: Entering directory '/tmp/B.u4f9ex94/BUILD/abseil-cpp-20200923.3/build-static' [ 58%] Building CXX object absl/time/CMakeFiles/time.dir/civil_time.cc.o cd /tmp/B.u4f9ex94/BUILD/abseil-cpp-20200923.3/build-static/absl/time && /usr/bin/i686-pld-linux-g++ -I/tmp/B.u4f9ex94/BUILD/abseil-cpp-20200923.3 -O2 -fwrapv -pipe -Wformat -Werror=format-security -gdwarf-4 -fno-debug-types-section -fvar-tracking-assignments -g2 -Wp,-D_FORTIFY_SOURCE=2 -fstack-protector-strong --param=ssp-buffer-size=4 -Werror=trampolines -fomit-frame-pointer -march=i686 -fasynchronous-unwind-tables -mtune=pentium4 -gdwarf-4 -fno-debug-types-section -fvar-tracking-assignments -g2 -DNDEBUG -DQT_NO_DEBUG -Wall -Wextra -Wcast-qual -Wconversion-null -Wmissing-declarations -Woverlength-strings -Wpointer-arith -Wundef -Wunused-local-typedefs -Wunused-result -Wvarargs -Wvla -Wwrite-strings -Wno-missing-field-initializers -Wno-sign-compare -DNOMINMAX -o CMakeFiles/time.dir/civil_time.cc.o -c /tmp/B.u4f9ex94/BUILD/abseil-cpp-20200923.3/absl/time/civil_time.cc make[2]: Leaving directory '/tmp/B.u4f9ex94/BUILD/abseil-cpp-20200923.3/build-static' make[2]: Entering directory '/tmp/B.u4f9ex94/BUILD/abseil-cpp-20200923.3/build-static' [ 62%] Building CXX object absl/strings/CMakeFiles/str_format_internal.dir/internal/str_format/extension.cc.o cd /tmp/B.u4f9ex94/BUILD/abseil-cpp-20200923.3/build-static/absl/strings && /usr/bin/i686-pld-linux-g++ -I/tmp/B.u4f9ex94/BUILD/abseil-cpp-20200923.3 -O2 -fwrapv -pipe -Wformat -Werror=format-security -gdwarf-4 -fno-debug-types-section -fvar-tracking-assignments -g2 -Wp,-D_FORTIFY_SOURCE=2 -fstack-protector-strong --param=ssp-buffer-size=4 -Werror=trampolines -fomit-frame-pointer -march=i686 -fasynchronous-unwind-tables -mtune=pentium4 -gdwarf-4 -fno-debug-types-section -fvar-tracking-assignments -g2 -DNDEBUG -DQT_NO_DEBUG -Wall -Wextra -Wcast-qual -Wconversion-null -Wmissing-declarations -Woverlength-strings -Wpointer-arith -Wundef -Wunused-local-typedefs -Wunused-result -Wvarargs -Wvla -Wwrite-strings -Wno-missing-field-initializers -Wno-sign-compare -DNOMINMAX -o CMakeFiles/str_format_internal.dir/internal/str_format/extension.cc.o -c /tmp/B.u4f9ex94/BUILD/abseil-cpp-20200923.3/absl/strings/internal/str_format/extension.cc make[2]: Leaving directory '/tmp/B.u4f9ex94/BUILD/abseil-cpp-20200923.3/build-static' make[2]: Entering directory '/tmp/B.u4f9ex94/BUILD/abseil-cpp-20200923.3/build-static' [ 61%] Building CXX object absl/time/CMakeFiles/time.dir/clock.cc.o cd /tmp/B.u4f9ex94/BUILD/abseil-cpp-20200923.3/build-static/absl/time && /usr/bin/i686-pld-linux-g++ -I/tmp/B.u4f9ex94/BUILD/abseil-cpp-20200923.3 -O2 -fwrapv -pipe -Wformat -Werror=format-security -gdwarf-4 -fno-debug-types-section -fvar-tracking-assignments -g2 -Wp,-D_FORTIFY_SOURCE=2 -fstack-protector-strong --param=ssp-buffer-size=4 -Werror=trampolines -fomit-frame-pointer -march=i686 -fasynchronous-unwind-tables -mtune=pentium4 -gdwarf-4 -fno-debug-types-section -fvar-tracking-assignments -g2 -DNDEBUG -DQT_NO_DEBUG -Wall -Wextra -Wcast-qual -Wconversion-null -Wmissing-declarations -Woverlength-strings -Wpointer-arith -Wundef -Wunused-local-typedefs -Wunused-result -Wvarargs -Wvla -Wwrite-strings -Wno-missing-field-initializers -Wno-sign-compare -DNOMINMAX -o CMakeFiles/time.dir/clock.cc.o -c /tmp/B.u4f9ex94/BUILD/abseil-cpp-20200923.3/absl/time/clock.cc make[2]: Leaving directory '/tmp/B.u4f9ex94/BUILD/abseil-cpp-20200923.3/build-static' make[2]: Entering directory '/tmp/B.u4f9ex94/BUILD/abseil-cpp-20200923.3/build-static' [ 59%] Building CXX object absl/strings/CMakeFiles/str_format_internal.dir/internal/str_format/arg.cc.o cd /tmp/B.u4f9ex94/BUILD/abseil-cpp-20200923.3/build-static/absl/strings && /usr/bin/i686-pld-linux-g++ -I/tmp/B.u4f9ex94/BUILD/abseil-cpp-20200923.3 -O2 -fwrapv -pipe -Wformat -Werror=format-security -gdwarf-4 -fno-debug-types-section -fvar-tracking-assignments -g2 -Wp,-D_FORTIFY_SOURCE=2 -fstack-protector-strong --param=ssp-buffer-size=4 -Werror=trampolines -fomit-frame-pointer -march=i686 -fasynchronous-unwind-tables -mtune=pentium4 -gdwarf-4 -fno-debug-types-section -fvar-tracking-assignments -g2 -DNDEBUG -DQT_NO_DEBUG -Wall -Wextra -Wcast-qual -Wconversion-null -Wmissing-declarations -Woverlength-strings -Wpointer-arith -Wundef -Wunused-local-typedefs -Wunused-result -Wvarargs -Wvla -Wwrite-strings -Wno-missing-field-initializers -Wno-sign-compare -DNOMINMAX -o CMakeFiles/str_format_internal.dir/internal/str_format/arg.cc.o -c /tmp/B.u4f9ex94/BUILD/abseil-cpp-20200923.3/absl/strings/internal/str_format/arg.cc make[2]: Leaving directory '/tmp/B.u4f9ex94/BUILD/abseil-cpp-20200923.3/build-static' make[2]: Entering directory '/tmp/B.u4f9ex94/BUILD/abseil-cpp-20200923.3/build-static' [ 62%] Building CXX object absl/flags/CMakeFiles/flags_private_handle_accessor.dir/internal/private_handle_accessor.cc.o cd /tmp/B.u4f9ex94/BUILD/abseil-cpp-20200923.3/build-static/absl/flags && /usr/bin/i686-pld-linux-g++ -I/tmp/B.u4f9ex94/BUILD/abseil-cpp-20200923.3 -O2 -fwrapv -pipe -Wformat -Werror=format-security -gdwarf-4 -fno-debug-types-section -fvar-tracking-assignments -g2 -Wp,-D_FORTIFY_SOURCE=2 -fstack-protector-strong --param=ssp-buffer-size=4 -Werror=trampolines -fomit-frame-pointer -march=i686 -fasynchronous-unwind-tables -mtune=pentium4 -gdwarf-4 -fno-debug-types-section -fvar-tracking-assignments -g2 -DNDEBUG -DQT_NO_DEBUG -Wall -Wextra -Wcast-qual -Wconversion-null -Wmissing-declarations -Woverlength-strings -Wpointer-arith -Wundef -Wunused-local-typedefs -Wunused-result -Wvarargs -Wvla -Wwrite-strings -Wno-missing-field-initializers -Wno-sign-compare -DNOMINMAX -o CMakeFiles/flags_private_handle_accessor.dir/internal/private_handle_accessor.cc.o -c /tmp/B.u4f9ex94/BUILD/abseil-cpp-20200923.3/absl/flags/internal/private_handle_accessor.cc make[2]: Leaving directory '/tmp/B.u4f9ex94/BUILD/abseil-cpp-20200923.3/build-static' make[2]: Entering directory '/tmp/B.u4f9ex94/BUILD/abseil-cpp-20200923.3/build-static' [ 68%] Linking CXX static library libabsl_flags_private_handle_accessor.a cd /tmp/B.u4f9ex94/BUILD/abseil-cpp-20200923.3/build-static/absl/flags && /usr/bin/cmake -P CMakeFiles/flags_private_handle_accessor.dir/cmake_clean_target.cmake cd /tmp/B.u4f9ex94/BUILD/abseil-cpp-20200923.3/build-static/absl/flags && /usr/bin/cmake -E cmake_link_script CMakeFiles/flags_private_handle_accessor.dir/link.txt --verbose=1 /usr/bin/ar qc libabsl_flags_private_handle_accessor.a CMakeFiles/flags_private_handle_accessor.dir/internal/private_handle_accessor.cc.o /usr/bin/ranlib libabsl_flags_private_handle_accessor.a make[2]: Leaving directory '/tmp/B.u4f9ex94/BUILD/abseil-cpp-20200923.3/build-static' make[1]: Entering directory '/tmp/B.u4f9ex94/BUILD/abseil-cpp-20200923.3/build-static' [ 68%] Built target flags_private_handle_accessor make[1]: Leaving directory '/tmp/B.u4f9ex94/BUILD/abseil-cpp-20200923.3/build-static' make[2]: Entering directory '/tmp/B.u4f9ex94/BUILD/abseil-cpp-20200923.3/build-static' [ 61%] Building CXX object absl/strings/CMakeFiles/str_format_internal.dir/internal/str_format/bind.cc.o cd /tmp/B.u4f9ex94/BUILD/abseil-cpp-20200923.3/build-static/absl/strings && /usr/bin/i686-pld-linux-g++ -I/tmp/B.u4f9ex94/BUILD/abseil-cpp-20200923.3 -O2 -fwrapv -pipe -Wformat -Werror=format-security -gdwarf-4 -fno-debug-types-section -fvar-tracking-assignments -g2 -Wp,-D_FORTIFY_SOURCE=2 -fstack-protector-strong --param=ssp-buffer-size=4 -Werror=trampolines -fomit-frame-pointer -march=i686 -fasynchronous-unwind-tables -mtune=pentium4 -gdwarf-4 -fno-debug-types-section -fvar-tracking-assignments -g2 -DNDEBUG -DQT_NO_DEBUG -Wall -Wextra -Wcast-qual -Wconversion-null -Wmissing-declarations -Woverlength-strings -Wpointer-arith -Wundef -Wunused-local-typedefs -Wunused-result -Wvarargs -Wvla -Wwrite-strings -Wno-missing-field-initializers -Wno-sign-compare -DNOMINMAX -o CMakeFiles/str_format_internal.dir/internal/str_format/bind.cc.o -c /tmp/B.u4f9ex94/BUILD/abseil-cpp-20200923.3/absl/strings/internal/str_format/bind.cc make[2]: Leaving directory '/tmp/B.u4f9ex94/BUILD/abseil-cpp-20200923.3/build-static' /usr/bin/make -f absl/debugging/CMakeFiles/examine_stack.dir/build.make absl/debugging/CMakeFiles/examine_stack.dir/depend make[2]: Entering directory '/tmp/B.u4f9ex94/BUILD/abseil-cpp-20200923.3/build-static' cd /tmp/B.u4f9ex94/BUILD/abseil-cpp-20200923.3/build-static && /usr/bin/cmake -E cmake_depends "Unix Makefiles" /tmp/B.u4f9ex94/BUILD/abseil-cpp-20200923.3 /tmp/B.u4f9ex94/BUILD/abseil-cpp-20200923.3/absl/debugging /tmp/B.u4f9ex94/BUILD/abseil-cpp-20200923.3/build-static /tmp/B.u4f9ex94/BUILD/abseil-cpp-20200923.3/build-static/absl/debugging /tmp/B.u4f9ex94/BUILD/abseil-cpp-20200923.3/build-static/absl/debugging/CMakeFiles/examine_stack.dir/DependInfo.cmake --color= Scanning dependencies of target examine_stack make[2]: Leaving directory '/tmp/B.u4f9ex94/BUILD/abseil-cpp-20200923.3/build-static' /usr/bin/make -f absl/debugging/CMakeFiles/examine_stack.dir/build.make absl/debugging/CMakeFiles/examine_stack.dir/build make[2]: Entering directory '/tmp/B.u4f9ex94/BUILD/abseil-cpp-20200923.3/build-static' [ 66%] Building CXX object absl/strings/CMakeFiles/str_format_internal.dir/internal/str_format/output.cc.o cd /tmp/B.u4f9ex94/BUILD/abseil-cpp-20200923.3/build-static/absl/strings && /usr/bin/i686-pld-linux-g++ -I/tmp/B.u4f9ex94/BUILD/abseil-cpp-20200923.3 -O2 -fwrapv -pipe -Wformat -Werror=format-security -gdwarf-4 -fno-debug-types-section -fvar-tracking-assignments -g2 -Wp,-D_FORTIFY_SOURCE=2 -fstack-protector-strong --param=ssp-buffer-size=4 -Werror=trampolines -fomit-frame-pointer -march=i686 -fasynchronous-unwind-tables -mtune=pentium4 -gdwarf-4 -fno-debug-types-section -fvar-tracking-assignments -g2 -DNDEBUG -DQT_NO_DEBUG -Wall -Wextra -Wcast-qual -Wconversion-null -Wmissing-declarations -Woverlength-strings -Wpointer-arith -Wundef -Wunused-local-typedefs -Wunused-result -Wvarargs -Wvla -Wwrite-strings -Wno-missing-field-initializers -Wno-sign-compare -DNOMINMAX -o CMakeFiles/str_format_internal.dir/internal/str_format/output.cc.o -c /tmp/B.u4f9ex94/BUILD/abseil-cpp-20200923.3/absl/strings/internal/str_format/output.cc make[2]: Leaving directory '/tmp/B.u4f9ex94/BUILD/abseil-cpp-20200923.3/build-static' make[2]: Entering directory '/tmp/B.u4f9ex94/BUILD/abseil-cpp-20200923.3/build-static' [ 65%] Building CXX object absl/random/CMakeFiles/random_internal_pool_urbg.dir/internal/pool_urbg.cc.o cd /tmp/B.u4f9ex94/BUILD/abseil-cpp-20200923.3/build-static/absl/random && /usr/bin/i686-pld-linux-g++ -I/tmp/B.u4f9ex94/BUILD/abseil-cpp-20200923.3 -O2 -fwrapv -pipe -Wformat -Werror=format-security -gdwarf-4 -fno-debug-types-section -fvar-tracking-assignments -g2 -Wp,-D_FORTIFY_SOURCE=2 -fstack-protector-strong --param=ssp-buffer-size=4 -Werror=trampolines -fomit-frame-pointer -march=i686 -fasynchronous-unwind-tables -mtune=pentium4 -gdwarf-4 -fno-debug-types-section -fvar-tracking-assignments -g2 -DNDEBUG -DQT_NO_DEBUG -Wall -Wextra -Wcast-qual -Wconversion-null -Wmissing-declarations -Woverlength-strings -Wpointer-arith -Wundef -Wunused-local-typedefs -Wunused-result -Wvarargs -Wvla -Wwrite-strings -Wno-missing-field-initializers -Wno-sign-compare -DNOMINMAX -o CMakeFiles/random_internal_pool_urbg.dir/internal/pool_urbg.cc.o -c /tmp/B.u4f9ex94/BUILD/abseil-cpp-20200923.3/absl/random/internal/pool_urbg.cc make[2]: Leaving directory '/tmp/B.u4f9ex94/BUILD/abseil-cpp-20200923.3/build-static' make[2]: Entering directory '/tmp/B.u4f9ex94/BUILD/abseil-cpp-20200923.3/build-static' [ 69%] Linking CXX static library libabsl_random_internal_pool_urbg.a cd /tmp/B.u4f9ex94/BUILD/abseil-cpp-20200923.3/build-static/absl/random && /usr/bin/cmake -P CMakeFiles/random_internal_pool_urbg.dir/cmake_clean_target.cmake cd /tmp/B.u4f9ex94/BUILD/abseil-cpp-20200923.3/build-static/absl/random && /usr/bin/cmake -E cmake_link_script CMakeFiles/random_internal_pool_urbg.dir/link.txt --verbose=1 /usr/bin/ar qc libabsl_random_internal_pool_urbg.a CMakeFiles/random_internal_pool_urbg.dir/internal/pool_urbg.cc.o /usr/bin/ranlib libabsl_random_internal_pool_urbg.a make[2]: Leaving directory '/tmp/B.u4f9ex94/BUILD/abseil-cpp-20200923.3/build-static' make[1]: Entering directory '/tmp/B.u4f9ex94/BUILD/abseil-cpp-20200923.3/build-static' [ 69%] Built target random_internal_pool_urbg make[1]: Leaving directory '/tmp/B.u4f9ex94/BUILD/abseil-cpp-20200923.3/build-static' /usr/bin/make -f absl/random/CMakeFiles/random_seed_sequences.dir/build.make absl/random/CMakeFiles/random_seed_sequences.dir/depend make[2]: Entering directory '/tmp/B.u4f9ex94/BUILD/abseil-cpp-20200923.3/build-static' cd /tmp/B.u4f9ex94/BUILD/abseil-cpp-20200923.3/build-static && /usr/bin/cmake -E cmake_depends "Unix Makefiles" /tmp/B.u4f9ex94/BUILD/abseil-cpp-20200923.3 /tmp/B.u4f9ex94/BUILD/abseil-cpp-20200923.3/absl/random /tmp/B.u4f9ex94/BUILD/abseil-cpp-20200923.3/build-static /tmp/B.u4f9ex94/BUILD/abseil-cpp-20200923.3/build-static/absl/random /tmp/B.u4f9ex94/BUILD/abseil-cpp-20200923.3/build-static/absl/random/CMakeFiles/random_seed_sequences.dir/DependInfo.cmake --color= Scanning dependencies of target random_seed_sequences make[2]: Leaving directory '/tmp/B.u4f9ex94/BUILD/abseil-cpp-20200923.3/build-static' /usr/bin/make -f absl/random/CMakeFiles/random_seed_sequences.dir/build.make absl/random/CMakeFiles/random_seed_sequences.dir/build make[2]: Entering directory '/tmp/B.u4f9ex94/BUILD/abseil-cpp-20200923.3/build-static' [ 67%] Building CXX object absl/time/CMakeFiles/time.dir/format.cc.o cd /tmp/B.u4f9ex94/BUILD/abseil-cpp-20200923.3/build-static/absl/time && /usr/bin/i686-pld-linux-g++ -I/tmp/B.u4f9ex94/BUILD/abseil-cpp-20200923.3 -O2 -fwrapv -pipe -Wformat -Werror=format-security -gdwarf-4 -fno-debug-types-section -fvar-tracking-assignments -g2 -Wp,-D_FORTIFY_SOURCE=2 -fstack-protector-strong --param=ssp-buffer-size=4 -Werror=trampolines -fomit-frame-pointer -march=i686 -fasynchronous-unwind-tables -mtune=pentium4 -gdwarf-4 -fno-debug-types-section -fvar-tracking-assignments -g2 -DNDEBUG -DQT_NO_DEBUG -Wall -Wextra -Wcast-qual -Wconversion-null -Wmissing-declarations -Woverlength-strings -Wpointer-arith -Wundef -Wunused-local-typedefs -Wunused-result -Wvarargs -Wvla -Wwrite-strings -Wno-missing-field-initializers -Wno-sign-compare -DNOMINMAX -o CMakeFiles/time.dir/format.cc.o -c /tmp/B.u4f9ex94/BUILD/abseil-cpp-20200923.3/absl/time/format.cc make[2]: Leaving directory '/tmp/B.u4f9ex94/BUILD/abseil-cpp-20200923.3/build-static' make[2]: Entering directory '/tmp/B.u4f9ex94/BUILD/abseil-cpp-20200923.3/build-static' [ 59%] Building CXX object absl/strings/CMakeFiles/cord.dir/cord.cc.o cd /tmp/B.u4f9ex94/BUILD/abseil-cpp-20200923.3/build-static/absl/strings && /usr/bin/i686-pld-linux-g++ -I/tmp/B.u4f9ex94/BUILD/abseil-cpp-20200923.3 -O2 -fwrapv -pipe -Wformat -Werror=format-security -gdwarf-4 -fno-debug-types-section -fvar-tracking-assignments -g2 -Wp,-D_FORTIFY_SOURCE=2 -fstack-protector-strong --param=ssp-buffer-size=4 -Werror=trampolines -fomit-frame-pointer -march=i686 -fasynchronous-unwind-tables -mtune=pentium4 -gdwarf-4 -fno-debug-types-section -fvar-tracking-assignments -g2 -DNDEBUG -DQT_NO_DEBUG -Wall -Wextra -Wcast-qual -Wconversion-null -Wmissing-declarations -Woverlength-strings -Wpointer-arith -Wundef -Wunused-local-typedefs -Wunused-result -Wvarargs -Wvla -Wwrite-strings -Wno-missing-field-initializers -Wno-sign-compare -DNOMINMAX -o CMakeFiles/cord.dir/cord.cc.o -c /tmp/B.u4f9ex94/BUILD/abseil-cpp-20200923.3/absl/strings/cord.cc make[2]: Leaving directory '/tmp/B.u4f9ex94/BUILD/abseil-cpp-20200923.3/build-static' make[2]: Entering directory '/tmp/B.u4f9ex94/BUILD/abseil-cpp-20200923.3/build-static' [ 70%] Linking CXX static library libabsl_cord.a cd /tmp/B.u4f9ex94/BUILD/abseil-cpp-20200923.3/build-static/absl/strings && /usr/bin/cmake -P CMakeFiles/cord.dir/cmake_clean_target.cmake cd /tmp/B.u4f9ex94/BUILD/abseil-cpp-20200923.3/build-static/absl/strings && /usr/bin/cmake -E cmake_link_script CMakeFiles/cord.dir/link.txt --verbose=1 /usr/bin/ar qc libabsl_cord.a CMakeFiles/cord.dir/cord.cc.o /usr/bin/ranlib libabsl_cord.a make[2]: Leaving directory '/tmp/B.u4f9ex94/BUILD/abseil-cpp-20200923.3/build-static' make[1]: Entering directory '/tmp/B.u4f9ex94/BUILD/abseil-cpp-20200923.3/build-static' [ 70%] Built target cord make[1]: Leaving directory '/tmp/B.u4f9ex94/BUILD/abseil-cpp-20200923.3/build-static' make[2]: Entering directory '/tmp/B.u4f9ex94/BUILD/abseil-cpp-20200923.3/build-static' [ 69%] Building CXX object absl/debugging/CMakeFiles/examine_stack.dir/internal/examine_stack.cc.o cd /tmp/B.u4f9ex94/BUILD/abseil-cpp-20200923.3/build-static/absl/debugging && /usr/bin/i686-pld-linux-g++ -I/tmp/B.u4f9ex94/BUILD/abseil-cpp-20200923.3 -O2 -fwrapv -pipe -Wformat -Werror=format-security -gdwarf-4 -fno-debug-types-section -fvar-tracking-assignments -g2 -Wp,-D_FORTIFY_SOURCE=2 -fstack-protector-strong --param=ssp-buffer-size=4 -Werror=trampolines -fomit-frame-pointer -march=i686 -fasynchronous-unwind-tables -mtune=pentium4 -gdwarf-4 -fno-debug-types-section -fvar-tracking-assignments -g2 -DNDEBUG -DQT_NO_DEBUG -Wall -Wextra -Wcast-qual -Wconversion-null -Wmissing-declarations -Woverlength-strings -Wpointer-arith -Wundef -Wunused-local-typedefs -Wunused-result -Wvarargs -Wvla -Wwrite-strings -Wno-missing-field-initializers -Wno-sign-compare -DNOMINMAX -o CMakeFiles/examine_stack.dir/internal/examine_stack.cc.o -c /tmp/B.u4f9ex94/BUILD/abseil-cpp-20200923.3/absl/debugging/internal/examine_stack.cc make[2]: Leaving directory '/tmp/B.u4f9ex94/BUILD/abseil-cpp-20200923.3/build-static' make[2]: Entering directory '/tmp/B.u4f9ex94/BUILD/abseil-cpp-20200923.3/build-static' [ 71%] Linking CXX static library libabsl_examine_stack.a cd /tmp/B.u4f9ex94/BUILD/abseil-cpp-20200923.3/build-static/absl/debugging && /usr/bin/cmake -P CMakeFiles/examine_stack.dir/cmake_clean_target.cmake cd /tmp/B.u4f9ex94/BUILD/abseil-cpp-20200923.3/build-static/absl/debugging && /usr/bin/cmake -E cmake_link_script CMakeFiles/examine_stack.dir/link.txt --verbose=1 /usr/bin/ar qc libabsl_examine_stack.a CMakeFiles/examine_stack.dir/internal/examine_stack.cc.o /usr/bin/ranlib libabsl_examine_stack.a make[2]: Leaving directory '/tmp/B.u4f9ex94/BUILD/abseil-cpp-20200923.3/build-static' make[1]: Entering directory '/tmp/B.u4f9ex94/BUILD/abseil-cpp-20200923.3/build-static' [ 71%] Built target examine_stack make[1]: Leaving directory '/tmp/B.u4f9ex94/BUILD/abseil-cpp-20200923.3/build-static' /usr/bin/make -f absl/debugging/CMakeFiles/failure_signal_handler.dir/build.make absl/debugging/CMakeFiles/failure_signal_handler.dir/depend make[2]: Entering directory '/tmp/B.u4f9ex94/BUILD/abseil-cpp-20200923.3/build-static' cd /tmp/B.u4f9ex94/BUILD/abseil-cpp-20200923.3/build-static && /usr/bin/cmake -E cmake_depends "Unix Makefiles" /tmp/B.u4f9ex94/BUILD/abseil-cpp-20200923.3 /tmp/B.u4f9ex94/BUILD/abseil-cpp-20200923.3/absl/debugging /tmp/B.u4f9ex94/BUILD/abseil-cpp-20200923.3/build-static /tmp/B.u4f9ex94/BUILD/abseil-cpp-20200923.3/build-static/absl/debugging /tmp/B.u4f9ex94/BUILD/abseil-cpp-20200923.3/build-static/absl/debugging/CMakeFiles/failure_signal_handler.dir/DependInfo.cmake --color= Scanning dependencies of target failure_signal_handler make[2]: Leaving directory '/tmp/B.u4f9ex94/BUILD/abseil-cpp-20200923.3/build-static' /usr/bin/make -f absl/debugging/CMakeFiles/failure_signal_handler.dir/build.make absl/debugging/CMakeFiles/failure_signal_handler.dir/build make[2]: Entering directory '/tmp/B.u4f9ex94/BUILD/abseil-cpp-20200923.3/build-static' [ 66%] Building CXX object absl/strings/CMakeFiles/str_format_internal.dir/internal/str_format/parser.cc.o cd /tmp/B.u4f9ex94/BUILD/abseil-cpp-20200923.3/build-static/absl/strings && /usr/bin/i686-pld-linux-g++ -I/tmp/B.u4f9ex94/BUILD/abseil-cpp-20200923.3 -O2 -fwrapv -pipe -Wformat -Werror=format-security -gdwarf-4 -fno-debug-types-section -fvar-tracking-assignments -g2 -Wp,-D_FORTIFY_SOURCE=2 -fstack-protector-strong --param=ssp-buffer-size=4 -Werror=trampolines -fomit-frame-pointer -march=i686 -fasynchronous-unwind-tables -mtune=pentium4 -gdwarf-4 -fno-debug-types-section -fvar-tracking-assignments -g2 -DNDEBUG -DQT_NO_DEBUG -Wall -Wextra -Wcast-qual -Wconversion-null -Wmissing-declarations -Woverlength-strings -Wpointer-arith -Wundef -Wunused-local-typedefs -Wunused-result -Wvarargs -Wvla -Wwrite-strings -Wno-missing-field-initializers -Wno-sign-compare -DNOMINMAX -o CMakeFiles/str_format_internal.dir/internal/str_format/parser.cc.o -c /tmp/B.u4f9ex94/BUILD/abseil-cpp-20200923.3/absl/strings/internal/str_format/parser.cc make[2]: Leaving directory '/tmp/B.u4f9ex94/BUILD/abseil-cpp-20200923.3/build-static' make[2]: Entering directory '/tmp/B.u4f9ex94/BUILD/abseil-cpp-20200923.3/build-static' [ 69%] Building CXX object absl/time/CMakeFiles/time.dir/time.cc.o cd /tmp/B.u4f9ex94/BUILD/abseil-cpp-20200923.3/build-static/absl/time && /usr/bin/i686-pld-linux-g++ -I/tmp/B.u4f9ex94/BUILD/abseil-cpp-20200923.3 -O2 -fwrapv -pipe -Wformat -Werror=format-security -gdwarf-4 -fno-debug-types-section -fvar-tracking-assignments -g2 -Wp,-D_FORTIFY_SOURCE=2 -fstack-protector-strong --param=ssp-buffer-size=4 -Werror=trampolines -fomit-frame-pointer -march=i686 -fasynchronous-unwind-tables -mtune=pentium4 -gdwarf-4 -fno-debug-types-section -fvar-tracking-assignments -g2 -DNDEBUG -DQT_NO_DEBUG -Wall -Wextra -Wcast-qual -Wconversion-null -Wmissing-declarations -Woverlength-strings -Wpointer-arith -Wundef -Wunused-local-typedefs -Wunused-result -Wvarargs -Wvla -Wwrite-strings -Wno-missing-field-initializers -Wno-sign-compare -DNOMINMAX -o CMakeFiles/time.dir/time.cc.o -c /tmp/B.u4f9ex94/BUILD/abseil-cpp-20200923.3/absl/time/time.cc make[2]: Leaving directory '/tmp/B.u4f9ex94/BUILD/abseil-cpp-20200923.3/build-static' make[2]: Entering directory '/tmp/B.u4f9ex94/BUILD/abseil-cpp-20200923.3/build-static' [ 64%] Building CXX object absl/strings/CMakeFiles/str_format_internal.dir/internal/str_format/float_conversion.cc.o cd /tmp/B.u4f9ex94/BUILD/abseil-cpp-20200923.3/build-static/absl/strings && /usr/bin/i686-pld-linux-g++ -I/tmp/B.u4f9ex94/BUILD/abseil-cpp-20200923.3 -O2 -fwrapv -pipe -Wformat -Werror=format-security -gdwarf-4 -fno-debug-types-section -fvar-tracking-assignments -g2 -Wp,-D_FORTIFY_SOURCE=2 -fstack-protector-strong --param=ssp-buffer-size=4 -Werror=trampolines -fomit-frame-pointer -march=i686 -fasynchronous-unwind-tables -mtune=pentium4 -gdwarf-4 -fno-debug-types-section -fvar-tracking-assignments -g2 -DNDEBUG -DQT_NO_DEBUG -Wall -Wextra -Wcast-qual -Wconversion-null -Wmissing-declarations -Woverlength-strings -Wpointer-arith -Wundef -Wunused-local-typedefs -Wunused-result -Wvarargs -Wvla -Wwrite-strings -Wno-missing-field-initializers -Wno-sign-compare -DNOMINMAX -o CMakeFiles/str_format_internal.dir/internal/str_format/float_conversion.cc.o -c /tmp/B.u4f9ex94/BUILD/abseil-cpp-20200923.3/absl/strings/internal/str_format/float_conversion.cc make[2]: Leaving directory '/tmp/B.u4f9ex94/BUILD/abseil-cpp-20200923.3/build-static' make[2]: Entering directory '/tmp/B.u4f9ex94/BUILD/abseil-cpp-20200923.3/build-static' [ 67%] Building CXX object absl/time/CMakeFiles/time.dir/duration.cc.o cd /tmp/B.u4f9ex94/BUILD/abseil-cpp-20200923.3/build-static/absl/time && /usr/bin/i686-pld-linux-g++ -I/tmp/B.u4f9ex94/BUILD/abseil-cpp-20200923.3 -O2 -fwrapv -pipe -Wformat -Werror=format-security -gdwarf-4 -fno-debug-types-section -fvar-tracking-assignments -g2 -Wp,-D_FORTIFY_SOURCE=2 -fstack-protector-strong --param=ssp-buffer-size=4 -Werror=trampolines -fomit-frame-pointer -march=i686 -fasynchronous-unwind-tables -mtune=pentium4 -gdwarf-4 -fno-debug-types-section -fvar-tracking-assignments -g2 -DNDEBUG -DQT_NO_DEBUG -Wall -Wextra -Wcast-qual -Wconversion-null -Wmissing-declarations -Woverlength-strings -Wpointer-arith -Wundef -Wunused-local-typedefs -Wunused-result -Wvarargs -Wvla -Wwrite-strings -Wno-missing-field-initializers -Wno-sign-compare -DNOMINMAX -o CMakeFiles/time.dir/duration.cc.o -c /tmp/B.u4f9ex94/BUILD/abseil-cpp-20200923.3/absl/time/duration.cc make[2]: Leaving directory '/tmp/B.u4f9ex94/BUILD/abseil-cpp-20200923.3/build-static' make[2]: Entering directory '/tmp/B.u4f9ex94/BUILD/abseil-cpp-20200923.3/build-static' [ 73%] Linking CXX static library libabsl_str_format_internal.a cd /tmp/B.u4f9ex94/BUILD/abseil-cpp-20200923.3/build-static/absl/strings && /usr/bin/cmake -P CMakeFiles/str_format_internal.dir/cmake_clean_target.cmake cd /tmp/B.u4f9ex94/BUILD/abseil-cpp-20200923.3/build-static/absl/strings && /usr/bin/cmake -E cmake_link_script CMakeFiles/str_format_internal.dir/link.txt --verbose=1 /usr/bin/ar qc libabsl_str_format_internal.a CMakeFiles/str_format_internal.dir/internal/str_format/arg.cc.o CMakeFiles/str_format_internal.dir/internal/str_format/bind.cc.o CMakeFiles/str_format_internal.dir/internal/str_format/extension.cc.o CMakeFiles/str_format_internal.dir/internal/str_format/float_conversion.cc.o CMakeFiles/str_format_internal.dir/internal/str_format/output.cc.o CMakeFiles/str_format_internal.dir/internal/str_format/parser.cc.o /usr/bin/ranlib libabsl_str_format_internal.a make[2]: Leaving directory '/tmp/B.u4f9ex94/BUILD/abseil-cpp-20200923.3/build-static' make[2]: Entering directory '/tmp/B.u4f9ex94/BUILD/abseil-cpp-20200923.3/build-static' [ 70%] Building CXX object absl/random/CMakeFiles/random_seed_sequences.dir/seed_sequences.cc.o cd /tmp/B.u4f9ex94/BUILD/abseil-cpp-20200923.3/build-static/absl/random && /usr/bin/i686-pld-linux-g++ -I/tmp/B.u4f9ex94/BUILD/abseil-cpp-20200923.3 -O2 -fwrapv -pipe -Wformat -Werror=format-security -gdwarf-4 -fno-debug-types-section -fvar-tracking-assignments -g2 -Wp,-D_FORTIFY_SOURCE=2 -fstack-protector-strong --param=ssp-buffer-size=4 -Werror=trampolines -fomit-frame-pointer -march=i686 -fasynchronous-unwind-tables -mtune=pentium4 -gdwarf-4 -fno-debug-types-section -fvar-tracking-assignments -g2 -DNDEBUG -DQT_NO_DEBUG -Wall -Wextra -Wcast-qual -Wconversion-null -Wmissing-declarations -Woverlength-strings -Wpointer-arith -Wundef -Wunused-local-typedefs -Wunused-result -Wvarargs -Wvla -Wwrite-strings -Wno-missing-field-initializers -Wno-sign-compare -DNOMINMAX -o CMakeFiles/random_seed_sequences.dir/seed_sequences.cc.o -c /tmp/B.u4f9ex94/BUILD/abseil-cpp-20200923.3/absl/random/seed_sequences.cc make[2]: Leaving directory '/tmp/B.u4f9ex94/BUILD/abseil-cpp-20200923.3/build-static' make[2]: Entering directory '/tmp/B.u4f9ex94/BUILD/abseil-cpp-20200923.3/build-static' [ 72%] Building CXX object absl/debugging/CMakeFiles/failure_signal_handler.dir/failure_signal_handler.cc.o cd /tmp/B.u4f9ex94/BUILD/abseil-cpp-20200923.3/build-static/absl/debugging && /usr/bin/i686-pld-linux-g++ -I/tmp/B.u4f9ex94/BUILD/abseil-cpp-20200923.3 -O2 -fwrapv -pipe -Wformat -Werror=format-security -gdwarf-4 -fno-debug-types-section -fvar-tracking-assignments -g2 -Wp,-D_FORTIFY_SOURCE=2 -fstack-protector-strong --param=ssp-buffer-size=4 -Werror=trampolines -fomit-frame-pointer -march=i686 -fasynchronous-unwind-tables -mtune=pentium4 -gdwarf-4 -fno-debug-types-section -fvar-tracking-assignments -g2 -DNDEBUG -DQT_NO_DEBUG -Wall -Wextra -Wcast-qual -Wconversion-null -Wmissing-declarations -Woverlength-strings -Wpointer-arith -Wundef -Wunused-local-typedefs -Wunused-result -Wvarargs -Wvla -Wwrite-strings -Wno-missing-field-initializers -Wno-sign-compare -DNOMINMAX -o CMakeFiles/failure_signal_handler.dir/failure_signal_handler.cc.o -c /tmp/B.u4f9ex94/BUILD/abseil-cpp-20200923.3/absl/debugging/failure_signal_handler.cc /tmp/B.u4f9ex94/BUILD/abseil-cpp-20200923.3/absl/debugging/failure_signal_handler.cc: In function 'bool absl::lts_2020_09_23::SetupAlternateStackOnce()': /tmp/B.u4f9ex94/BUILD/abseil-cpp-20200923.3/absl/debugging/failure_signal_handler.cc:138:32: error: no matching function for call to 'max(long int, int)' 138 | size_t stack_size = (std::max(SIGSTKSZ, 65536) + page_mask) & ~page_mask; | ~~~~~~~~^~~~~~~~~~~~~~~~~ In file included from /usr/include/c++/11.2.0/algorithm:61, from /tmp/B.u4f9ex94/BUILD/abseil-cpp-20200923.3/absl/debugging/failure_signal_handler.cc:35: /usr/include/c++/11.2.0/bits/stl_algobase.h:254:5: note: candidate: 'template<class _Tp> constexpr const _Tp& std::max(const _Tp&, const _Tp&)' 254 | max(const _Tp& __a, const _Tp& __b) | ^~~ /usr/include/c++/11.2.0/bits/stl_algobase.h:254:5: note: template argument deduction/substitution failed: /tmp/B.u4f9ex94/BUILD/abseil-cpp-20200923.3/absl/debugging/failure_signal_handler.cc:138:32: note: deduced conflicting types for parameter 'const _Tp' ('long int' and 'int') 138 | size_t stack_size = (std::max(SIGSTKSZ, 65536) + page_mask) & ~page_mask; | ~~~~~~~~^~~~~~~~~~~~~~~~~ In file included from /usr/include/c++/11.2.0/algorithm:61, from /tmp/B.u4f9ex94/BUILD/abseil-cpp-20200923.3/absl/debugging/failure_signal_handler.cc:35: /usr/include/c++/11.2.0/bits/stl_algobase.h:300:5: note: candidate: 'template<class _Tp, class _Compare> constexpr const _Tp& std::max(const _Tp&, const _Tp&, _Compare)' 300 | max(const _Tp& __a, const _Tp& __b, _Compare __comp) | ^~~ /usr/include/c++/11.2.0/bits/stl_algobase.h:300:5: note: template argument deduction/substitution failed: /tmp/B.u4f9ex94/BUILD/abseil-cpp-20200923.3/absl/debugging/failure_signal_handler.cc:138:32: note: deduced conflicting types for parameter 'const _Tp' ('long int' and 'int') 138 | size_t stack_size = (std::max(SIGSTKSZ, 65536) + page_mask) & ~page_mask; | ~~~~~~~~^~~~~~~~~~~~~~~~~ In file included from /usr/include/c++/11.2.0/algorithm:62, from /tmp/B.u4f9ex94/BUILD/abseil-cpp-20200923.3/absl/debugging/failure_signal_handler.cc:35: /usr/include/c++/11.2.0/bits/stl_algo.h:3461:5: note: candidate: 'template<class _Tp> constexpr _Tp std::max(std::initializer_list<_Tp>)' 3461 | max(initializer_list<_Tp> __l) | ^~~ /usr/include/c++/11.2.0/bits/stl_algo.h:3461:5: note: template argument deduction/substitution failed: /tmp/B.u4f9ex94/BUILD/abseil-cpp-20200923.3/absl/debugging/failure_signal_handler.cc:138:32: note: mismatched types 'std::initializer_list<_Tp>' and 'long int' 138 | size_t stack_size = (std::max(SIGSTKSZ, 65536) + page_mask) & ~page_mask; | ~~~~~~~~^~~~~~~~~~~~~~~~~ In file included from /usr/include/c++/11.2.0/algorithm:62, from /tmp/B.u4f9ex94/BUILD/abseil-cpp-20200923.3/absl/debugging/failure_signal_handler.cc:35: /usr/include/c++/11.2.0/bits/stl_algo.h:3467:5: note: candidate: 'template<class _Tp, class _Compare> constexpr _Tp std::max(std::initializer_list<_Tp>, _Compare)' 3467 | max(initializer_list<_Tp> __l, _Compare __comp) | ^~~ /usr/include/c++/11.2.0/bits/stl_algo.h:3467:5: note: template argument deduction/substitution failed: /tmp/B.u4f9ex94/BUILD/abseil-cpp-20200923.3/absl/debugging/failure_signal_handler.cc:138:32: note: mismatched types 'std::initializer_list<_Tp>' and 'long int' 138 | size_t stack_size = (std::max(SIGSTKSZ, 65536) + page_mask) & ~page_mask; | ~~~~~~~~^~~~~~~~~~~~~~~~~ make[2]: *** [absl/debugging/CMakeFiles/failure_signal_handler.dir/build.make:86: absl/debugging/CMakeFiles/failure_signal_handler.dir/failure_signal_handler.cc.o] Error 1 make[2]: Leaving directory '/tmp/B.u4f9ex94/BUILD/abseil-cpp-20200923.3/build-static' make[1]: *** [CMakeFiles/Makefile2:1025: absl/debugging/CMakeFiles/failure_signal_handler.dir/all] Error 2 make[1]: *** Waiting for unfinished jobs.... make[2]: Entering directory '/tmp/B.u4f9ex94/BUILD/abseil-cpp-20200923.3/build-static' [ 74%] Linking CXX static library libabsl_time.a cd /tmp/B.u4f9ex94/BUILD/abseil-cpp-20200923.3/build-static/absl/time && /usr/bin/cmake -P CMakeFiles/time.dir/cmake_clean_target.cmake cd /tmp/B.u4f9ex94/BUILD/abseil-cpp-20200923.3/build-static/absl/time && /usr/bin/cmake -E cmake_link_script CMakeFiles/time.dir/link.txt --verbose=1 /usr/bin/ar qc libabsl_time.a CMakeFiles/time.dir/civil_time.cc.o CMakeFiles/time.dir/clock.cc.o CMakeFiles/time.dir/duration.cc.o CMakeFiles/time.dir/format.cc.o CMakeFiles/time.dir/time.cc.o /usr/bin/ranlib libabsl_time.a make[2]: Leaving directory '/tmp/B.u4f9ex94/BUILD/abseil-cpp-20200923.3/build-static' make[2]: Entering directory '/tmp/B.u4f9ex94/BUILD/abseil-cpp-20200923.3/build-static' [ 75%] Linking CXX static library libabsl_random_seed_sequences.a cd /tmp/B.u4f9ex94/BUILD/abseil-cpp-20200923.3/build-static/absl/random && /usr/bin/cmake -P CMakeFiles/random_seed_sequences.dir/cmake_clean_target.cmake cd /tmp/B.u4f9ex94/BUILD/abseil-cpp-20200923.3/build-static/absl/random && /usr/bin/cmake -E cmake_link_script CMakeFiles/random_seed_sequences.dir/link.txt --verbose=1 /usr/bin/ar qc libabsl_random_seed_sequences.a CMakeFiles/random_seed_sequences.dir/seed_sequences.cc.o /usr/bin/ranlib libabsl_random_seed_sequences.a make[2]: Leaving directory '/tmp/B.u4f9ex94/BUILD/abseil-cpp-20200923.3/build-static' make[1]: Entering directory '/tmp/B.u4f9ex94/BUILD/abseil-cpp-20200923.3/build-static' [ 75%] Built target str_format_internal make[1]: Leaving directory '/tmp/B.u4f9ex94/BUILD/abseil-cpp-20200923.3/build-static' make[1]: Entering directory '/tmp/B.u4f9ex94/BUILD/abseil-cpp-20200923.3/build-static' [ 75%] Built target random_seed_sequences make[1]: Leaving directory '/tmp/B.u4f9ex94/BUILD/abseil-cpp-20200923.3/build-static' make[1]: Entering directory '/tmp/B.u4f9ex94/BUILD/abseil-cpp-20200923.3/build-static' [ 75%] Built target time make[1]: Leaving directory '/tmp/B.u4f9ex94/BUILD/abseil-cpp-20200923.3/build-static' make: *** [Makefile:153: all] Error 2 error: Bad exit status from /tmp/B.u4f9ex94/BUILD/tmp/rpm-tmp.zy9BJZ (%build) RPM build errors: Could not canonicalize hostname: nereid Bad exit status from /tmp/B.u4f9ex94/BUILD/tmp/rpm-tmp.zy9BJZ (%build) ended at: Sat Nov 20 23:06:58 2021, done in 0:00:14.749461 error: No files produced. + chmod -R u+rwX /tmp/B.u4f9ex94/BUILD + rm -rf /tmp/B.u4f9ex94/tmp /tmp/B.u4f9ex94/BUILD + rm -rf /tmp/B.u4f9ex94 Begin-PLD-Builder-Info Build-Time: user:80.16s sys:8.89s real:16.78s (faults io:193 non-io:1531553) End-PLD-Builder-Info
[Back to list of logs] [View rpm -qa of builder]