FailedOk

th/SRPMS[OK]
th/x32[OK]
th/i686[OK]
th/x86_64[OK]

ac/SRPMS[OK]
ac/i386[OK]
ac/i586[OK]
ac/i686[OK]
ac/alpha[OK]
ac/amd64[OK]
ac/athlon[OK]
ac/ppc[OK]
ac/sparc[OK]
ac/sparc64[OK]

Advanced Search
main()
Powered by PLD Linux
(c) 2002-2021 PLD Team
$Revision: 1.37 $
Powered by overclock.
Your IP: 54.227.97.219

abseil-cpp 450206f2-6545-4bf6-a8f5-01845e8573df

Status:Failed
Source URL:https://buildlogs.pld-linux.org/pld/th/i686/FAIL/abseil-cpp,450206f2-6545-4bf6-a8f5-01845e8573df.bz2
text/plain URL:View!
full text:View!
rpm -qa of builder:View!
Date:2021/11/20 23:06:58
Runtime:0:00:14.749461

Toc:

  • error 1
  • /tmp/B.u4f9ex94/BUILD/abseil-cpp-20200923.3/absl/debugging/failure_signal_handler.cc:138:32: error: no matching function for call to 'max(long int, int)'
  • error 2
  • make[2]: *** [absl/debugging/CMakeFiles/failure_signal_handler.dir/build.make:86: absl/debugging/CMakeFiles/failure_signal_handler.dir/failure_signal_handler.cc.o] Error 1
  • error 3
  • make[1]: *** [CMakeFiles/Makefile2:1025: absl/debugging/CMakeFiles/failure_signal_handler.dir/all] Error 2
  • error 4
  • error: Bad exit status from /tmp/B.u4f9ex94/BUILD/tmp/rpm-tmp.zy9BJZ (%build)
  • error 5
  • RPM build errors:
  • error 6
  • error: No files produced.

Content:

/usr/bin/make  -f absl/debugging/CMakeFiles/examine_stack.dir/build.make absl/debugging/CMakeFiles/examine_stack.dir/depend
make[2]: Entering directory '/tmp/B.u4f9ex94/BUILD/abseil-cpp-20200923.3/build-static'
cd /tmp/B.u4f9ex94/BUILD/abseil-cpp-20200923.3/build-static && /usr/bin/cmake -E cmake_depends "Unix Makefiles" /tmp/B.u4f9ex94/BUILD/abseil-cpp-20200923.3 /tmp/B.u4f9ex94/BUILD/abseil-cpp-20200923.3/absl/debugging /tmp/B.u4f9ex94/BUILD/abseil-cpp-20200923.3/build-static /tmp/B.u4f9ex94/BUILD/abseil-cpp-20200923.3/build-static/absl/debugging /tmp/B.u4f9ex94/BUILD/abseil-cpp-20200923.3/build-static/absl/debugging/CMakeFiles/examine_stack.dir/DependInfo.cmake --color=
Scanning dependencies of target examine_stack
make[2]: Leaving directory '/tmp/B.u4f9ex94/BUILD/abseil-cpp-20200923.3/build-static'
/usr/bin/make  -f absl/debugging/CMakeFiles/examine_stack.dir/build.make absl/debugging/CMakeFiles/examine_stack.dir/build
make[2]: Entering directory '/tmp/B.u4f9ex94/BUILD/abseil-cpp-20200923.3/build-static'
[ 66%] Building CXX object absl/strings/CMakeFiles/str_format_internal.dir/internal/str_format/output.cc.o
cd /tmp/B.u4f9ex94/BUILD/abseil-cpp-20200923.3/build-static/absl/strings && /usr/bin/i686-pld-linux-g++   -I/tmp/B.u4f9ex94/BUILD/abseil-cpp-20200923.3  -O2 -fwrapv -pipe -Wformat -Werror=format-security -gdwarf-4 -fno-debug-types-section -fvar-tracking-assignments -g2 -Wp,-D_FORTIFY_SOURCE=2 -fstack-protector-strong --param=ssp-buffer-size=4 -Werror=trampolines -fomit-frame-pointer -march=i686 -fasynchronous-unwind-tables -mtune=pentium4 -gdwarf-4 -fno-debug-types-section -fvar-tracking-assignments -g2  -DNDEBUG -DQT_NO_DEBUG   -Wall -Wextra -Wcast-qual -Wconversion-null -Wmissing-declarations -Woverlength-strings -Wpointer-arith -Wundef -Wunused-local-typedefs -Wunused-result -Wvarargs -Wvla -Wwrite-strings -Wno-missing-field-initializers -Wno-sign-compare -DNOMINMAX -o CMakeFiles/str_format_internal.dir/internal/str_format/output.cc.o -c /tmp/B.u4f9ex94/BUILD/abseil-cpp-20200923.3/absl/strings/internal/str_format/output.cc
make[2]: Leaving directory '/tmp/B.u4f9ex94/BUILD/abseil-cpp-20200923.3/build-static'
make[2]: Entering directory '/tmp/B.u4f9ex94/BUILD/abseil-cpp-20200923.3/build-static'
[ 65%] Building CXX object absl/random/CMakeFiles/random_internal_pool_urbg.dir/internal/pool_urbg.cc.o
cd /tmp/B.u4f9ex94/BUILD/abseil-cpp-20200923.3/build-static/absl/random && /usr/bin/i686-pld-linux-g++   -I/tmp/B.u4f9ex94/BUILD/abseil-cpp-20200923.3  -O2 -fwrapv -pipe -Wformat -Werror=format-security -gdwarf-4 -fno-debug-types-section -fvar-tracking-assignments -g2 -Wp,-D_FORTIFY_SOURCE=2 -fstack-protector-strong --param=ssp-buffer-size=4 -Werror=trampolines -fomit-frame-pointer -march=i686 -fasynchronous-unwind-tables -mtune=pentium4 -gdwarf-4 -fno-debug-types-section -fvar-tracking-assignments -g2  -DNDEBUG -DQT_NO_DEBUG   -Wall -Wextra -Wcast-qual -Wconversion-null -Wmissing-declarations -Woverlength-strings -Wpointer-arith -Wundef -Wunused-local-typedefs -Wunused-result -Wvarargs -Wvla -Wwrite-strings -Wno-missing-field-initializers -Wno-sign-compare -DNOMINMAX -o CMakeFiles/random_internal_pool_urbg.dir/internal/pool_urbg.cc.o -c /tmp/B.u4f9ex94/BUILD/abseil-cpp-20200923.3/absl/random/internal/pool_urbg.cc
make[2]: Leaving directory '/tmp/B.u4f9ex94/BUILD/abseil-cpp-20200923.3/build-static'
make[2]: Entering directory '/tmp/B.u4f9ex94/BUILD/abseil-cpp-20200923.3/build-static'
[ 69%] Linking CXX static library libabsl_random_internal_pool_urbg.a
cd /tmp/B.u4f9ex94/BUILD/abseil-cpp-20200923.3/build-static/absl/random && /usr/bin/cmake -P CMakeFiles/random_internal_pool_urbg.dir/cmake_clean_target.cmake
cd /tmp/B.u4f9ex94/BUILD/abseil-cpp-20200923.3/build-static/absl/random && /usr/bin/cmake -E cmake_link_script CMakeFiles/random_internal_pool_urbg.dir/link.txt --verbose=1
/usr/bin/ar qc libabsl_random_internal_pool_urbg.a  CMakeFiles/random_internal_pool_urbg.dir/internal/pool_urbg.cc.o
/usr/bin/ranlib libabsl_random_internal_pool_urbg.a
make[2]: Leaving directory '/tmp/B.u4f9ex94/BUILD/abseil-cpp-20200923.3/build-static'
make[1]: Entering directory '/tmp/B.u4f9ex94/BUILD/abseil-cpp-20200923.3/build-static'
[ 69%] Built target random_internal_pool_urbg
make[1]: Leaving directory '/tmp/B.u4f9ex94/BUILD/abseil-cpp-20200923.3/build-static'
/usr/bin/make  -f absl/random/CMakeFiles/random_seed_sequences.dir/build.make absl/random/CMakeFiles/random_seed_sequences.dir/depend
make[2]: Entering directory '/tmp/B.u4f9ex94/BUILD/abseil-cpp-20200923.3/build-static'
cd /tmp/B.u4f9ex94/BUILD/abseil-cpp-20200923.3/build-static && /usr/bin/cmake -E cmake_depends "Unix Makefiles" /tmp/B.u4f9ex94/BUILD/abseil-cpp-20200923.3 /tmp/B.u4f9ex94/BUILD/abseil-cpp-20200923.3/absl/random /tmp/B.u4f9ex94/BUILD/abseil-cpp-20200923.3/build-static /tmp/B.u4f9ex94/BUILD/abseil-cpp-20200923.3/build-static/absl/random /tmp/B.u4f9ex94/BUILD/abseil-cpp-20200923.3/build-static/absl/random/CMakeFiles/random_seed_sequences.dir/DependInfo.cmake --color=
Scanning dependencies of target random_seed_sequences
make[2]: Leaving directory '/tmp/B.u4f9ex94/BUILD/abseil-cpp-20200923.3/build-static'
/usr/bin/make  -f absl/random/CMakeFiles/random_seed_sequences.dir/build.make absl/random/CMakeFiles/random_seed_sequences.dir/build
make[2]: Entering directory '/tmp/B.u4f9ex94/BUILD/abseil-cpp-20200923.3/build-static'
[ 67%] Building CXX object absl/time/CMakeFiles/time.dir/format.cc.o
cd /tmp/B.u4f9ex94/BUILD/abseil-cpp-20200923.3/build-static/absl/time && /usr/bin/i686-pld-linux-g++   -I/tmp/B.u4f9ex94/BUILD/abseil-cpp-20200923.3  -O2 -fwrapv -pipe -Wformat -Werror=format-security -gdwarf-4 -fno-debug-types-section -fvar-tracking-assignments -g2 -Wp,-D_FORTIFY_SOURCE=2 -fstack-protector-strong --param=ssp-buffer-size=4 -Werror=trampolines -fomit-frame-pointer -march=i686 -fasynchronous-unwind-tables -mtune=pentium4 -gdwarf-4 -fno-debug-types-section -fvar-tracking-assignments -g2  -DNDEBUG -DQT_NO_DEBUG   -Wall -Wextra -Wcast-qual -Wconversion-null -Wmissing-declarations -Woverlength-strings -Wpointer-arith -Wundef -Wunused-local-typedefs -Wunused-result -Wvarargs -Wvla -Wwrite-strings -Wno-missing-field-initializers -Wno-sign-compare -DNOMINMAX -o CMakeFiles/time.dir/format.cc.o -c /tmp/B.u4f9ex94/BUILD/abseil-cpp-20200923.3/absl/time/format.cc
make[2]: Leaving directory '/tmp/B.u4f9ex94/BUILD/abseil-cpp-20200923.3/build-static'
make[2]: Entering directory '/tmp/B.u4f9ex94/BUILD/abseil-cpp-20200923.3/build-static'
[ 59%] Building CXX object absl/strings/CMakeFiles/cord.dir/cord.cc.o
cd /tmp/B.u4f9ex94/BUILD/abseil-cpp-20200923.3/build-static/absl/strings && /usr/bin/i686-pld-linux-g++   -I/tmp/B.u4f9ex94/BUILD/abseil-cpp-20200923.3  -O2 -fwrapv -pipe -Wformat -Werror=format-security -gdwarf-4 -fno-debug-types-section -fvar-tracking-assignments -g2 -Wp,-D_FORTIFY_SOURCE=2 -fstack-protector-strong --param=ssp-buffer-size=4 -Werror=trampolines -fomit-frame-pointer -march=i686 -fasynchronous-unwind-tables -mtune=pentium4 -gdwarf-4 -fno-debug-types-section -fvar-tracking-assignments -g2  -DNDEBUG -DQT_NO_DEBUG   -Wall -Wextra -Wcast-qual -Wconversion-null -Wmissing-declarations -Woverlength-strings -Wpointer-arith -Wundef -Wunused-local-typedefs -Wunused-result -Wvarargs -Wvla -Wwrite-strings -Wno-missing-field-initializers -Wno-sign-compare -DNOMINMAX -o CMakeFiles/cord.dir/cord.cc.o -c /tmp/B.u4f9ex94/BUILD/abseil-cpp-20200923.3/absl/strings/cord.cc
make[2]: Leaving directory '/tmp/B.u4f9ex94/BUILD/abseil-cpp-20200923.3/build-static'
make[2]: Entering directory '/tmp/B.u4f9ex94/BUILD/abseil-cpp-20200923.3/build-static'
[ 70%] Linking CXX static library libabsl_cord.a
cd /tmp/B.u4f9ex94/BUILD/abseil-cpp-20200923.3/build-static/absl/strings && /usr/bin/cmake -P CMakeFiles/cord.dir/cmake_clean_target.cmake
cd /tmp/B.u4f9ex94/BUILD/abseil-cpp-20200923.3/build-static/absl/strings && /usr/bin/cmake -E cmake_link_script CMakeFiles/cord.dir/link.txt --verbose=1
/usr/bin/ar qc libabsl_cord.a  CMakeFiles/cord.dir/cord.cc.o
/usr/bin/ranlib libabsl_cord.a
make[2]: Leaving directory '/tmp/B.u4f9ex94/BUILD/abseil-cpp-20200923.3/build-static'
make[1]: Entering directory '/tmp/B.u4f9ex94/BUILD/abseil-cpp-20200923.3/build-static'
[ 70%] Built target cord
make[1]: Leaving directory '/tmp/B.u4f9ex94/BUILD/abseil-cpp-20200923.3/build-static'
make[2]: Entering directory '/tmp/B.u4f9ex94/BUILD/abseil-cpp-20200923.3/build-static'
[ 69%] Building CXX object absl/debugging/CMakeFiles/examine_stack.dir/internal/examine_stack.cc.o
cd /tmp/B.u4f9ex94/BUILD/abseil-cpp-20200923.3/build-static/absl/debugging && /usr/bin/i686-pld-linux-g++   -I/tmp/B.u4f9ex94/BUILD/abseil-cpp-20200923.3  -O2 -fwrapv -pipe -Wformat -Werror=format-security -gdwarf-4 -fno-debug-types-section -fvar-tracking-assignments -g2 -Wp,-D_FORTIFY_SOURCE=2 -fstack-protector-strong --param=ssp-buffer-size=4 -Werror=trampolines -fomit-frame-pointer -march=i686 -fasynchronous-unwind-tables -mtune=pentium4 -gdwarf-4 -fno-debug-types-section -fvar-tracking-assignments -g2  -DNDEBUG -DQT_NO_DEBUG   -Wall -Wextra -Wcast-qual -Wconversion-null -Wmissing-declarations -Woverlength-strings -Wpointer-arith -Wundef -Wunused-local-typedefs -Wunused-result -Wvarargs -Wvla -Wwrite-strings -Wno-missing-field-initializers -Wno-sign-compare -DNOMINMAX -o CMakeFiles/examine_stack.dir/internal/examine_stack.cc.o -c /tmp/B.u4f9ex94/BUILD/abseil-cpp-20200923.3/absl/debugging/internal/examine_stack.cc
make[2]: Leaving directory '/tmp/B.u4f9ex94/BUILD/abseil-cpp-20200923.3/build-static'
make[2]: Entering directory '/tmp/B.u4f9ex94/BUILD/abseil-cpp-20200923.3/build-static'
[ 71%] Linking CXX static library libabsl_examine_stack.a
cd /tmp/B.u4f9ex94/BUILD/abseil-cpp-20200923.3/build-static/absl/debugging && /usr/bin/cmake -P CMakeFiles/examine_stack.dir/cmake_clean_target.cmake
cd /tmp/B.u4f9ex94/BUILD/abseil-cpp-20200923.3/build-static/absl/debugging && /usr/bin/cmake -E cmake_link_script CMakeFiles/examine_stack.dir/link.txt --verbose=1
/usr/bin/ar qc libabsl_examine_stack.a  CMakeFiles/examine_stack.dir/internal/examine_stack.cc.o
/usr/bin/ranlib libabsl_examine_stack.a
make[2]: Leaving directory '/tmp/B.u4f9ex94/BUILD/abseil-cpp-20200923.3/build-static'
make[1]: Entering directory '/tmp/B.u4f9ex94/BUILD/abseil-cpp-20200923.3/build-static'
[ 71%] Built target examine_stack
make[1]: Leaving directory '/tmp/B.u4f9ex94/BUILD/abseil-cpp-20200923.3/build-static'
/usr/bin/make  -f absl/debugging/CMakeFiles/failure_signal_handler.dir/build.make absl/debugging/CMakeFiles/failure_signal_handler.dir/depend
make[2]: Entering directory '/tmp/B.u4f9ex94/BUILD/abseil-cpp-20200923.3/build-static'
cd /tmp/B.u4f9ex94/BUILD/abseil-cpp-20200923.3/build-static && /usr/bin/cmake -E cmake_depends "Unix Makefiles" /tmp/B.u4f9ex94/BUILD/abseil-cpp-20200923.3 /tmp/B.u4f9ex94/BUILD/abseil-cpp-20200923.3/absl/debugging /tmp/B.u4f9ex94/BUILD/abseil-cpp-20200923.3/build-static /tmp/B.u4f9ex94/BUILD/abseil-cpp-20200923.3/build-static/absl/debugging /tmp/B.u4f9ex94/BUILD/abseil-cpp-20200923.3/build-static/absl/debugging/CMakeFiles/failure_signal_handler.dir/DependInfo.cmake --color=
Scanning dependencies of target failure_signal_handler
make[2]: Leaving directory '/tmp/B.u4f9ex94/BUILD/abseil-cpp-20200923.3/build-static'
/usr/bin/make  -f absl/debugging/CMakeFiles/failure_signal_handler.dir/build.make absl/debugging/CMakeFiles/failure_signal_handler.dir/build
make[2]: Entering directory '/tmp/B.u4f9ex94/BUILD/abseil-cpp-20200923.3/build-static'
[ 66%] Building CXX object absl/strings/CMakeFiles/str_format_internal.dir/internal/str_format/parser.cc.o
cd /tmp/B.u4f9ex94/BUILD/abseil-cpp-20200923.3/build-static/absl/strings && /usr/bin/i686-pld-linux-g++   -I/tmp/B.u4f9ex94/BUILD/abseil-cpp-20200923.3  -O2 -fwrapv -pipe -Wformat -Werror=format-security -gdwarf-4 -fno-debug-types-section -fvar-tracking-assignments -g2 -Wp,-D_FORTIFY_SOURCE=2 -fstack-protector-strong --param=ssp-buffer-size=4 -Werror=trampolines -fomit-frame-pointer -march=i686 -fasynchronous-unwind-tables -mtune=pentium4 -gdwarf-4 -fno-debug-types-section -fvar-tracking-assignments -g2  -DNDEBUG -DQT_NO_DEBUG   -Wall -Wextra -Wcast-qual -Wconversion-null -Wmissing-declarations -Woverlength-strings -Wpointer-arith -Wundef -Wunused-local-typedefs -Wunused-result -Wvarargs -Wvla -Wwrite-strings -Wno-missing-field-initializers -Wno-sign-compare -DNOMINMAX -o CMakeFiles/str_format_internal.dir/internal/str_format/parser.cc.o -c /tmp/B.u4f9ex94/BUILD/abseil-cpp-20200923.3/absl/strings/internal/str_format/parser.cc
make[2]: Leaving directory '/tmp/B.u4f9ex94/BUILD/abseil-cpp-20200923.3/build-static'
make[2]: Entering directory '/tmp/B.u4f9ex94/BUILD/abseil-cpp-20200923.3/build-static'
[ 69%] Building CXX object absl/time/CMakeFiles/time.dir/time.cc.o
cd /tmp/B.u4f9ex94/BUILD/abseil-cpp-20200923.3/build-static/absl/time && /usr/bin/i686-pld-linux-g++   -I/tmp/B.u4f9ex94/BUILD/abseil-cpp-20200923.3  -O2 -fwrapv -pipe -Wformat -Werror=format-security -gdwarf-4 -fno-debug-types-section -fvar-tracking-assignments -g2 -Wp,-D_FORTIFY_SOURCE=2 -fstack-protector-strong --param=ssp-buffer-size=4 -Werror=trampolines -fomit-frame-pointer -march=i686 -fasynchronous-unwind-tables -mtune=pentium4 -gdwarf-4 -fno-debug-types-section -fvar-tracking-assignments -g2  -DNDEBUG -DQT_NO_DEBUG   -Wall -Wextra -Wcast-qual -Wconversion-null -Wmissing-declarations -Woverlength-strings -Wpointer-arith -Wundef -Wunused-local-typedefs -Wunused-result -Wvarargs -Wvla -Wwrite-strings -Wno-missing-field-initializers -Wno-sign-compare -DNOMINMAX -o CMakeFiles/time.dir/time.cc.o -c /tmp/B.u4f9ex94/BUILD/abseil-cpp-20200923.3/absl/time/time.cc
make[2]: Leaving directory '/tmp/B.u4f9ex94/BUILD/abseil-cpp-20200923.3/build-static'
make[2]: Entering directory '/tmp/B.u4f9ex94/BUILD/abseil-cpp-20200923.3/build-static'
[ 64%] Building CXX object absl/strings/CMakeFiles/str_format_internal.dir/internal/str_format/float_conversion.cc.o
cd /tmp/B.u4f9ex94/BUILD/abseil-cpp-20200923.3/build-static/absl/strings && /usr/bin/i686-pld-linux-g++   -I/tmp/B.u4f9ex94/BUILD/abseil-cpp-20200923.3  -O2 -fwrapv -pipe -Wformat -Werror=format-security -gdwarf-4 -fno-debug-types-section -fvar-tracking-assignments -g2 -Wp,-D_FORTIFY_SOURCE=2 -fstack-protector-strong --param=ssp-buffer-size=4 -Werror=trampolines -fomit-frame-pointer -march=i686 -fasynchronous-unwind-tables -mtune=pentium4 -gdwarf-4 -fno-debug-types-section -fvar-tracking-assignments -g2  -DNDEBUG -DQT_NO_DEBUG   -Wall -Wextra -Wcast-qual -Wconversion-null -Wmissing-declarations -Woverlength-strings -Wpointer-arith -Wundef -Wunused-local-typedefs -Wunused-result -Wvarargs -Wvla -Wwrite-strings -Wno-missing-field-initializers -Wno-sign-compare -DNOMINMAX -o CMakeFiles/str_format_internal.dir/internal/str_format/float_conversion.cc.o -c /tmp/B.u4f9ex94/BUILD/abseil-cpp-20200923.3/absl/strings/internal/str_format/float_conversion.cc
make[2]: Leaving directory '/tmp/B.u4f9ex94/BUILD/abseil-cpp-20200923.3/build-static'
make[2]: Entering directory '/tmp/B.u4f9ex94/BUILD/abseil-cpp-20200923.3/build-static'
[ 67%] Building CXX object absl/time/CMakeFiles/time.dir/duration.cc.o
cd /tmp/B.u4f9ex94/BUILD/abseil-cpp-20200923.3/build-static/absl/time && /usr/bin/i686-pld-linux-g++   -I/tmp/B.u4f9ex94/BUILD/abseil-cpp-20200923.3  -O2 -fwrapv -pipe -Wformat -Werror=format-security -gdwarf-4 -fno-debug-types-section -fvar-tracking-assignments -g2 -Wp,-D_FORTIFY_SOURCE=2 -fstack-protector-strong --param=ssp-buffer-size=4 -Werror=trampolines -fomit-frame-pointer -march=i686 -fasynchronous-unwind-tables -mtune=pentium4 -gdwarf-4 -fno-debug-types-section -fvar-tracking-assignments -g2  -DNDEBUG -DQT_NO_DEBUG   -Wall -Wextra -Wcast-qual -Wconversion-null -Wmissing-declarations -Woverlength-strings -Wpointer-arith -Wundef -Wunused-local-typedefs -Wunused-result -Wvarargs -Wvla -Wwrite-strings -Wno-missing-field-initializers -Wno-sign-compare -DNOMINMAX -o CMakeFiles/time.dir/duration.cc.o -c /tmp/B.u4f9ex94/BUILD/abseil-cpp-20200923.3/absl/time/duration.cc
make[2]: Leaving directory '/tmp/B.u4f9ex94/BUILD/abseil-cpp-20200923.3/build-static'
make[2]: Entering directory '/tmp/B.u4f9ex94/BUILD/abseil-cpp-20200923.3/build-static'
[ 73%] Linking CXX static library libabsl_str_format_internal.a
cd /tmp/B.u4f9ex94/BUILD/abseil-cpp-20200923.3/build-static/absl/strings && /usr/bin/cmake -P CMakeFiles/str_format_internal.dir/cmake_clean_target.cmake
cd /tmp/B.u4f9ex94/BUILD/abseil-cpp-20200923.3/build-static/absl/strings && /usr/bin/cmake -E cmake_link_script CMakeFiles/str_format_internal.dir/link.txt --verbose=1
/usr/bin/ar qc libabsl_str_format_internal.a  CMakeFiles/str_format_internal.dir/internal/str_format/arg.cc.o CMakeFiles/str_format_internal.dir/internal/str_format/bind.cc.o CMakeFiles/str_format_internal.dir/internal/str_format/extension.cc.o CMakeFiles/str_format_internal.dir/internal/str_format/float_conversion.cc.o CMakeFiles/str_format_internal.dir/internal/str_format/output.cc.o CMakeFiles/str_format_internal.dir/internal/str_format/parser.cc.o
/usr/bin/ranlib libabsl_str_format_internal.a
make[2]: Leaving directory '/tmp/B.u4f9ex94/BUILD/abseil-cpp-20200923.3/build-static'
make[2]: Entering directory '/tmp/B.u4f9ex94/BUILD/abseil-cpp-20200923.3/build-static'
[ 70%] Building CXX object absl/random/CMakeFiles/random_seed_sequences.dir/seed_sequences.cc.o
cd /tmp/B.u4f9ex94/BUILD/abseil-cpp-20200923.3/build-static/absl/random && /usr/bin/i686-pld-linux-g++   -I/tmp/B.u4f9ex94/BUILD/abseil-cpp-20200923.3  -O2 -fwrapv -pipe -Wformat -Werror=format-security -gdwarf-4 -fno-debug-types-section -fvar-tracking-assignments -g2 -Wp,-D_FORTIFY_SOURCE=2 -fstack-protector-strong --param=ssp-buffer-size=4 -Werror=trampolines -fomit-frame-pointer -march=i686 -fasynchronous-unwind-tables -mtune=pentium4 -gdwarf-4 -fno-debug-types-section -fvar-tracking-assignments -g2  -DNDEBUG -DQT_NO_DEBUG   -Wall -Wextra -Wcast-qual -Wconversion-null -Wmissing-declarations -Woverlength-strings -Wpointer-arith -Wundef -Wunused-local-typedefs -Wunused-result -Wvarargs -Wvla -Wwrite-strings -Wno-missing-field-initializers -Wno-sign-compare -DNOMINMAX -o CMakeFiles/random_seed_sequences.dir/seed_sequences.cc.o -c /tmp/B.u4f9ex94/BUILD/abseil-cpp-20200923.3/absl/random/seed_sequences.cc
make[2]: Leaving directory '/tmp/B.u4f9ex94/BUILD/abseil-cpp-20200923.3/build-static'
make[2]: Entering directory '/tmp/B.u4f9ex94/BUILD/abseil-cpp-20200923.3/build-static'
[ 72%] Building CXX object absl/debugging/CMakeFiles/failure_signal_handler.dir/failure_signal_handler.cc.o
cd /tmp/B.u4f9ex94/BUILD/abseil-cpp-20200923.3/build-static/absl/debugging && /usr/bin/i686-pld-linux-g++   -I/tmp/B.u4f9ex94/BUILD/abseil-cpp-20200923.3  -O2 -fwrapv -pipe -Wformat -Werror=format-security -gdwarf-4 -fno-debug-types-section -fvar-tracking-assignments -g2 -Wp,-D_FORTIFY_SOURCE=2 -fstack-protector-strong --param=ssp-buffer-size=4 -Werror=trampolines -fomit-frame-pointer -march=i686 -fasynchronous-unwind-tables -mtune=pentium4 -gdwarf-4 -fno-debug-types-section -fvar-tracking-assignments -g2  -DNDEBUG -DQT_NO_DEBUG   -Wall -Wextra -Wcast-qual -Wconversion-null -Wmissing-declarations -Woverlength-strings -Wpointer-arith -Wundef -Wunused-local-typedefs -Wunused-result -Wvarargs -Wvla -Wwrite-strings -Wno-missing-field-initializers -Wno-sign-compare -DNOMINMAX -o CMakeFiles/failure_signal_handler.dir/failure_signal_handler.cc.o -c /tmp/B.u4f9ex94/BUILD/abseil-cpp-20200923.3/absl/debugging/failure_signal_handler.cc
/tmp/B.u4f9ex94/BUILD/abseil-cpp-20200923.3/absl/debugging/failure_signal_handler.cc: In function 'bool absl::lts_2020_09_23::SetupAlternateStackOnce()':
/tmp/B.u4f9ex94/BUILD/abseil-cpp-20200923.3/absl/debugging/failure_signal_handler.cc:138:32: error: no matching function for call to 'max(long int, int)'
  138 |   size_t stack_size = (std::max(SIGSTKSZ, 65536) + page_mask) & ~page_mask;
      |                        ~~~~~~~~^~~~~~~~~~~~~~~~~
In file included from /usr/include/c++/11.2.0/algorithm:61,
                 from /tmp/B.u4f9ex94/BUILD/abseil-cpp-20200923.3/absl/debugging/failure_signal_handler.cc:35:
/usr/include/c++/11.2.0/bits/stl_algobase.h:254:5: note: candidate: 'template<class _Tp> constexpr const _Tp& std::max(const _Tp&, const _Tp&)'
  254 |     max(const _Tp& __a, const _Tp& __b)
      |     ^~~
/usr/include/c++/11.2.0/bits/stl_algobase.h:254:5: note:   template argument deduction/substitution failed:
/tmp/B.u4f9ex94/BUILD/abseil-cpp-20200923.3/absl/debugging/failure_signal_handler.cc:138:32: note:   deduced conflicting types for parameter 'const _Tp' ('long int' and 'int')
  138 |   size_t stack_size = (std::max(SIGSTKSZ, 65536) + page_mask) & ~page_mask;
      |                        ~~~~~~~~^~~~~~~~~~~~~~~~~
In file included from /usr/include/c++/11.2.0/algorithm:61,
                 from /tmp/B.u4f9ex94/BUILD/abseil-cpp-20200923.3/absl/debugging/failure_signal_handler.cc:35:
/usr/include/c++/11.2.0/bits/stl_algobase.h:300:5: note: candidate: 'template<class _Tp, class _Compare> constexpr const _Tp& std::max(const _Tp&, const _Tp&, _Compare)'
  300 |     max(const _Tp& __a, const _Tp& __b, _Compare __comp)
      |     ^~~
/usr/include/c++/11.2.0/bits/stl_algobase.h:300:5: note:   template argument deduction/substitution failed:
/tmp/B.u4f9ex94/BUILD/abseil-cpp-20200923.3/absl/debugging/failure_signal_handler.cc:138:32: note:   deduced conflicting types for parameter 'const _Tp' ('long int' and 'int')
  138 |   size_t stack_size = (std::max(SIGSTKSZ, 65536) + page_mask) & ~page_mask;
      |                        ~~~~~~~~^~~~~~~~~~~~~~~~~
In file included from /usr/include/c++/11.2.0/algorithm:62,
                 from /tmp/B.u4f9ex94/BUILD/abseil-cpp-20200923.3/absl/debugging/failure_signal_handler.cc:35:
/usr/include/c++/11.2.0/bits/stl_algo.h:3461:5: note: candidate: 'template<class _Tp> constexpr _Tp std::max(std::initializer_list<_Tp>)'
 3461 |     max(initializer_list<_Tp> __l)
      |     ^~~
/usr/include/c++/11.2.0/bits/stl_algo.h:3461:5: note:   template argument deduction/substitution failed:
/tmp/B.u4f9ex94/BUILD/abseil-cpp-20200923.3/absl/debugging/failure_signal_handler.cc:138:32: note:   mismatched types 'std::initializer_list<_Tp>' and 'long int'
  138 |   size_t stack_size = (std::max(SIGSTKSZ, 65536) + page_mask) & ~page_mask;
      |                        ~~~~~~~~^~~~~~~~~~~~~~~~~
In file included from /usr/include/c++/11.2.0/algorithm:62,
                 from /tmp/B.u4f9ex94/BUILD/abseil-cpp-20200923.3/absl/debugging/failure_signal_handler.cc:35:
/usr/include/c++/11.2.0/bits/stl_algo.h:3467:5: note: candidate: 'template<class _Tp, class _Compare> constexpr _Tp std::max(std::initializer_list<_Tp>, _Compare)'
 3467 |     max(initializer_list<_Tp> __l, _Compare __comp)
      |     ^~~
/usr/include/c++/11.2.0/bits/stl_algo.h:3467:5: note:   template argument deduction/substitution failed:
/tmp/B.u4f9ex94/BUILD/abseil-cpp-20200923.3/absl/debugging/failure_signal_handler.cc:138:32: note:   mismatched types 'std::initializer_list<_Tp>' and 'long int'
  138 |   size_t stack_size = (std::max(SIGSTKSZ, 65536) + page_mask) & ~page_mask;
      |                        ~~~~~~~~^~~~~~~~~~~~~~~~~
make[2]: *** [absl/debugging/CMakeFiles/failure_signal_handler.dir/build.make:86: absl/debugging/CMakeFiles/failure_signal_handler.dir/failure_signal_handler.cc.o] Error 1
make[2]: Leaving directory '/tmp/B.u4f9ex94/BUILD/abseil-cpp-20200923.3/build-static'
make[1]: *** [CMakeFiles/Makefile2:1025: absl/debugging/CMakeFiles/failure_signal_handler.dir/all] Error 2
make[1]: *** Waiting for unfinished jobs....
make[2]: Entering directory '/tmp/B.u4f9ex94/BUILD/abseil-cpp-20200923.3/build-static'
[ 74%] Linking CXX static library libabsl_time.a
cd /tmp/B.u4f9ex94/BUILD/abseil-cpp-20200923.3/build-static/absl/time && /usr/bin/cmake -P CMakeFiles/time.dir/cmake_clean_target.cmake
cd /tmp/B.u4f9ex94/BUILD/abseil-cpp-20200923.3/build-static/absl/time && /usr/bin/cmake -E cmake_link_script CMakeFiles/time.dir/link.txt --verbose=1
/usr/bin/ar qc libabsl_time.a  CMakeFiles/time.dir/civil_time.cc.o CMakeFiles/time.dir/clock.cc.o CMakeFiles/time.dir/duration.cc.o CMakeFiles/time.dir/format.cc.o CMakeFiles/time.dir/time.cc.o
/usr/bin/ranlib libabsl_time.a
make[2]: Leaving directory '/tmp/B.u4f9ex94/BUILD/abseil-cpp-20200923.3/build-static'
make[2]: Entering directory '/tmp/B.u4f9ex94/BUILD/abseil-cpp-20200923.3/build-static'
[ 75%] Linking CXX static library libabsl_random_seed_sequences.a
cd /tmp/B.u4f9ex94/BUILD/abseil-cpp-20200923.3/build-static/absl/random && /usr/bin/cmake -P CMakeFiles/random_seed_sequences.dir/cmake_clean_target.cmake
cd /tmp/B.u4f9ex94/BUILD/abseil-cpp-20200923.3/build-static/absl/random && /usr/bin/cmake -E cmake_link_script CMakeFiles/random_seed_sequences.dir/link.txt --verbose=1
/usr/bin/ar qc libabsl_random_seed_sequences.a  CMakeFiles/random_seed_sequences.dir/seed_sequences.cc.o
/usr/bin/ranlib libabsl_random_seed_sequences.a
make[2]: Leaving directory '/tmp/B.u4f9ex94/BUILD/abseil-cpp-20200923.3/build-static'
make[1]: Entering directory '/tmp/B.u4f9ex94/BUILD/abseil-cpp-20200923.3/build-static'
[ 75%] Built target str_format_internal
make[1]: Leaving directory '/tmp/B.u4f9ex94/BUILD/abseil-cpp-20200923.3/build-static'
make[1]: Entering directory '/tmp/B.u4f9ex94/BUILD/abseil-cpp-20200923.3/build-static'
[ 75%] Built target random_seed_sequences
make[1]: Leaving directory '/tmp/B.u4f9ex94/BUILD/abseil-cpp-20200923.3/build-static'
make[1]: Entering directory '/tmp/B.u4f9ex94/BUILD/abseil-cpp-20200923.3/build-static'
[ 75%] Built target time
make[1]: Leaving directory '/tmp/B.u4f9ex94/BUILD/abseil-cpp-20200923.3/build-static'
make: *** [Makefile:153: all] Error 2
error: Bad exit status from /tmp/B.u4f9ex94/BUILD/tmp/rpm-tmp.zy9BJZ (%build)


RPM build errors:
    Could not canonicalize hostname: nereid
    Bad exit status from /tmp/B.u4f9ex94/BUILD/tmp/rpm-tmp.zy9BJZ (%build)
ended at: Sat Nov 20 23:06:58 2021, done in 0:00:14.749461
error: No files produced.
+ chmod -R u+rwX /tmp/B.u4f9ex94/BUILD
+ rm -rf /tmp/B.u4f9ex94/tmp /tmp/B.u4f9ex94/BUILD
+ rm -rf /tmp/B.u4f9ex94
Begin-PLD-Builder-Info
Build-Time: user:80.16s sys:8.89s real:16.78s (faults io:193 non-io:1531553)

End-PLD-Builder-Info
[Back to list of logs] [View rpm -qa of builder]