FailedOk

th/SRPMS[OK]
th/x32[OK]
th/i686[OK]
th/x86_64[OK]

ac/SRPMS[OK]
ac/i386[OK]
ac/i586[OK]
ac/i686[OK]
ac/alpha[OK]
ac/amd64[OK]
ac/athlon[OK]
ac/ppc[OK]
ac/sparc[OK]
ac/sparc64[OK]

Advanced Search
main()
Powered by PLD Linux
(c) 2002-2022 PLD Team
$Revision: 1.37 $
Powered by Leppe'.
Your IP: 3.238.98.39

ceph d4bf5147-47e9-4d5d-89b0-f937873d4b0c

Status:Failed
Source URL:https://buildlogs.pld-linux.org/pld/th/i686/FAIL/ceph,d4bf5147-47e9-4d5d-89b0-f937873d4b0c.bz2
text/plain URL:View!
full text:View!
rpm -qa of builder:View!
Date:2022/09/15 01:44:30
Runtime:0:07:35.154604

Toc:

  • error 1
  • /tmp/B.yrz327wa/BUILD/ceph-17.2.3/src/include/rados/buffer.h:98:52: error: expected template-name before '<' token
  • error 2
  • /tmp/B.yrz327wa/BUILD/ceph-17.2.3/src/include/rados/buffer.h:98:52: error: expected '{' before '<' token
  • error 3
  • /tmp/B.yrz327wa/BUILD/ceph-17.2.3/src/include/rados/buffer.h:374:17: error: 'unique_ptr' in namespace 'std' does not name a template type
  • error 4
  • /tmp/B.yrz327wa/BUILD/ceph-17.2.3/src/include/rados/buffer.h:378:17: error: 'unique_ptr' in namespace 'std' does not name a template type
  • error 5
  • /tmp/B.yrz327wa/BUILD/ceph-17.2.3/src/include/rados/buffer.h:383:17: error: 'unique_ptr' in namespace 'std' does not name a template type
  • error 6
  • /tmp/B.yrz327wa/BUILD/ceph-17.2.3/src/include/rados/buffer.h:407:17: error: 'unique_ptr' in namespace 'std' does not name a template type
  • error 7
  • /tmp/B.yrz327wa/BUILD/ceph-17.2.3/src/include/rados/buffer.h:1050:20: error: 'std::unique_ptr' has not been declared
  • error 8
  • /tmp/B.yrz327wa/BUILD/ceph-17.2.3/src/include/rados/buffer.h:1050:35: error: expected ',' or '...' before '<' token
  • error 9
  • /tmp/B.yrz327wa/BUILD/ceph-17.2.3/src/include/rados/buffer.h:1069:18: error: 'std::unique_ptr' has not been declared
  • error 10
  • /tmp/B.yrz327wa/BUILD/ceph-17.2.3/src/include/rados/buffer.h:1069:33: error: expected ',' or '...' before '<' token
  • error 11
  • /tmp/B.yrz327wa/BUILD/ceph-17.2.3/src/include/rados/buffer.h:1035:37: error: 'create' is not a member of 'ceph::buffer::v15_2_0::ptr_node'
  • error 12
  • /tmp/B.yrz327wa/BUILD/ceph-17.2.3/src/include/rados/buffer.h:1044:37: error: 'create' is not a member of 'ceph::buffer::v15_2_0::ptr_node'
  • error 13
  • /tmp/B.yrz327wa/BUILD/ceph-17.2.3/src/include/rados/buffer.h:1051:19: error: 'bp' was not declared in this scope
  • error 14
  • /tmp/B.yrz327wa/BUILD/ceph-17.2.3/src/include/rados/buffer.h:1057:51: error: 'r' has incomplete type
  • error 15
  • /tmp/B.yrz327wa/BUILD/ceph-17.2.3/src/include/rados/buffer.h:1058:37: error: 'create' is not a member of 'ceph::buffer::v15_2_0::ptr_node'
  • error 16
  • /tmp/B.yrz327wa/BUILD/ceph-17.2.3/src/include/rados/buffer.h:1094:41: error: 'create' is not a member of 'ceph::buffer::v15_2_0::ptr_node'
  • error 17
  • /tmp/B.yrz327wa/BUILD/ceph-17.2.3/src/include/denc.h:823:31: error: invalid use of incomplete type 'struct ceph::unique_leakable_ptr<ceph::buffer::v15_2_0::raw>'
  • error 18
  • /tmp/B.yrz327wa/BUILD/ceph-17.2.3/src/include/encoding.h:273:24: error: invalid use of incomplete type 'struct ceph::unique_leakable_ptr<ceph::buffer::v15_2_0::raw>'
  • error 19
  • /tmp/B.yrz327wa/BUILD/ceph-17.2.3/src/include/rados/buffer.h:203:30: error: invalid use of incomplete type 'struct ceph::unique_leakable_ptr<ceph::buffer::v15_2_0::raw>'
  • error 20
  • make[2]: *** [src/CMakeFiles/rados_snap_set_diff_obj.dir/build.make:79: src/CMakeFiles/rados_snap_set_diff_obj.dir/librados/snap_set_diff.cc.o] Error 1
  • error 21
  • make[1]: *** [CMakeFiles/Makefile2:2094: src/CMakeFiles/rados_snap_set_diff_obj.dir/all] Error 2
  • error 22
  • /tmp/B.yrz327wa/BUILD/ceph-17.2.3/src/common/dout.h:185:56: error: call to non-'constexpr' function 'ceph::dout::dynamic_marker_t<T> ceph::dout::need_dynamic(T&&) [with T = unsigned int]'
  • error 23
  • /tmp/B.yrz327wa/BUILD/ceph-17.2.3/src/common/dout.h:185:56: error: call to non-'constexpr' function 'ceph::dout::dynamic_marker_t<T> ceph::dout::need_dynamic(T&&) [with T = unsigned int]'
  • error 24
  • /tmp/B.yrz327wa/BUILD/ceph-17.2.3/src/common/dout.h:185:56: error: call to non-'constexpr' function 'ceph::dout::dynamic_marker_t<T> ceph::dout::need_dynamic(T&&) [with T = unsigned int]'
  • error 25
  • /tmp/B.yrz327wa/BUILD/ceph-17.2.3/src/common/dout.h:185:56: error: call to non-'constexpr' function 'ceph::dout::dynamic_marker_t<T> ceph::dout::need_dynamic(T&&) [with T = unsigned int]'
  • error 26
  • /tmp/B.yrz327wa/BUILD/ceph-17.2.3/src/common/dout.h:185:56: error: call to non-'constexpr' function 'ceph::dout::dynamic_marker_t<T> ceph::dout::need_dynamic(T&&) [with T = unsigned int]'
  • error 27
  • /tmp/B.yrz327wa/BUILD/ceph-17.2.3/src/common/dout.h:185:56: error: call to non-'constexpr' function 'ceph::dout::dynamic_marker_t<T> ceph::dout::need_dynamic(T&&) [with T = unsigned int]'
  • error 28
  • /tmp/B.yrz327wa/BUILD/ceph-17.2.3/src/common/dout.h:185:56: error: call to non-'constexpr' function 'ceph::dout::dynamic_marker_t<T> ceph::dout::need_dynamic(T&&) [with T = unsigned int]'
  • error 29
  • make[2]: *** [src/crush/CMakeFiles/crush_objs.dir/build.make:135: src/crush/CMakeFiles/crush_objs.dir/CrushWrapper.cc.o] Error 1
  • error 30
  • make[1]: *** [CMakeFiles/Makefile2:3031: src/crush/CMakeFiles/crush_objs.dir/all] Error 2
  • error 31
  • /tmp/B.yrz327wa/BUILD/ceph-17.2.3/src/common/dout.h:185:56: error: call to non-'constexpr' function 'ceph::dout::dynamic_marker_t<T> ceph::dout::need_dynamic(T&&) [with T = unsigned int]'
  • error 32
  • /tmp/B.yrz327wa/BUILD/ceph-17.2.3/src/common/dout.h:185:56: error: call to non-'constexpr' function 'ceph::dout::dynamic_marker_t<T> ceph::dout::need_dynamic(T&&) [with T = unsigned int]'
  • error 33
  • /tmp/B.yrz327wa/BUILD/ceph-17.2.3/src/common/dout.h:185:56: error: call to non-'constexpr' function 'ceph::dout::dynamic_marker_t<T> ceph::dout::need_dynamic(T&&) [with T = unsigned int]'
  • error 34
  • /tmp/B.yrz327wa/BUILD/ceph-17.2.3/src/common/dout.h:185:56: error: call to non-'constexpr' function 'ceph::dout::dynamic_marker_t<T> ceph::dout::need_dynamic(T&&) [with T = unsigned int]'
  • error 35
  • /tmp/B.yrz327wa/BUILD/ceph-17.2.3/src/common/dout.h:185:56: error: call to non-'constexpr' function 'ceph::dout::dynamic_marker_t<T> ceph::dout::need_dynamic(T&&) [with T = unsigned int]'
  • error 36
  • /tmp/B.yrz327wa/BUILD/ceph-17.2.3/src/common/dout.h:185:56: error: call to non-'constexpr' function 'ceph::dout::dynamic_marker_t<T> ceph::dout::need_dynamic(T&&) [with T = unsigned int]'
  • error 37
  • /tmp/B.yrz327wa/BUILD/ceph-17.2.3/src/common/dout.h:185:56: error: call to non-'constexpr' function 'ceph::dout::dynamic_marker_t<T> ceph::dout::need_dynamic(T&&) [with T = unsigned int]'
  • error 38
  • /tmp/B.yrz327wa/BUILD/ceph-17.2.3/src/msg/Message.cc:971:42: error: call to non-'constexpr' function 'ceph::dout::dynamic_marker_t<T> ceph::dout::need_dynamic(T&&) [with T = long long int&]'
  • error 39
  • make[2]: *** [src/msg/CMakeFiles/common-msg-objs.dir/build.make:93: src/msg/CMakeFiles/common-msg-objs.dir/Message.cc.o] Error 1
  • error 40
  • /tmp/B.yrz327wa/BUILD/ceph-17.2.3/src/common/dout.h:185:56: error: call to non-'constexpr' function 'ceph::dout::dynamic_marker_t<T> ceph::dout::need_dynamic(T&&) [with T = unsigned int]'
  • error 41
  • /tmp/B.yrz327wa/BUILD/ceph-17.2.3/src/common/dout.h:185:56: error: call to non-'constexpr' function 'ceph::dout::dynamic_marker_t<T> ceph::dout::need_dynamic(T&&) [with T = unsigned int]'
  • error 42
  • /tmp/B.yrz327wa/BUILD/ceph-17.2.3/src/common/dout.h:185:56: error: call to non-'constexpr' function 'ceph::dout::dynamic_marker_t<T> ceph::dout::need_dynamic(T&&) [with T = unsigned int]'
  • error 43
  • /tmp/B.yrz327wa/BUILD/ceph-17.2.3/src/common/dout.h:185:56: error: call to non-'constexpr' function 'ceph::dout::dynamic_marker_t<T> ceph::dout::need_dynamic(T&&) [with T = unsigned int]'
  • error 44
  • /tmp/B.yrz327wa/BUILD/ceph-17.2.3/src/common/dout.h:185:56: error: call to non-'constexpr' function 'ceph::dout::dynamic_marker_t<T> ceph::dout::need_dynamic(T&&) [with T = unsigned int]'
  • error 45
  • /tmp/B.yrz327wa/BUILD/ceph-17.2.3/src/common/dout.h:185:56: error: call to non-'constexpr' function 'ceph::dout::dynamic_marker_t<T> ceph::dout::need_dynamic(T&&) [with T = unsigned int]'
  • error 46
  • /tmp/B.yrz327wa/BUILD/ceph-17.2.3/src/common/dout.h:185:56: error: call to non-'constexpr' function 'ceph::dout::dynamic_marker_t<T> ceph::dout::need_dynamic(T&&) [with T = unsigned int]'
  • error 47
  • make[2]: *** [src/msg/CMakeFiles/common-msg-objs.dir/build.make:163: src/msg/CMakeFiles/common-msg-objs.dir/async/AsyncConnection.cc.o] Error 1
  • error 48
  • /tmp/B.yrz327wa/BUILD/ceph-17.2.3/src/common/dout.h:185:56: error: call to non-'constexpr' function 'ceph::dout::dynamic_marker_t<T> ceph::dout::need_dynamic(T&&) [with T = unsigned int]'
  • error 49
  • /tmp/B.yrz327wa/BUILD/ceph-17.2.3/src/common/dout.h:185:56: error: call to non-'constexpr' function 'ceph::dout::dynamic_marker_t<T> ceph::dout::need_dynamic(T&&) [with T = unsigned int]'
  • error 50
  • /tmp/B.yrz327wa/BUILD/ceph-17.2.3/src/common/dout.h:185:56: error: call to non-'constexpr' function 'ceph::dout::dynamic_marker_t<T> ceph::dout::need_dynamic(T&&) [with T = unsigned int]'
  • error 51
  • /tmp/B.yrz327wa/BUILD/ceph-17.2.3/src/common/dout.h:185:56: error: call to non-'constexpr' function 'ceph::dout::dynamic_marker_t<T> ceph::dout::need_dynamic(T&&) [with T = unsigned int]'
  • error 52
  • /tmp/B.yrz327wa/BUILD/ceph-17.2.3/src/common/dout.h:185:56: error: call to non-'constexpr' function 'ceph::dout::dynamic_marker_t<T> ceph::dout::need_dynamic(T&&) [with T = unsigned int]'
  • error 53
  • /tmp/B.yrz327wa/BUILD/ceph-17.2.3/src/common/dout.h:185:56: error: call to non-'constexpr' function 'ceph::dout::dynamic_marker_t<T> ceph::dout::need_dynamic(T&&) [with T = unsigned int]'
  • error 54
  • /tmp/B.yrz327wa/BUILD/ceph-17.2.3/src/common/dout.h:185:56: error: call to non-'constexpr' function 'ceph::dout::dynamic_marker_t<T> ceph::dout::need_dynamic(T&&) [with T = unsigned int]'
  • error 55
  • make[2]: *** [src/msg/CMakeFiles/common-msg-objs.dir/build.make:177: src/msg/CMakeFiles/common-msg-objs.dir/async/AsyncMessenger.cc.o] Error 1
  • error 56
  • make[1]: *** [CMakeFiles/Makefile2:3057: src/msg/CMakeFiles/common-msg-objs.dir/all] Error 2
  • error 57
  • error: Bad exit status from /tmp/B.yrz327wa/BUILD/tmp/rpm-tmp.WlZEtT (%build)
  • error 58
  • RPM build errors:
  • error 59
  • error: No files produced.

Content:

make[2]: Entering directory '/tmp/B.yrz327wa/BUILD/ceph-17.2.3/build'
[  2%] Building C object src/common/CMakeFiles/common_mountcephfs_objs.dir/safe_io.c.o
cd /tmp/B.yrz327wa/BUILD/ceph-17.2.3/build/src/common && /usr/bin/i686-pld-linux-gcc -DBOOST_ASIO_DISABLE_THREAD_KEYWORD_EXTENSION -DBOOST_ASIO_USE_TS_EXECUTOR_AS_DEFAULT -DHAVE_CONFIG_H -D_FILE_OFFSET_BITS=64 -D_FORTIFY_SOURCE=2 -D_GNU_SOURCE -D_REENTRANT -D_THREAD_SAFE -D__CEPH__ -D__STDC_FORMAT_MACROS -D__linux__ -I/tmp/B.yrz327wa/BUILD/ceph-17.2.3/build/src/include -I/tmp/B.yrz327wa/BUILD/ceph-17.2.3/src -isystem /tmp/B.yrz327wa/BUILD/ceph-17.2.3/build/include -isystem /tmp/B.yrz327wa/BUILD/ceph-17.2.3/src/xxHash -isystem /tmp/B.yrz327wa/BUILD/ceph-17.2.3/src/rapidjson/include -O2 -fwrapv -pipe -Wformat -Werror=format-security -gdwarf-4 -fno-debug-types-section -fvar-tracking-assignments -g2 -Wp,-D_FORTIFY_SOURCE=2 -fstack-protector-strong --param=ssp-buffer-size=4 -Werror=trampolines -fomit-frame-pointer -march=i686 -fasynchronous-unwind-tables -mtune=pentium4 -gdwarf-4 -fno-debug-types-section -fvar-tracking-assignments -g2  -DNDEBUG -DQT_NO_DEBUG -fPIC   -U_FORTIFY_SOURCE -Wall -fno-strict-aliasing -fsigned-char -Wtype-limits -Wignored-qualifiers -Wpointer-arith -Werror=format-security -Winit-self -Wno-unknown-pragmas -fstack-protector-strong -fdiagnostics-color=auto -std=gnu99 -MD -MT src/common/CMakeFiles/common_mountcephfs_objs.dir/safe_io.c.o -MF CMakeFiles/common_mountcephfs_objs.dir/safe_io.c.o.d -o CMakeFiles/common_mountcephfs_objs.dir/safe_io.c.o -c /tmp/B.yrz327wa/BUILD/ceph-17.2.3/src/common/safe_io.c
make[2]: Leaving directory '/tmp/B.yrz327wa/BUILD/ceph-17.2.3/build'
make[2]: Entering directory '/tmp/B.yrz327wa/BUILD/ceph-17.2.3/build'
cd /tmp/B.yrz327wa/BUILD/ceph-17.2.3/build && /usr/bin/cmake -E cmake_depends "Unix Makefiles" /tmp/B.yrz327wa/BUILD/ceph-17.2.3 /tmp/B.yrz327wa/BUILD/ceph-17.2.3/src/msg /tmp/B.yrz327wa/BUILD/ceph-17.2.3/build /tmp/B.yrz327wa/BUILD/ceph-17.2.3/build/src/msg /tmp/B.yrz327wa/BUILD/ceph-17.2.3/build/src/msg/CMakeFiles/common-msg-objs.dir/DependInfo.cmake --color=
make[2]: Leaving directory '/tmp/B.yrz327wa/BUILD/ceph-17.2.3/build'
/usr/bin/make  -f src/msg/CMakeFiles/common-msg-objs.dir/build.make src/msg/CMakeFiles/common-msg-objs.dir/build
make[2]: Entering directory '/tmp/B.yrz327wa/BUILD/ceph-17.2.3/build'
[  3%] Building C object src/common/CMakeFiles/common_mountcephfs_objs.dir/module.c.o
cd /tmp/B.yrz327wa/BUILD/ceph-17.2.3/build/src/common && /usr/bin/i686-pld-linux-gcc -DBOOST_ASIO_DISABLE_THREAD_KEYWORD_EXTENSION -DBOOST_ASIO_USE_TS_EXECUTOR_AS_DEFAULT -DHAVE_CONFIG_H -D_FILE_OFFSET_BITS=64 -D_FORTIFY_SOURCE=2 -D_GNU_SOURCE -D_REENTRANT -D_THREAD_SAFE -D__CEPH__ -D__STDC_FORMAT_MACROS -D__linux__ -I/tmp/B.yrz327wa/BUILD/ceph-17.2.3/build/src/include -I/tmp/B.yrz327wa/BUILD/ceph-17.2.3/src -isystem /tmp/B.yrz327wa/BUILD/ceph-17.2.3/build/include -isystem /tmp/B.yrz327wa/BUILD/ceph-17.2.3/src/xxHash -isystem /tmp/B.yrz327wa/BUILD/ceph-17.2.3/src/rapidjson/include -O2 -fwrapv -pipe -Wformat -Werror=format-security -gdwarf-4 -fno-debug-types-section -fvar-tracking-assignments -g2 -Wp,-D_FORTIFY_SOURCE=2 -fstack-protector-strong --param=ssp-buffer-size=4 -Werror=trampolines -fomit-frame-pointer -march=i686 -fasynchronous-unwind-tables -mtune=pentium4 -gdwarf-4 -fno-debug-types-section -fvar-tracking-assignments -g2  -DNDEBUG -DQT_NO_DEBUG -fPIC   -U_FORTIFY_SOURCE -Wall -fno-strict-aliasing -fsigned-char -Wtype-limits -Wignored-qualifiers -Wpointer-arith -Werror=format-security -Winit-self -Wno-unknown-pragmas -fstack-protector-strong -fdiagnostics-color=auto -std=gnu99 -MD -MT src/common/CMakeFiles/common_mountcephfs_objs.dir/module.c.o -MF CMakeFiles/common_mountcephfs_objs.dir/module.c.o.d -o CMakeFiles/common_mountcephfs_objs.dir/module.c.o -c /tmp/B.yrz327wa/BUILD/ceph-17.2.3/src/common/module.c
make[2]: Leaving directory '/tmp/B.yrz327wa/BUILD/ceph-17.2.3/build'
make[2]: Entering directory '/tmp/B.yrz327wa/BUILD/ceph-17.2.3/build'
[  3%] Building C object src/crush/CMakeFiles/crush_objs.dir/mapper.c.o
cd /tmp/B.yrz327wa/BUILD/ceph-17.2.3/build/src/crush && /usr/bin/i686-pld-linux-gcc -DBOOST_ASIO_DISABLE_THREAD_KEYWORD_EXTENSION -DBOOST_ASIO_USE_TS_EXECUTOR_AS_DEFAULT -DHAVE_CONFIG_H -D_FILE_OFFSET_BITS=64 -D_FORTIFY_SOURCE=2 -D_GNU_SOURCE -D_REENTRANT -D_THREAD_SAFE -D__CEPH__ -D__STDC_FORMAT_MACROS -D__linux__ -I/tmp/B.yrz327wa/BUILD/ceph-17.2.3/build/src/include -I/tmp/B.yrz327wa/BUILD/ceph-17.2.3/src -isystem /tmp/B.yrz327wa/BUILD/ceph-17.2.3/build/include -isystem /tmp/B.yrz327wa/BUILD/ceph-17.2.3/src/xxHash -isystem /tmp/B.yrz327wa/BUILD/ceph-17.2.3/src/rapidjson/include -O2 -fwrapv -pipe -Wformat -Werror=format-security -gdwarf-4 -fno-debug-types-section -fvar-tracking-assignments -g2 -Wp,-D_FORTIFY_SOURCE=2 -fstack-protector-strong --param=ssp-buffer-size=4 -Werror=trampolines -fomit-frame-pointer -march=i686 -fasynchronous-unwind-tables -mtune=pentium4 -gdwarf-4 -fno-debug-types-section -fvar-tracking-assignments -g2  -DNDEBUG -DQT_NO_DEBUG -fPIC   -U_FORTIFY_SOURCE -Wall -fno-strict-aliasing -fsigned-char -Wtype-limits -Wignored-qualifiers -Wpointer-arith -Werror=format-security -Winit-self -Wno-unknown-pragmas -fstack-protector-strong -fdiagnostics-color=auto -std=gnu99 -MD -MT src/crush/CMakeFiles/crush_objs.dir/mapper.c.o -MF CMakeFiles/crush_objs.dir/mapper.c.o.d -o CMakeFiles/crush_objs.dir/mapper.c.o -c /tmp/B.yrz327wa/BUILD/ceph-17.2.3/src/crush/mapper.c
make[2]: Leaving directory '/tmp/B.yrz327wa/BUILD/ceph-17.2.3/build'
make[2]: Entering directory '/tmp/B.yrz327wa/BUILD/ceph-17.2.3/build'
[  4%] Building C object src/common/CMakeFiles/common_mountcephfs_objs.dir/addr_parsing.c.o
cd /tmp/B.yrz327wa/BUILD/ceph-17.2.3/build/src/common && /usr/bin/i686-pld-linux-gcc -DBOOST_ASIO_DISABLE_THREAD_KEYWORD_EXTENSION -DBOOST_ASIO_USE_TS_EXECUTOR_AS_DEFAULT -DHAVE_CONFIG_H -D_FILE_OFFSET_BITS=64 -D_FORTIFY_SOURCE=2 -D_GNU_SOURCE -D_REENTRANT -D_THREAD_SAFE -D__CEPH__ -D__STDC_FORMAT_MACROS -D__linux__ -I/tmp/B.yrz327wa/BUILD/ceph-17.2.3/build/src/include -I/tmp/B.yrz327wa/BUILD/ceph-17.2.3/src -isystem /tmp/B.yrz327wa/BUILD/ceph-17.2.3/build/include -isystem /tmp/B.yrz327wa/BUILD/ceph-17.2.3/src/xxHash -isystem /tmp/B.yrz327wa/BUILD/ceph-17.2.3/src/rapidjson/include -O2 -fwrapv -pipe -Wformat -Werror=format-security -gdwarf-4 -fno-debug-types-section -fvar-tracking-assignments -g2 -Wp,-D_FORTIFY_SOURCE=2 -fstack-protector-strong --param=ssp-buffer-size=4 -Werror=trampolines -fomit-frame-pointer -march=i686 -fasynchronous-unwind-tables -mtune=pentium4 -gdwarf-4 -fno-debug-types-section -fvar-tracking-assignments -g2  -DNDEBUG -DQT_NO_DEBUG -fPIC   -U_FORTIFY_SOURCE -Wall -fno-strict-aliasing -fsigned-char -Wtype-limits -Wignored-qualifiers -Wpointer-arith -Werror=format-security -Winit-self -Wno-unknown-pragmas -fstack-protector-strong -fdiagnostics-color=auto -std=gnu99 -MD -MT src/common/CMakeFiles/common_mountcephfs_objs.dir/addr_parsing.c.o -MF CMakeFiles/common_mountcephfs_objs.dir/addr_parsing.c.o.d -o CMakeFiles/common_mountcephfs_objs.dir/addr_parsing.c.o -c /tmp/B.yrz327wa/BUILD/ceph-17.2.3/src/common/addr_parsing.c
make[2]: Leaving directory '/tmp/B.yrz327wa/BUILD/ceph-17.2.3/build'
make[1]: Entering directory '/tmp/B.yrz327wa/BUILD/ceph-17.2.3/build'
[  4%] Built target common_mountcephfs_objs
make[1]: Leaving directory '/tmp/B.yrz327wa/BUILD/ceph-17.2.3/build'
make[2]: Entering directory '/tmp/B.yrz327wa/BUILD/ceph-17.2.3/build'
[  3%] Building C object src/crush/CMakeFiles/crush_objs.dir/builder.c.o
cd /tmp/B.yrz327wa/BUILD/ceph-17.2.3/build/src/crush && /usr/bin/i686-pld-linux-gcc -DBOOST_ASIO_DISABLE_THREAD_KEYWORD_EXTENSION -DBOOST_ASIO_USE_TS_EXECUTOR_AS_DEFAULT -DHAVE_CONFIG_H -D_FILE_OFFSET_BITS=64 -D_FORTIFY_SOURCE=2 -D_GNU_SOURCE -D_REENTRANT -D_THREAD_SAFE -D__CEPH__ -D__STDC_FORMAT_MACROS -D__linux__ -I/tmp/B.yrz327wa/BUILD/ceph-17.2.3/build/src/include -I/tmp/B.yrz327wa/BUILD/ceph-17.2.3/src -isystem /tmp/B.yrz327wa/BUILD/ceph-17.2.3/build/include -isystem /tmp/B.yrz327wa/BUILD/ceph-17.2.3/src/xxHash -isystem /tmp/B.yrz327wa/BUILD/ceph-17.2.3/src/rapidjson/include -O2 -fwrapv -pipe -Wformat -Werror=format-security -gdwarf-4 -fno-debug-types-section -fvar-tracking-assignments -g2 -Wp,-D_FORTIFY_SOURCE=2 -fstack-protector-strong --param=ssp-buffer-size=4 -Werror=trampolines -fomit-frame-pointer -march=i686 -fasynchronous-unwind-tables -mtune=pentium4 -gdwarf-4 -fno-debug-types-section -fvar-tracking-assignments -g2  -DNDEBUG -DQT_NO_DEBUG -fPIC   -U_FORTIFY_SOURCE -Wall -fno-strict-aliasing -fsigned-char -Wtype-limits -Wignored-qualifiers -Wpointer-arith -Werror=format-security -Winit-self -Wno-unknown-pragmas -fstack-protector-strong -fdiagnostics-color=auto -std=gnu99 -MD -MT src/crush/CMakeFiles/crush_objs.dir/builder.c.o -MF CMakeFiles/crush_objs.dir/builder.c.o.d -o CMakeFiles/crush_objs.dir/builder.c.o -c /tmp/B.yrz327wa/BUILD/ceph-17.2.3/src/crush/builder.c
make[2]: Leaving directory '/tmp/B.yrz327wa/BUILD/ceph-17.2.3/build'
make[2]: Entering directory '/tmp/B.yrz327wa/BUILD/ceph-17.2.3/build'
[  0%] Building CXX object src/common/CMakeFiles/common_texttable_obj.dir/TextTable.cc.o
cd /tmp/B.yrz327wa/BUILD/ceph-17.2.3/build/src/common && /usr/bin/i686-pld-linux-g++ -DBOOST_ASIO_DISABLE_THREAD_KEYWORD_EXTENSION -DBOOST_ASIO_USE_TS_EXECUTOR_AS_DEFAULT -DHAVE_CONFIG_H -D_FILE_OFFSET_BITS=64 -D_FORTIFY_SOURCE=2 -D_GNU_SOURCE -D_REENTRANT -D_THREAD_SAFE -D__CEPH__ -D__STDC_FORMAT_MACROS -D__linux__ -I/tmp/B.yrz327wa/BUILD/ceph-17.2.3/build/src/include -I/tmp/B.yrz327wa/BUILD/ceph-17.2.3/src -isystem /tmp/B.yrz327wa/BUILD/ceph-17.2.3/build/include -isystem /tmp/B.yrz327wa/BUILD/ceph-17.2.3/src/xxHash -isystem /tmp/B.yrz327wa/BUILD/ceph-17.2.3/src/rapidjson/include -O2 -fwrapv -pipe -Wformat -Werror=format-security -gdwarf-4 -fno-debug-types-section -fvar-tracking-assignments -g2 -Wp,-D_FORTIFY_SOURCE=2 -fstack-protector-strong --param=ssp-buffer-size=4 -Werror=trampolines -fomit-frame-pointer -march=i686 -fasynchronous-unwind-tables -mtune=pentium4 -gdwarf-4 -fno-debug-types-section -fvar-tracking-assignments -g2  -DNDEBUG -DQT_NO_DEBUG -fPIC   -U_FORTIFY_SOURCE -Wall -fno-strict-aliasing -fsigned-char -Wtype-limits -Wignored-qualifiers -Wpointer-arith -Werror=format-security -Winit-self -Wno-unknown-pragmas -Wnon-virtual-dtor -Wno-ignored-qualifiers -ftemplate-depth-1024 -Wpessimizing-move -Wredundant-move -Wstrict-null-sentinel -Woverloaded-virtual -fno-new-ttp-matching -fstack-protector-strong -fdiagnostics-color=auto -fno-builtin-malloc -fno-builtin-calloc -fno-builtin-realloc -fno-builtin-free -std=c++17 -MD -MT src/common/CMakeFiles/common_texttable_obj.dir/TextTable.cc.o -MF CMakeFiles/common_texttable_obj.dir/TextTable.cc.o.d -o CMakeFiles/common_texttable_obj.dir/TextTable.cc.o -c /tmp/B.yrz327wa/BUILD/ceph-17.2.3/src/common/TextTable.cc
make[2]: Leaving directory '/tmp/B.yrz327wa/BUILD/ceph-17.2.3/build'
make[1]: Entering directory '/tmp/B.yrz327wa/BUILD/ceph-17.2.3/build'
[  4%] Built target common_texttable_obj
make[1]: Leaving directory '/tmp/B.yrz327wa/BUILD/ceph-17.2.3/build'
/usr/bin/make  -f src/erasure-code/CMakeFiles/erasure_code.dir/build.make src/erasure-code/CMakeFiles/erasure_code.dir/depend
make[2]: Entering directory '/tmp/B.yrz327wa/BUILD/ceph-17.2.3/build'
[  4%] Building C object src/crush/CMakeFiles/crush_objs.dir/crush.c.o
cd /tmp/B.yrz327wa/BUILD/ceph-17.2.3/build/src/crush && /usr/bin/i686-pld-linux-gcc -DBOOST_ASIO_DISABLE_THREAD_KEYWORD_EXTENSION -DBOOST_ASIO_USE_TS_EXECUTOR_AS_DEFAULT -DHAVE_CONFIG_H -D_FILE_OFFSET_BITS=64 -D_FORTIFY_SOURCE=2 -D_GNU_SOURCE -D_REENTRANT -D_THREAD_SAFE -D__CEPH__ -D__STDC_FORMAT_MACROS -D__linux__ -I/tmp/B.yrz327wa/BUILD/ceph-17.2.3/build/src/include -I/tmp/B.yrz327wa/BUILD/ceph-17.2.3/src -isystem /tmp/B.yrz327wa/BUILD/ceph-17.2.3/build/include -isystem /tmp/B.yrz327wa/BUILD/ceph-17.2.3/src/xxHash -isystem /tmp/B.yrz327wa/BUILD/ceph-17.2.3/src/rapidjson/include -O2 -fwrapv -pipe -Wformat -Werror=format-security -gdwarf-4 -fno-debug-types-section -fvar-tracking-assignments -g2 -Wp,-D_FORTIFY_SOURCE=2 -fstack-protector-strong --param=ssp-buffer-size=4 -Werror=trampolines -fomit-frame-pointer -march=i686 -fasynchronous-unwind-tables -mtune=pentium4 -gdwarf-4 -fno-debug-types-section -fvar-tracking-assignments -g2  -DNDEBUG -DQT_NO_DEBUG -fPIC   -U_FORTIFY_SOURCE -Wall -fno-strict-aliasing -fsigned-char -Wtype-limits -Wignored-qualifiers -Wpointer-arith -Werror=format-security -Winit-self -Wno-unknown-pragmas -fstack-protector-strong -fdiagnostics-color=auto -std=gnu99 -MD -MT src/crush/CMakeFiles/crush_objs.dir/crush.c.o -MF CMakeFiles/crush_objs.dir/crush.c.o.d -o CMakeFiles/crush_objs.dir/crush.c.o -c /tmp/B.yrz327wa/BUILD/ceph-17.2.3/src/crush/crush.c
make[2]: Leaving directory '/tmp/B.yrz327wa/BUILD/ceph-17.2.3/build'
make[2]: Entering directory '/tmp/B.yrz327wa/BUILD/ceph-17.2.3/build'
cd /tmp/B.yrz327wa/BUILD/ceph-17.2.3/build && /usr/bin/cmake -E cmake_depends "Unix Makefiles" /tmp/B.yrz327wa/BUILD/ceph-17.2.3 /tmp/B.yrz327wa/BUILD/ceph-17.2.3/src/erasure-code /tmp/B.yrz327wa/BUILD/ceph-17.2.3/build /tmp/B.yrz327wa/BUILD/ceph-17.2.3/build/src/erasure-code /tmp/B.yrz327wa/BUILD/ceph-17.2.3/build/src/erasure-code/CMakeFiles/erasure_code.dir/DependInfo.cmake --color=
make[2]: Leaving directory '/tmp/B.yrz327wa/BUILD/ceph-17.2.3/build'
/usr/bin/make  -f src/erasure-code/CMakeFiles/erasure_code.dir/build.make src/erasure-code/CMakeFiles/erasure_code.dir/build
make[2]: Entering directory '/tmp/B.yrz327wa/BUILD/ceph-17.2.3/build'
[  4%] Building C object src/crush/CMakeFiles/crush_objs.dir/hash.c.o
cd /tmp/B.yrz327wa/BUILD/ceph-17.2.3/build/src/crush && /usr/bin/i686-pld-linux-gcc -DBOOST_ASIO_DISABLE_THREAD_KEYWORD_EXTENSION -DBOOST_ASIO_USE_TS_EXECUTOR_AS_DEFAULT -DHAVE_CONFIG_H -D_FILE_OFFSET_BITS=64 -D_FORTIFY_SOURCE=2 -D_GNU_SOURCE -D_REENTRANT -D_THREAD_SAFE -D__CEPH__ -D__STDC_FORMAT_MACROS -D__linux__ -I/tmp/B.yrz327wa/BUILD/ceph-17.2.3/build/src/include -I/tmp/B.yrz327wa/BUILD/ceph-17.2.3/src -isystem /tmp/B.yrz327wa/BUILD/ceph-17.2.3/build/include -isystem /tmp/B.yrz327wa/BUILD/ceph-17.2.3/src/xxHash -isystem /tmp/B.yrz327wa/BUILD/ceph-17.2.3/src/rapidjson/include -O2 -fwrapv -pipe -Wformat -Werror=format-security -gdwarf-4 -fno-debug-types-section -fvar-tracking-assignments -g2 -Wp,-D_FORTIFY_SOURCE=2 -fstack-protector-strong --param=ssp-buffer-size=4 -Werror=trampolines -fomit-frame-pointer -march=i686 -fasynchronous-unwind-tables -mtune=pentium4 -gdwarf-4 -fno-debug-types-section -fvar-tracking-assignments -g2  -DNDEBUG -DQT_NO_DEBUG -fPIC   -U_FORTIFY_SOURCE -Wall -fno-strict-aliasing -fsigned-char -Wtype-limits -Wignored-qualifiers -Wpointer-arith -Werror=format-security -Winit-self -Wno-unknown-pragmas -fstack-protector-strong -fdiagnostics-color=auto -std=gnu99 -MD -MT src/crush/CMakeFiles/crush_objs.dir/hash.c.o -MF CMakeFiles/crush_objs.dir/hash.c.o.d -o CMakeFiles/crush_objs.dir/hash.c.o -c /tmp/B.yrz327wa/BUILD/ceph-17.2.3/src/crush/hash.c
make[2]: Leaving directory '/tmp/B.yrz327wa/BUILD/ceph-17.2.3/build'
make[2]: Entering directory '/tmp/B.yrz327wa/BUILD/ceph-17.2.3/build'
[  2%] Building CXX object src/compressor/CMakeFiles/compressor_objs.dir/QatAccel.cc.o
cd /tmp/B.yrz327wa/BUILD/ceph-17.2.3/build/src/compressor && /usr/bin/i686-pld-linux-g++ -DBOOST_ASIO_DISABLE_THREAD_KEYWORD_EXTENSION -DBOOST_ASIO_USE_TS_EXECUTOR_AS_DEFAULT -DHAVE_CONFIG_H -D_FILE_OFFSET_BITS=64 -D_FORTIFY_SOURCE=2 -D_GNU_SOURCE -D_REENTRANT -D_THREAD_SAFE -D__CEPH__ -D__STDC_FORMAT_MACROS -D__linux__ -I/tmp/B.yrz327wa/BUILD/ceph-17.2.3/build/src/include -I/tmp/B.yrz327wa/BUILD/ceph-17.2.3/src -isystem /tmp/B.yrz327wa/BUILD/ceph-17.2.3/build/include -isystem /tmp/B.yrz327wa/BUILD/ceph-17.2.3/src/xxHash -isystem /tmp/B.yrz327wa/BUILD/ceph-17.2.3/src/rapidjson/include -O2 -fwrapv -pipe -Wformat -Werror=format-security -gdwarf-4 -fno-debug-types-section -fvar-tracking-assignments -g2 -Wp,-D_FORTIFY_SOURCE=2 -fstack-protector-strong --param=ssp-buffer-size=4 -Werror=trampolines -fomit-frame-pointer -march=i686 -fasynchronous-unwind-tables -mtune=pentium4 -gdwarf-4 -fno-debug-types-section -fvar-tracking-assignments -g2  -DNDEBUG -DQT_NO_DEBUG -fPIC   -U_FORTIFY_SOURCE -Wall -fno-strict-aliasing -fsigned-char -Wtype-limits -Wignored-qualifiers -Wpointer-arith -Werror=format-security -Winit-self -Wno-unknown-pragmas -Wnon-virtual-dtor -Wno-ignored-qualifiers -ftemplate-depth-1024 -Wpessimizing-move -Wredundant-move -Wstrict-null-sentinel -Woverloaded-virtual -fno-new-ttp-matching -fstack-protector-strong -fdiagnostics-color=auto -fno-builtin-malloc -fno-builtin-calloc -fno-builtin-realloc -fno-builtin-free -std=c++17 -MD -MT src/compressor/CMakeFiles/compressor_objs.dir/QatAccel.cc.o -MF CMakeFiles/compressor_objs.dir/QatAccel.cc.o.d -o CMakeFiles/compressor_objs.dir/QatAccel.cc.o -c /tmp/B.yrz327wa/BUILD/ceph-17.2.3/src/compressor/QatAccel.cc
make[2]: Leaving directory '/tmp/B.yrz327wa/BUILD/ceph-17.2.3/build'
make[2]: Entering directory '/tmp/B.yrz327wa/BUILD/ceph-17.2.3/build'
[  4%] Building CXX object src/erasure-code/CMakeFiles/erasure_code.dir/ErasureCodePlugin.cc.o
cd /tmp/B.yrz327wa/BUILD/ceph-17.2.3/build/src/erasure-code && /usr/bin/i686-pld-linux-g++ -DBOOST_ASIO_DISABLE_THREAD_KEYWORD_EXTENSION -DBOOST_ASIO_USE_TS_EXECUTOR_AS_DEFAULT -DHAVE_CONFIG_H -D_FILE_OFFSET_BITS=64 -D_FORTIFY_SOURCE=2 -D_GNU_SOURCE -D_REENTRANT -D_THREAD_SAFE -D__CEPH__ -D__STDC_FORMAT_MACROS -D__linux__ -I/tmp/B.yrz327wa/BUILD/ceph-17.2.3/build/src/include -I/tmp/B.yrz327wa/BUILD/ceph-17.2.3/src -I/tmp/B.yrz327wa/BUILD/ceph-17.2.3/src/erasure-code/jerasure -isystem /tmp/B.yrz327wa/BUILD/ceph-17.2.3/build/include -isystem /tmp/B.yrz327wa/BUILD/ceph-17.2.3/src/xxHash -isystem /tmp/B.yrz327wa/BUILD/ceph-17.2.3/src/rapidjson/include -isystem /tmp/B.yrz327wa/BUILD/ceph-17.2.3/src/erasure-code/jerasure/jerasure/include -isystem /tmp/B.yrz327wa/BUILD/ceph-17.2.3/src/erasure-code/jerasure/gf-complete/include -O2 -fwrapv -pipe -Wformat -Werror=format-security -gdwarf-4 -fno-debug-types-section -fvar-tracking-assignments -g2 -Wp,-D_FORTIFY_SOURCE=2 -fstack-protector-strong --param=ssp-buffer-size=4 -Werror=trampolines -fomit-frame-pointer -march=i686 -fasynchronous-unwind-tables -mtune=pentium4 -gdwarf-4 -fno-debug-types-section -fvar-tracking-assignments -g2  -DNDEBUG -DQT_NO_DEBUG -fPIC   -U_FORTIFY_SOURCE -Wall -fno-strict-aliasing -fsigned-char -Wtype-limits -Wignored-qualifiers -Wpointer-arith -Werror=format-security -Winit-self -Wno-unknown-pragmas -Wnon-virtual-dtor -Wno-ignored-qualifiers -ftemplate-depth-1024 -Wpessimizing-move -Wredundant-move -Wstrict-null-sentinel -Woverloaded-virtual -fno-new-ttp-matching -fstack-protector-strong -fdiagnostics-color=auto -fno-builtin-malloc -fno-builtin-calloc -fno-builtin-realloc -fno-builtin-free -std=c++17 -MD -MT src/erasure-code/CMakeFiles/erasure_code.dir/ErasureCodePlugin.cc.o -MF CMakeFiles/erasure_code.dir/ErasureCodePlugin.cc.o.d -o CMakeFiles/erasure_code.dir/ErasureCodePlugin.cc.o -c /tmp/B.yrz327wa/BUILD/ceph-17.2.3/src/erasure-code/ErasureCodePlugin.cc
make[2]: Leaving directory '/tmp/B.yrz327wa/BUILD/ceph-17.2.3/build'
make[2]: Entering directory '/tmp/B.yrz327wa/BUILD/ceph-17.2.3/build'
[  4%] Linking CXX static library ../../lib/liberasure_code.a
cd /tmp/B.yrz327wa/BUILD/ceph-17.2.3/build/src/erasure-code && /usr/bin/cmake -P CMakeFiles/erasure_code.dir/cmake_clean_target.cmake
cd /tmp/B.yrz327wa/BUILD/ceph-17.2.3/build/src/erasure-code && /usr/bin/cmake -E cmake_link_script CMakeFiles/erasure_code.dir/link.txt --verbose=1
/usr/bin/ar qc ../../lib/liberasure_code.a CMakeFiles/erasure_code.dir/ErasureCodePlugin.cc.o
/usr/bin/ranlib ../../lib/liberasure_code.a
make[2]: Leaving directory '/tmp/B.yrz327wa/BUILD/ceph-17.2.3/build'
make[1]: Entering directory '/tmp/B.yrz327wa/BUILD/ceph-17.2.3/build'
[  4%] Built target erasure_code
make[1]: Leaving directory '/tmp/B.yrz327wa/BUILD/ceph-17.2.3/build'
/usr/bin/make  -f src/CMakeFiles/rados_snap_set_diff_obj.dir/build.make src/CMakeFiles/rados_snap_set_diff_obj.dir/depend
make[2]: Entering directory '/tmp/B.yrz327wa/BUILD/ceph-17.2.3/build'
cd /tmp/B.yrz327wa/BUILD/ceph-17.2.3/build && /usr/bin/cmake -E cmake_depends "Unix Makefiles" /tmp/B.yrz327wa/BUILD/ceph-17.2.3 /tmp/B.yrz327wa/BUILD/ceph-17.2.3/src /tmp/B.yrz327wa/BUILD/ceph-17.2.3/build /tmp/B.yrz327wa/BUILD/ceph-17.2.3/build/src /tmp/B.yrz327wa/BUILD/ceph-17.2.3/build/src/CMakeFiles/rados_snap_set_diff_obj.dir/DependInfo.cmake --color=
make[2]: Leaving directory '/tmp/B.yrz327wa/BUILD/ceph-17.2.3/build'
/usr/bin/make  -f src/CMakeFiles/rados_snap_set_diff_obj.dir/build.make src/CMakeFiles/rados_snap_set_diff_obj.dir/build
make[2]: Entering directory '/tmp/B.yrz327wa/BUILD/ceph-17.2.3/build'
[  1%] Building CXX object src/common/options/CMakeFiles/common-options-objs.dir/build_options.cc.o
cd /tmp/B.yrz327wa/BUILD/ceph-17.2.3/build/src/common/options && /usr/bin/i686-pld-linux-g++ -DBOOST_ASIO_DISABLE_THREAD_KEYWORD_EXTENSION -DBOOST_ASIO_USE_TS_EXECUTOR_AS_DEFAULT -DHAVE_CONFIG_H -D_FILE_OFFSET_BITS=64 -D_FORTIFY_SOURCE=2 -D_GNU_SOURCE -D_REENTRANT -D_THREAD_SAFE -D__CEPH__ -D__STDC_FORMAT_MACROS -D__linux__ -I/tmp/B.yrz327wa/BUILD/ceph-17.2.3/build/src/include -I/tmp/B.yrz327wa/BUILD/ceph-17.2.3/src -isystem /tmp/B.yrz327wa/BUILD/ceph-17.2.3/build/include -isystem /tmp/B.yrz327wa/BUILD/ceph-17.2.3/src/xxHash -isystem /tmp/B.yrz327wa/BUILD/ceph-17.2.3/src/rapidjson/include -O2 -fwrapv -pipe -Wformat -Werror=format-security -gdwarf-4 -fno-debug-types-section -fvar-tracking-assignments -g2 -Wp,-D_FORTIFY_SOURCE=2 -fstack-protector-strong --param=ssp-buffer-size=4 -Werror=trampolines -fomit-frame-pointer -march=i686 -fasynchronous-unwind-tables -mtune=pentium4 -gdwarf-4 -fno-debug-types-section -fvar-tracking-assignments -g2  -DNDEBUG -DQT_NO_DEBUG -fPIC   -U_FORTIFY_SOURCE -Wall -fno-strict-aliasing -fsigned-char -Wtype-limits -Wignored-qualifiers -Wpointer-arith -Werror=format-security -Winit-self -Wno-unknown-pragmas -Wnon-virtual-dtor -Wno-ignored-qualifiers -ftemplate-depth-1024 -Wpessimizing-move -Wredundant-move -Wstrict-null-sentinel -Woverloaded-virtual -fno-new-ttp-matching -fstack-protector-strong -fdiagnostics-color=auto -fno-builtin-malloc -fno-builtin-calloc -fno-builtin-realloc -fno-builtin-free -std=c++17 -MD -MT src/common/options/CMakeFiles/common-options-objs.dir/build_options.cc.o -MF CMakeFiles/common-options-objs.dir/build_options.cc.o.d -o CMakeFiles/common-options-objs.dir/build_options.cc.o -c /tmp/B.yrz327wa/BUILD/ceph-17.2.3/src/common/options/build_options.cc
make[2]: Leaving directory '/tmp/B.yrz327wa/BUILD/ceph-17.2.3/build'
make[2]: Entering directory '/tmp/B.yrz327wa/BUILD/ceph-17.2.3/build'
[  0%] Building CXX object src/common/CMakeFiles/common_buffer_obj.dir/buffer.cc.o
cd /tmp/B.yrz327wa/BUILD/ceph-17.2.3/build/src/common && /usr/bin/i686-pld-linux-g++ -DBOOST_ASIO_DISABLE_THREAD_KEYWORD_EXTENSION -DBOOST_ASIO_USE_TS_EXECUTOR_AS_DEFAULT -DHAVE_CONFIG_H -D_FILE_OFFSET_BITS=64 -D_FORTIFY_SOURCE=2 -D_GNU_SOURCE -D_REENTRANT -D_THREAD_SAFE -D__CEPH__ -D__STDC_FORMAT_MACROS -D__linux__ -I/tmp/B.yrz327wa/BUILD/ceph-17.2.3/build/src/include -I/tmp/B.yrz327wa/BUILD/ceph-17.2.3/src -isystem /tmp/B.yrz327wa/BUILD/ceph-17.2.3/build/include -isystem /tmp/B.yrz327wa/BUILD/ceph-17.2.3/src/xxHash -isystem /tmp/B.yrz327wa/BUILD/ceph-17.2.3/src/rapidjson/include -O2 -fwrapv -pipe -Wformat -Werror=format-security -gdwarf-4 -fno-debug-types-section -fvar-tracking-assignments -g2 -Wp,-D_FORTIFY_SOURCE=2 -fstack-protector-strong --param=ssp-buffer-size=4 -Werror=trampolines -fomit-frame-pointer -march=i686 -fasynchronous-unwind-tables -mtune=pentium4 -gdwarf-4 -fno-debug-types-section -fvar-tracking-assignments -g2  -DNDEBUG -DQT_NO_DEBUG -fPIC   -U_FORTIFY_SOURCE -Wall -fno-strict-aliasing -fsigned-char -Wtype-limits -Wignored-qualifiers -Wpointer-arith -Werror=format-security -Winit-self -Wno-unknown-pragmas -Wnon-virtual-dtor -Wno-ignored-qualifiers -ftemplate-depth-1024 -Wpessimizing-move -Wredundant-move -Wstrict-null-sentinel -Woverloaded-virtual -fno-new-ttp-matching -fstack-protector-strong -fdiagnostics-color=auto -fno-builtin-malloc -fno-builtin-calloc -fno-builtin-realloc -fno-builtin-free -std=c++17 -MD -MT src/common/CMakeFiles/common_buffer_obj.dir/buffer.cc.o -MF CMakeFiles/common_buffer_obj.dir/buffer.cc.o.d -o CMakeFiles/common_buffer_obj.dir/buffer.cc.o -c /tmp/B.yrz327wa/BUILD/ceph-17.2.3/src/common/buffer.cc
make[2]: Leaving directory '/tmp/B.yrz327wa/BUILD/ceph-17.2.3/build'
make[1]: Entering directory '/tmp/B.yrz327wa/BUILD/ceph-17.2.3/build'
[  5%] Built target common_buffer_obj
make[1]: Leaving directory '/tmp/B.yrz327wa/BUILD/ceph-17.2.3/build'
/usr/bin/make  -f src/cls/CMakeFiles/cls_lock_client.dir/build.make src/cls/CMakeFiles/cls_lock_client.dir/depend
make[2]: Entering directory '/tmp/B.yrz327wa/BUILD/ceph-17.2.3/build'
cd /tmp/B.yrz327wa/BUILD/ceph-17.2.3/build && /usr/bin/cmake -E cmake_depends "Unix Makefiles" /tmp/B.yrz327wa/BUILD/ceph-17.2.3 /tmp/B.yrz327wa/BUILD/ceph-17.2.3/src/cls /tmp/B.yrz327wa/BUILD/ceph-17.2.3/build /tmp/B.yrz327wa/BUILD/ceph-17.2.3/build/src/cls /tmp/B.yrz327wa/BUILD/ceph-17.2.3/build/src/cls/CMakeFiles/cls_lock_client.dir/DependInfo.cmake --color=
make[2]: Leaving directory '/tmp/B.yrz327wa/BUILD/ceph-17.2.3/build'
/usr/bin/make  -f src/cls/CMakeFiles/cls_lock_client.dir/build.make src/cls/CMakeFiles/cls_lock_client.dir/build
make[2]: Entering directory '/tmp/B.yrz327wa/BUILD/ceph-17.2.3/build'
[  0%] Building CXX object src/compressor/CMakeFiles/compressor_objs.dir/Compressor.cc.o
cd /tmp/B.yrz327wa/BUILD/ceph-17.2.3/build/src/compressor && /usr/bin/i686-pld-linux-g++ -DBOOST_ASIO_DISABLE_THREAD_KEYWORD_EXTENSION -DBOOST_ASIO_USE_TS_EXECUTOR_AS_DEFAULT -DHAVE_CONFIG_H -D_FILE_OFFSET_BITS=64 -D_FORTIFY_SOURCE=2 -D_GNU_SOURCE -D_REENTRANT -D_THREAD_SAFE -D__CEPH__ -D__STDC_FORMAT_MACROS -D__linux__ -I/tmp/B.yrz327wa/BUILD/ceph-17.2.3/build/src/include -I/tmp/B.yrz327wa/BUILD/ceph-17.2.3/src -isystem /tmp/B.yrz327wa/BUILD/ceph-17.2.3/build/include -isystem /tmp/B.yrz327wa/BUILD/ceph-17.2.3/src/xxHash -isystem /tmp/B.yrz327wa/BUILD/ceph-17.2.3/src/rapidjson/include -O2 -fwrapv -pipe -Wformat -Werror=format-security -gdwarf-4 -fno-debug-types-section -fvar-tracking-assignments -g2 -Wp,-D_FORTIFY_SOURCE=2 -fstack-protector-strong --param=ssp-buffer-size=4 -Werror=trampolines -fomit-frame-pointer -march=i686 -fasynchronous-unwind-tables -mtune=pentium4 -gdwarf-4 -fno-debug-types-section -fvar-tracking-assignments -g2  -DNDEBUG -DQT_NO_DEBUG -fPIC   -U_FORTIFY_SOURCE -Wall -fno-strict-aliasing -fsigned-char -Wtype-limits -Wignored-qualifiers -Wpointer-arith -Werror=format-security -Winit-self -Wno-unknown-pragmas -Wnon-virtual-dtor -Wno-ignored-qualifiers -ftemplate-depth-1024 -Wpessimizing-move -Wredundant-move -Wstrict-null-sentinel -Woverloaded-virtual -fno-new-ttp-matching -fstack-protector-strong -fdiagnostics-color=auto -fno-builtin-malloc -fno-builtin-calloc -fno-builtin-realloc -fno-builtin-free -std=c++17 -MD -MT src/compressor/CMakeFiles/compressor_objs.dir/Compressor.cc.o -MF CMakeFiles/compressor_objs.dir/Compressor.cc.o.d -o CMakeFiles/compressor_objs.dir/Compressor.cc.o -c /tmp/B.yrz327wa/BUILD/ceph-17.2.3/src/compressor/Compressor.cc
make[2]: Leaving directory '/tmp/B.yrz327wa/BUILD/ceph-17.2.3/build'
make[1]: Entering directory '/tmp/B.yrz327wa/BUILD/ceph-17.2.3/build'
[  5%] Built target compressor_objs
make[1]: Leaving directory '/tmp/B.yrz327wa/BUILD/ceph-17.2.3/build'
make[2]: Entering directory '/tmp/B.yrz327wa/BUILD/ceph-17.2.3/build'
[  4%] Building CXX object src/CMakeFiles/rados_snap_set_diff_obj.dir/librados/snap_set_diff.cc.o
cd /tmp/B.yrz327wa/BUILD/ceph-17.2.3/build/src && /usr/bin/i686-pld-linux-g++ -DBOOST_ASIO_DISABLE_THREAD_KEYWORD_EXTENSION -DBOOST_ASIO_USE_TS_EXECUTOR_AS_DEFAULT -DHAVE_CONFIG_H -D_FILE_OFFSET_BITS=64 -D_FORTIFY_SOURCE=2 -D_GNU_SOURCE -D_REENTRANT -D_THREAD_SAFE -D__CEPH__ -D__STDC_FORMAT_MACROS -D__linux__ -I/tmp/B.yrz327wa/BUILD/ceph-17.2.3/build/src/include -I/tmp/B.yrz327wa/BUILD/ceph-17.2.3/src -isystem /tmp/B.yrz327wa/BUILD/ceph-17.2.3/build/include -isystem /tmp/B.yrz327wa/BUILD/ceph-17.2.3/src/xxHash -isystem /tmp/B.yrz327wa/BUILD/ceph-17.2.3/src/rapidjson/include -O2 -fwrapv -pipe -Wformat -Werror=format-security -gdwarf-4 -fno-debug-types-section -fvar-tracking-assignments -g2 -Wp,-D_FORTIFY_SOURCE=2 -fstack-protector-strong --param=ssp-buffer-size=4 -Werror=trampolines -fomit-frame-pointer -march=i686 -fasynchronous-unwind-tables -mtune=pentium4 -gdwarf-4 -fno-debug-types-section -fvar-tracking-assignments -g2  -DNDEBUG -DQT_NO_DEBUG -fPIC   -U_FORTIFY_SOURCE -Wall -fno-strict-aliasing -fsigned-char -Wtype-limits -Wignored-qualifiers -Wpointer-arith -Werror=format-security -Winit-self -Wno-unknown-pragmas -Wnon-virtual-dtor -Wno-ignored-qualifiers -ftemplate-depth-1024 -Wpessimizing-move -Wredundant-move -Wstrict-null-sentinel -Woverloaded-virtual -fno-new-ttp-matching -fstack-protector-strong -fdiagnostics-color=auto -fno-builtin-malloc -fno-builtin-calloc -fno-builtin-realloc -fno-builtin-free -std=c++17 -MD -MT src/CMakeFiles/rados_snap_set_diff_obj.dir/librados/snap_set_diff.cc.o -MF CMakeFiles/rados_snap_set_diff_obj.dir/librados/snap_set_diff.cc.o.d -o CMakeFiles/rados_snap_set_diff_obj.dir/librados/snap_set_diff.cc.o -c /tmp/B.yrz327wa/BUILD/ceph-17.2.3/src/librados/snap_set_diff.cc
In file included from /tmp/B.yrz327wa/BUILD/ceph-17.2.3/src/include/rados/rados_types.hpp:10,
                 from /tmp/B.yrz327wa/BUILD/ceph-17.2.3/src/librados/snap_set_diff.h:8,
                 from /tmp/B.yrz327wa/BUILD/ceph-17.2.3/src/librados/snap_set_diff.cc:6:
/tmp/B.yrz327wa/BUILD/ceph-17.2.3/src/include/rados/buffer.h:98:52: error: expected template-name before '<' token
   98 | struct unique_leakable_ptr : public std::unique_ptr<T, ceph::nop_delete<T>> {
      |                                                    ^
/tmp/B.yrz327wa/BUILD/ceph-17.2.3/src/include/rados/buffer.h:98:52: error: expected '{' before '<' token
/tmp/B.yrz327wa/BUILD/ceph-17.2.3/src/include/rados/buffer.h:374:17: error: 'unique_ptr' in namespace 'std' does not name a template type
  374 |     static std::unique_ptr<ptr_node, disposer>
      |                 ^~~~~~~~~~
/tmp/B.yrz327wa/BUILD/ceph-17.2.3/src/include/rados/buffer.h:65:1: note: 'std::unique_ptr' is defined in header '<memory>'; did you forget to '#include <memory>'?
   64 | #include "inline_memory.h"
  +++ |+#include <memory>
   65 | 
/tmp/B.yrz327wa/BUILD/ceph-17.2.3/src/include/rados/buffer.h:378:17: error: 'unique_ptr' in namespace 'std' does not name a template type
  378 |     static std::unique_ptr<ptr_node, disposer>
      |                 ^~~~~~~~~~
/tmp/B.yrz327wa/BUILD/ceph-17.2.3/src/include/rados/buffer.h:378:12: note: 'std::unique_ptr' is defined in header '<memory>'; did you forget to '#include <memory>'?
  378 |     static std::unique_ptr<ptr_node, disposer>
      |            ^~~
/tmp/B.yrz327wa/BUILD/ceph-17.2.3/src/include/rados/buffer.h:383:17: error: 'unique_ptr' in namespace 'std' does not name a template type
  383 |     static std::unique_ptr<ptr_node, disposer>
      |                 ^~~~~~~~~~
/tmp/B.yrz327wa/BUILD/ceph-17.2.3/src/include/rados/buffer.h:383:12: note: 'std::unique_ptr' is defined in header '<memory>'; did you forget to '#include <memory>'?
  383 |     static std::unique_ptr<ptr_node, disposer>
      |            ^~~
/tmp/B.yrz327wa/BUILD/ceph-17.2.3/src/include/rados/buffer.h:407:17: error: 'unique_ptr' in namespace 'std' does not name a template type
  407 |     static std::unique_ptr<ptr_node, disposer> create_hypercombined(
      |                 ^~~~~~~~~~
/tmp/B.yrz327wa/BUILD/ceph-17.2.3/src/include/rados/buffer.h:407:12: note: 'std::unique_ptr' is defined in header '<memory>'; did you forget to '#include <memory>'?
  407 |     static std::unique_ptr<ptr_node, disposer> create_hypercombined(
      |            ^~~
/tmp/B.yrz327wa/BUILD/ceph-17.2.3/src/include/rados/buffer.h:1050:20: error: 'std::unique_ptr' has not been declared
 1050 |     void push_back(std::unique_ptr<ptr_node, ptr_node::disposer> bp) {
      |                    ^~~
/tmp/B.yrz327wa/BUILD/ceph-17.2.3/src/include/rados/buffer.h:1050:35: error: expected ',' or '...' before '<' token
 1050 |     void push_back(std::unique_ptr<ptr_node, ptr_node::disposer> bp) {
      |                                   ^
/tmp/B.yrz327wa/BUILD/ceph-17.2.3/src/include/rados/buffer.h:1069:18: error: 'std::unique_ptr' has not been declared
 1069 |     void rebuild(std::unique_ptr<ptr_node, ptr_node::disposer> nb);
      |                  ^~~
/tmp/B.yrz327wa/BUILD/ceph-17.2.3/src/include/rados/buffer.h:1069:33: error: expected ',' or '...' before '<' token
 1069 |     void rebuild(std::unique_ptr<ptr_node, ptr_node::disposer> nb);
      |                                 ^
/tmp/B.yrz327wa/BUILD/ceph-17.2.3/src/include/rados/buffer.h: In member function 'void ceph::buffer::v15_2_0::list::push_back(const ceph::buffer::v15_2_0::ptr&)':
/tmp/B.yrz327wa/BUILD/ceph-17.2.3/src/include/rados/buffer.h:1035:37: error: 'create' is not a member of 'ceph::buffer::v15_2_0::ptr_node'
 1035 |       _buffers.push_back(*ptr_node::create(bp).release());
      |                                     ^~~~~~
/tmp/B.yrz327wa/BUILD/ceph-17.2.3/src/include/rados/buffer.h: In member function 'void ceph::buffer::v15_2_0::list::push_back(ceph::buffer::v15_2_0::ptr&&)':
/tmp/B.yrz327wa/BUILD/ceph-17.2.3/src/include/rados/buffer.h:1044:37: error: 'create' is not a member of 'ceph::buffer::v15_2_0::ptr_node'
 1044 |       _buffers.push_back(*ptr_node::create(std::move(bp)).release());
      |                                     ^~~~~~
/tmp/B.yrz327wa/BUILD/ceph-17.2.3/src/include/rados/buffer.h: In member function 'void ceph::buffer::v15_2_0::list::push_back(int)':
/tmp/B.yrz327wa/BUILD/ceph-17.2.3/src/include/rados/buffer.h:1051:19: error: 'bp' was not declared in this scope
 1051 |       _carriage = bp.get();
      |                   ^~
/tmp/B.yrz327wa/BUILD/ceph-17.2.3/src/include/rados/buffer.h: At global scope:
/tmp/B.yrz327wa/BUILD/ceph-17.2.3/src/include/rados/buffer.h:1057:51: error: 'r' has incomplete type
 1057 |     void push_back(ceph::unique_leakable_ptr<raw> r) {
      |                    ~~~~~~~~~~~~~~~~~~~~~~~~~~~~~~~^
/tmp/B.yrz327wa/BUILD/ceph-17.2.3/src/include/rados/buffer.h:98:8: note: declaration of 'struct ceph::unique_leakable_ptr<ceph::buffer::v15_2_0::raw>'
   98 | struct unique_leakable_ptr : public std::unique_ptr<T, ceph::nop_delete<T>> {
      |        ^~~~~~~~~~~~~~~~~~~
/tmp/B.yrz327wa/BUILD/ceph-17.2.3/src/include/rados/buffer.h: In member function 'void ceph::buffer::v15_2_0::list::push_back(ceph::unique_leakable_ptr<ceph::buffer::v15_2_0::raw>)':
/tmp/B.yrz327wa/BUILD/ceph-17.2.3/src/include/rados/buffer.h:1058:37: error: 'create' is not a member of 'ceph::buffer::v15_2_0::ptr_node'
 1058 |       _buffers.push_back(*ptr_node::create(std::move(r)).release());
      |                                     ^~~~~~
/tmp/B.yrz327wa/BUILD/ceph-17.2.3/src/include/rados/buffer.h: In member function 'void ceph::buffer::v15_2_0::list::share(const ceph::buffer::v15_2_0::list&)':
/tmp/B.yrz327wa/BUILD/ceph-17.2.3/src/include/rados/buffer.h:1094:41: error: 'create' is not a member of 'ceph::buffer::v15_2_0::ptr_node'
 1094 |           _buffers.push_back(*ptr_node::create(bp).release());
      |                                         ^~~~~~
In file included from /tmp/B.yrz327wa/BUILD/ceph-17.2.3/src/include/encoding.h:41,
                 from /tmp/B.yrz327wa/BUILD/ceph-17.2.3/src/include/interval_set.h:23,
                 from /tmp/B.yrz327wa/BUILD/ceph-17.2.3/src/librados/snap_set_diff.h:9:
/tmp/B.yrz327wa/BUILD/ceph-17.2.3/src/include/denc.h: In static member function 'static void denc_traits<ceph::buffer::v15_2_0::ptr>::decode(ceph::buffer::v15_2_0::ptr&, ceph::buffer::v15_2_0::list::const_iterator&)':
/tmp/B.yrz327wa/BUILD/ceph-17.2.3/src/include/denc.h:823:31: error: invalid use of incomplete type 'struct ceph::unique_leakable_ptr<ceph::buffer::v15_2_0::raw>'
  823 |         v = ceph::buffer::copy(s.c_str(), s.length());
      |             ~~~~~~~~~~~~~~~~~~^~~~~~~~~~~~~~~~~~~~~~~
/tmp/B.yrz327wa/BUILD/ceph-17.2.3/src/include/rados/buffer.h:98:8: note: declaration of 'struct ceph::unique_leakable_ptr<ceph::buffer::v15_2_0::raw>'
   98 | struct unique_leakable_ptr : public std::unique_ptr<T, ceph::nop_delete<T>> {
      |        ^~~~~~~~~~~~~~~~~~~
/tmp/B.yrz327wa/BUILD/ceph-17.2.3/src/include/encoding.h: In function 'void ceph::decode(buffer::v15_2_0::ptr&, buffer::v15_2_0::list::const_iterator&)':
/tmp/B.yrz327wa/BUILD/ceph-17.2.3/src/include/encoding.h:273:24: error: invalid use of incomplete type 'struct ceph::unique_leakable_ptr<ceph::buffer::v15_2_0::raw>'
  273 |       bp = buffer::copy(s.c_str(), s.length());
      |            ~~~~~~~~~~~~^~~~~~~~~~~~~~~~~~~~~~~
/tmp/B.yrz327wa/BUILD/ceph-17.2.3/src/include/rados/buffer.h:98:8: note: declaration of 'struct ceph::unique_leakable_ptr<ceph::buffer::v15_2_0::raw>'
   98 | struct unique_leakable_ptr : public std::unique_ptr<T, ceph::nop_delete<T>> {
      |        ^~~~~~~~~~~~~~~~~~~
In file included from /tmp/B.yrz327wa/BUILD/ceph-17.2.3/src/librados/snap_set_diff.cc:8:
/tmp/B.yrz327wa/BUILD/ceph-17.2.3/src/include/rados/librados.hpp: At global scope:
/tmp/B.yrz327wa/BUILD/ceph-17.2.3/src/include/rados/librados.hpp:107:54: warning: 'template<class _Category, class _Tp, class _Distance, class _Pointer, class _Reference> struct std::iterator' is deprecated [-Wdeprecated-declarations]
  107 |   class CEPH_RADOS_API NObjectIterator : public std::iterator <std::forward_iterator_tag, ListObject> {
      |                                                      ^~~~~~~~
In file included from /usr/include/c++/12.2.0/bits/stl_algobase.h:65,
                 from /usr/include/c++/12.2.0/vector:60,
                 from /tmp/B.yrz327wa/BUILD/ceph-17.2.3/src/librados/snap_set_diff.cc:4:
/usr/include/c++/12.2.0/bits/stl_iterator_base_types.h:127:34: note: declared here
  127 |     struct _GLIBCXX17_DEPRECATED iterator
      |                                  ^~~~~~~~
/tmp/B.yrz327wa/BUILD/ceph-17.2.3/src/include/rados/buffer.h: In instantiation of 'ceph::buffer::v15_2_0::ptr ceph::buffer::v15_2_0::ptr::iterator_impl<is_const>::get_ptr(size_t) [with bool is_const = true; size_t = unsigned int]':
/tmp/B.yrz327wa/BUILD/ceph-17.2.3/src/include/denc.h:849:26:   required from here
/tmp/B.yrz327wa/BUILD/ceph-17.2.3/src/include/rados/buffer.h:203:30: error: invalid use of incomplete type 'struct ceph::unique_leakable_ptr<ceph::buffer::v15_2_0::raw>'
  203 |           return buffer::copy(get_pos_add(len), len);
      |                  ~~~~~~~~~~~~^~~~~~~~~~~~~~~~~~~~~~~
/tmp/B.yrz327wa/BUILD/ceph-17.2.3/src/include/rados/buffer.h:98:8: note: declaration of 'struct ceph::unique_leakable_ptr<ceph::buffer::v15_2_0::raw>'
   98 | struct unique_leakable_ptr : public std::unique_ptr<T, ceph::nop_delete<T>> {
      |        ^~~~~~~~~~~~~~~~~~~
make[2]: *** [src/CMakeFiles/rados_snap_set_diff_obj.dir/build.make:79: src/CMakeFiles/rados_snap_set_diff_obj.dir/librados/snap_set_diff.cc.o] Error 1
make[2]: Leaving directory '/tmp/B.yrz327wa/BUILD/ceph-17.2.3/build'
make[1]: *** [CMakeFiles/Makefile2:2094: src/CMakeFiles/rados_snap_set_diff_obj.dir/all] Error 2
make[1]: *** Waiting for unfinished jobs....
make[2]: Entering directory '/tmp/B.yrz327wa/BUILD/ceph-17.2.3/build'
[  3%] Building CXX object src/msg/CMakeFiles/common-msg-objs.dir/DispatchQueue.cc.o
cd /tmp/B.yrz327wa/BUILD/ceph-17.2.3/build/src/msg && /usr/bin/i686-pld-linux-g++ -DBOOST_ASIO_DISABLE_THREAD_KEYWORD_EXTENSION -DBOOST_ASIO_USE_TS_EXECUTOR_AS_DEFAULT -DHAVE_CONFIG_H -D_FILE_OFFSET_BITS=64 -D_FORTIFY_SOURCE=2 -D_GNU_SOURCE -D_REENTRANT -D_THREAD_SAFE -D__CEPH__ -D__STDC_FORMAT_MACROS -D__linux__ -I/tmp/B.yrz327wa/BUILD/ceph-17.2.3/build/src/include -I/tmp/B.yrz327wa/BUILD/ceph-17.2.3/src -isystem /tmp/B.yrz327wa/BUILD/ceph-17.2.3/build/include -isystem /tmp/B.yrz327wa/BUILD/ceph-17.2.3/src/xxHash -isystem /tmp/B.yrz327wa/BUILD/ceph-17.2.3/src/rapidjson/include -O2 -fwrapv -pipe -Wformat -Werror=format-security -gdwarf-4 -fno-debug-types-section -fvar-tracking-assignments -g2 -Wp,-D_FORTIFY_SOURCE=2 -fstack-protector-strong --param=ssp-buffer-size=4 -Werror=trampolines -fomit-frame-pointer -march=i686 -fasynchronous-unwind-tables -mtune=pentium4 -gdwarf-4 -fno-debug-types-section -fvar-tracking-assignments -g2  -DNDEBUG -DQT_NO_DEBUG -fPIC   -U_FORTIFY_SOURCE -Wall -fno-strict-aliasing -fsigned-char -Wtype-limits -Wignored-qualifiers -Wpointer-arith -Werror=format-security -Winit-self -Wno-unknown-pragmas -Wnon-virtual-dtor -Wno-ignored-qualifiers -ftemplate-depth-1024 -Wpessimizing-move -Wredundant-move -Wstrict-null-sentinel -Woverloaded-virtual -fno-new-ttp-matching -fstack-protector-strong -fdiagnostics-color=auto -fno-builtin-malloc -fno-builtin-calloc -fno-builtin-realloc -fno-builtin-free -std=c++17 -MD -MT src/msg/CMakeFiles/common-msg-objs.dir/DispatchQueue.cc.o -MF CMakeFiles/common-msg-objs.dir/DispatchQueue.cc.o.d -o CMakeFiles/common-msg-objs.dir/DispatchQueue.cc.o -c /tmp/B.yrz327wa/BUILD/ceph-17.2.3/src/msg/DispatchQueue.cc
make[2]: Leaving directory '/tmp/B.yrz327wa/BUILD/ceph-17.2.3/build'
make[2]: Entering directory '/tmp/B.yrz327wa/BUILD/ceph-17.2.3/build'
[  4%] Building CXX object src/msg/CMakeFiles/common-msg-objs.dir/Messenger.cc.o
cd /tmp/B.yrz327wa/BUILD/ceph-17.2.3/build/src/msg && /usr/bin/i686-pld-linux-g++ -DBOOST_ASIO_DISABLE_THREAD_KEYWORD_EXTENSION -DBOOST_ASIO_USE_TS_EXECUTOR_AS_DEFAULT -DHAVE_CONFIG_H -D_FILE_OFFSET_BITS=64 -D_FORTIFY_SOURCE=2 -D_GNU_SOURCE -D_REENTRANT -D_THREAD_SAFE -D__CEPH__ -D__STDC_FORMAT_MACROS -D__linux__ -I/tmp/B.yrz327wa/BUILD/ceph-17.2.3/build/src/include -I/tmp/B.yrz327wa/BUILD/ceph-17.2.3/src -isystem /tmp/B.yrz327wa/BUILD/ceph-17.2.3/build/include -isystem /tmp/B.yrz327wa/BUILD/ceph-17.2.3/src/xxHash -isystem /tmp/B.yrz327wa/BUILD/ceph-17.2.3/src/rapidjson/include -O2 -fwrapv -pipe -Wformat -Werror=format-security -gdwarf-4 -fno-debug-types-section -fvar-tracking-assignments -g2 -Wp,-D_FORTIFY_SOURCE=2 -fstack-protector-strong --param=ssp-buffer-size=4 -Werror=trampolines -fomit-frame-pointer -march=i686 -fasynchronous-unwind-tables -mtune=pentium4 -gdwarf-4 -fno-debug-types-section -fvar-tracking-assignments -g2  -DNDEBUG -DQT_NO_DEBUG -fPIC   -U_FORTIFY_SOURCE -Wall -fno-strict-aliasing -fsigned-char -Wtype-limits -Wignored-qualifiers -Wpointer-arith -Werror=format-security -Winit-self -Wno-unknown-pragmas -Wnon-virtual-dtor -Wno-ignored-qualifiers -ftemplate-depth-1024 -Wpessimizing-move -Wredundant-move -Wstrict-null-sentinel -Woverloaded-virtual -fno-new-ttp-matching -fstack-protector-strong -fdiagnostics-color=auto -fno-builtin-malloc -fno-builtin-calloc -fno-builtin-realloc -fno-builtin-free -std=c++17 -MD -MT src/msg/CMakeFiles/common-msg-objs.dir/Messenger.cc.o -MF CMakeFiles/common-msg-objs.dir/Messenger.cc.o.d -o CMakeFiles/common-msg-objs.dir/Messenger.cc.o -c /tmp/B.yrz327wa/BUILD/ceph-17.2.3/src/msg/Messenger.cc
In file included from /tmp/B.yrz327wa/BUILD/ceph-17.2.3/src/msg/async/AsyncMessenger.h:23,
                 from /tmp/B.yrz327wa/BUILD/ceph-17.2.3/src/msg/Messenger.cc:11:
/tmp/B.yrz327wa/BUILD/ceph-17.2.3/src/include/xlist.h:162:24: warning: 'template<class _Category, class _Tp, class _Distance, class _Pointer, class _Reference> struct std::iterator' is deprecated [-Wdeprecated-declarations]
  162 |   class iterator: std::iterator<std::forward_iterator_tag, T> {
      |                        ^~~~~~~~
In file included from /usr/include/c++/12.2.0/bits/stl_algobase.h:65,
                 from /usr/include/c++/12.2.0/bits/stl_tree.h:63,
                 from /usr/include/c++/12.2.0/set:60,
                 from /tmp/B.yrz327wa/BUILD/ceph-17.2.3/src/include/encoding.h:17,
                 from /tmp/B.yrz327wa/BUILD/ceph-17.2.3/src/include/uuid.h:9,
                 from /tmp/B.yrz327wa/BUILD/ceph-17.2.3/src/include/types.h:21,
                 from /tmp/B.yrz327wa/BUILD/ceph-17.2.3/src/msg/Messenger.cc:6:
/usr/include/c++/12.2.0/bits/stl_iterator_base_types.h:127:34: note: declared here
  127 |     struct _GLIBCXX17_DEPRECATED iterator
      |                                  ^~~~~~~~
/tmp/B.yrz327wa/BUILD/ceph-17.2.3/src/include/xlist.h:186:30: warning: 'template<class _Category, class _Tp, class _Distance, class _Pointer, class _Reference> struct std::iterator' is deprecated [-Wdeprecated-declarations]
  186 |   class const_iterator: std::iterator<std::forward_iterator_tag, T> {
      |                              ^~~~~~~~
/usr/include/c++/12.2.0/bits/stl_iterator_base_types.h:127:34: note: declared here
  127 |     struct _GLIBCXX17_DEPRECATED iterator
      |                                  ^~~~~~~~
make[2]: Leaving directory '/tmp/B.yrz327wa/BUILD/ceph-17.2.3/build'
make[2]: Entering directory '/tmp/B.yrz327wa/BUILD/ceph-17.2.3/build'
[  4%] Building CXX object src/crush/CMakeFiles/crush_objs.dir/CrushWrapper.cc.o
cd /tmp/B.yrz327wa/BUILD/ceph-17.2.3/build/src/crush && /usr/bin/i686-pld-linux-g++ -DBOOST_ASIO_DISABLE_THREAD_KEYWORD_EXTENSION -DBOOST_ASIO_USE_TS_EXECUTOR_AS_DEFAULT -DHAVE_CONFIG_H -D_FILE_OFFSET_BITS=64 -D_FORTIFY_SOURCE=2 -D_GNU_SOURCE -D_REENTRANT -D_THREAD_SAFE -D__CEPH__ -D__STDC_FORMAT_MACROS -D__linux__ -I/tmp/B.yrz327wa/BUILD/ceph-17.2.3/build/src/include -I/tmp/B.yrz327wa/BUILD/ceph-17.2.3/src -isystem /tmp/B.yrz327wa/BUILD/ceph-17.2.3/build/include -isystem /tmp/B.yrz327wa/BUILD/ceph-17.2.3/src/xxHash -isystem /tmp/B.yrz327wa/BUILD/ceph-17.2.3/src/rapidjson/include -O2 -fwrapv -pipe -Wformat -Werror=format-security -gdwarf-4 -fno-debug-types-section -fvar-tracking-assignments -g2 -Wp,-D_FORTIFY_SOURCE=2 -fstack-protector-strong --param=ssp-buffer-size=4 -Werror=trampolines -fomit-frame-pointer -march=i686 -fasynchronous-unwind-tables -mtune=pentium4 -gdwarf-4 -fno-debug-types-section -fvar-tracking-assignments -g2  -DNDEBUG -DQT_NO_DEBUG -fPIC   -U_FORTIFY_SOURCE -Wall -fno-strict-aliasing -fsigned-char -Wtype-limits -Wignored-qualifiers -Wpointer-arith -Werror=format-security -Winit-self -Wno-unknown-pragmas -Wnon-virtual-dtor -Wno-ignored-qualifiers -ftemplate-depth-1024 -Wpessimizing-move -Wredundant-move -Wstrict-null-sentinel -Woverloaded-virtual -fno-new-ttp-matching -fstack-protector-strong -fdiagnostics-color=auto -fno-builtin-malloc -fno-builtin-calloc -fno-builtin-realloc -fno-builtin-free -std=c++17 -MD -MT src/crush/CMakeFiles/crush_objs.dir/CrushWrapper.cc.o -MF CMakeFiles/crush_objs.dir/CrushWrapper.cc.o.d -o CMakeFiles/crush_objs.dir/CrushWrapper.cc.o -c /tmp/B.yrz327wa/BUILD/ceph-17.2.3/src/crush/CrushWrapper.cc
In file included from /tmp/B.yrz327wa/BUILD/ceph-17.2.3/src/librados/ListObjectImpl.h:19,
                 from /tmp/B.yrz327wa/BUILD/ceph-17.2.3/src/osd/osd_types.h:51,
                 from /tmp/B.yrz327wa/BUILD/ceph-17.2.3/src/crush/CrushWrapper.cc:4:
/tmp/B.yrz327wa/BUILD/ceph-17.2.3/src/include/rados/librados.hpp:107:54: warning: 'template<class _Category, class _Tp, class _Distance, class _Pointer, class _Reference> struct std::iterator' is deprecated [-Wdeprecated-declarations]
  107 |   class CEPH_RADOS_API NObjectIterator : public std::iterator <std::forward_iterator_tag, ListObject> {
      |                                                      ^~~~~~~~
In file included from /usr/include/c++/12.2.0/string:45,
                 from /usr/include/c++/12.2.0/bits/locale_classes.h:40,
                 from /usr/include/c++/12.2.0/bits/ios_base.h:41,
                 from /usr/include/c++/12.2.0/ios:42,
                 from /usr/include/c++/12.2.0/istream:38,
                 from /usr/include/c++/12.2.0/sstream:38,
                 from /tmp/B.yrz327wa/BUILD/ceph-17.2.3/src/osd/osd_types.h:22:
/usr/include/c++/12.2.0/bits/stl_iterator_base_types.h:127:34: note: declared here
  127 |     struct _GLIBCXX17_DEPRECATED iterator
      |                                  ^~~~~~~~
In file included from /tmp/B.yrz327wa/BUILD/ceph-17.2.3/src/common/debug.h:18,
                 from /tmp/B.yrz327wa/BUILD/ceph-17.2.3/src/msg/Connection.h:24,
                 from /tmp/B.yrz327wa/BUILD/ceph-17.2.3/src/osd/Watch.h:18,
                 from /tmp/B.yrz327wa/BUILD/ceph-17.2.3/src/osd/osd_types.h:49:
/tmp/B.yrz327wa/BUILD/ceph-17.2.3/src/osd/osd_types.h: In lambda function:
/tmp/B.yrz327wa/BUILD/ceph-17.2.3/src/common/dout.h:185:56: error: call to non-'constexpr' function 'ceph::dout::dynamic_marker_t<T> ceph::dout::need_dynamic(T&&) [with T = unsigned int]'
  185 |     dout_impl(pdpp->get_cct(), ceph::dout::need_dynamic(pdpp->get_subsys()), v) \
      |                                ~~~~~~~~~~~~~~~~~~~~~~~~^~~~~~~~~~~~~~~~~~~~
/tmp/B.yrz327wa/BUILD/ceph-17.2.3/src/common/dout.h:156:58: note: in definition of macro 'dout_impl'
  156 |       return (cctX->_conf->subsys.template should_gather<sub, v>());    \
      |                                                          ^~~
/tmp/B.yrz327wa/BUILD/ceph-17.2.3/src/osd/osd_types.h:3651:3: note: in expansion of macro 'ldpp_dout'
 3651 |   ldpp_dout(dpp, 10) << "build_prior all_probe " << all_probe << dendl;
      |   ^~~~~~~~~
/tmp/B.yrz327wa/BUILD/ceph-17.2.3/src/common/dout.h:106:21: note: 'ceph::dout::dynamic_marker_t<T> ceph::dout::need_dynamic(T&&) [with T = unsigned int]' declared here
  106 | dynamic_marker_t<T> need_dynamic(T&& t) {
      |                     ^~~~~~~~~~~~
/tmp/B.yrz327wa/BUILD/ceph-17.2.3/src/osd/osd_types.h: In lambda function:
/tmp/B.yrz327wa/BUILD/ceph-17.2.3/src/common/dout.h:185:56: error: call to non-'constexpr' function 'ceph::dout::dynamic_marker_t<T> ceph::dout::need_dynamic(T&&) [with T = unsigned int]'
  185 |     dout_impl(pdpp->get_cct(), ceph::dout::need_dynamic(pdpp->get_subsys()), v) \
      |                                ~~~~~~~~~~~~~~~~~~~~~~~~^~~~~~~~~~~~~~~~~~~~
/tmp/B.yrz327wa/BUILD/ceph-17.2.3/src/common/dout.h:156:58: note: in definition of macro 'dout_impl'
  156 |       return (cctX->_conf->subsys.template should_gather<sub, v>());    \
      |                                                          ^~~
/tmp/B.yrz327wa/BUILD/ceph-17.2.3/src/osd/osd_types.h:3670:7: note: in expansion of macro 'ldpp_dout'
 3670 |       ldpp_dout(dpp, 10) << "build_prior maybe_rw interval:" << start
      |       ^~~~~~~~~
/tmp/B.yrz327wa/BUILD/ceph-17.2.3/src/common/dout.h:106:21: note: 'ceph::dout::dynamic_marker_t<T> ceph::dout::need_dynamic(T&&) [with T = unsigned int]' declared here
  106 | dynamic_marker_t<T> need_dynamic(T&& t) {
      |                     ^~~~~~~~~~~~
/tmp/B.yrz327wa/BUILD/ceph-17.2.3/src/osd/osd_types.h: In lambda function:
/tmp/B.yrz327wa/BUILD/ceph-17.2.3/src/common/dout.h:185:56: error: call to non-'constexpr' function 'ceph::dout::dynamic_marker_t<T> ceph::dout::need_dynamic(T&&) [with T = unsigned int]'
  185 |     dout_impl(pdpp->get_cct(), ceph::dout::need_dynamic(pdpp->get_subsys()), v) \
      |                                ~~~~~~~~~~~~~~~~~~~~~~~~^~~~~~~~~~~~~~~~~~~~
/tmp/B.yrz327wa/BUILD/ceph-17.2.3/src/common/dout.h:156:58: note: in definition of macro 'dout_impl'
  156 |       return (cctX->_conf->subsys.template should_gather<sub, v>());    \
      |                                                          ^~~
/tmp/B.yrz327wa/BUILD/ceph-17.2.3/src/osd/osd_types.h:3691:11: note: in expansion of macro 'ldpp_dout'
 3691 |           ldpp_dout(dpp, 10) << "build_prior  prior osd." << so.osd
      |           ^~~~~~~~~
/tmp/B.yrz327wa/BUILD/ceph-17.2.3/src/common/dout.h:106:21: note: 'ceph::dout::dynamic_marker_t<T> ceph::dout::need_dynamic(T&&) [with T = unsigned int]' declared here
  106 | dynamic_marker_t<T> need_dynamic(T&& t) {
      |                     ^~~~~~~~~~~~
/tmp/B.yrz327wa/BUILD/ceph-17.2.3/src/osd/osd_types.h: In lambda function:
/tmp/B.yrz327wa/BUILD/ceph-17.2.3/src/common/dout.h:185:56: error: call to non-'constexpr' function 'ceph::dout::dynamic_marker_t<T> ceph::dout::need_dynamic(T&&) [with T = unsigned int]'
  185 |     dout_impl(pdpp->get_cct(), ceph::dout::need_dynamic(pdpp->get_subsys()), v) \
      |                                ~~~~~~~~~~~~~~~~~~~~~~~~^~~~~~~~~~~~~~~~~~~~
/tmp/B.yrz327wa/BUILD/ceph-17.2.3/src/common/dout.h:156:58: note: in definition of macro 'dout_impl'
  156 |       return (cctX->_conf->subsys.template should_gather<sub, v>());    \
      |                                                          ^~~
/tmp/B.yrz327wa/BUILD/ceph-17.2.3/src/osd/osd_types.h:3696:11: note: in expansion of macro 'ldpp_dout'
 3696 |           ldpp_dout(dpp, 10) << "build_prior  prior osd." << so.osd
      |           ^~~~~~~~~
/tmp/B.yrz327wa/BUILD/ceph-17.2.3/src/common/dout.h:106:21: note: 'ceph::dout::dynamic_marker_t<T> ceph::dout::need_dynamic(T&&) [with T = unsigned int]' declared here
  106 | dynamic_marker_t<T> need_dynamic(T&& t) {
      |                     ^~~~~~~~~~~~
/tmp/B.yrz327wa/BUILD/ceph-17.2.3/src/osd/osd_types.h: In lambda function:
/tmp/B.yrz327wa/BUILD/ceph-17.2.3/src/common/dout.h:185:56: error: call to non-'constexpr' function 'ceph::dout::dynamic_marker_t<T> ceph::dout::need_dynamic(T&&) [with T = unsigned int]'
  185 |     dout_impl(pdpp->get_cct(), ceph::dout::need_dynamic(pdpp->get_subsys()), v) \
      |                                ~~~~~~~~~~~~~~~~~~~~~~~~^~~~~~~~~~~~~~~~~~~~
/tmp/B.yrz327wa/BUILD/ceph-17.2.3/src/common/dout.h:156:58: note: in definition of macro 'dout_impl'
  156 |       return (cctX->_conf->subsys.template should_gather<sub, v>());    \
      |                                                          ^~~
/tmp/B.yrz327wa/BUILD/ceph-17.2.3/src/osd/osd_types.h:3702:11: note: in expansion of macro 'ldpp_dout'
 3702 |           ldpp_dout(dpp, 10) << "build_prior  prior osd." << so.osd
      |           ^~~~~~~~~
/tmp/B.yrz327wa/BUILD/ceph-17.2.3/src/common/dout.h:106:21: note: 'ceph::dout::dynamic_marker_t<T> ceph::dout::need_dynamic(T&&) [with T = unsigned int]' declared here
  106 | dynamic_marker_t<T> need_dynamic(T&& t) {
      |                     ^~~~~~~~~~~~
/tmp/B.yrz327wa/BUILD/ceph-17.2.3/src/osd/osd_types.h: In lambda function:
/tmp/B.yrz327wa/BUILD/ceph-17.2.3/src/common/dout.h:185:56: error: call to non-'constexpr' function 'ceph::dout::dynamic_marker_t<T> ceph::dout::need_dynamic(T&&) [with T = unsigned int]'
  185 |     dout_impl(pdpp->get_cct(), ceph::dout::need_dynamic(pdpp->get_subsys()), v) \
      |                                ~~~~~~~~~~~~~~~~~~~~~~~~^~~~~~~~~~~~~~~~~~~~
/tmp/B.yrz327wa/BUILD/ceph-17.2.3/src/common/dout.h:156:58: note: in definition of macro 'dout_impl'
  156 |       return (cctX->_conf->subsys.template should_gather<sub, v>());    \
      |                                                          ^~~
/tmp/B.yrz327wa/BUILD/ceph-17.2.3/src/osd/osd_types.h:3716:9: note: in expansion of macro 'ldpp_dout'
 3716 |         ldpp_dout(dpp, 10) << "build_prior  possibly went active+rw,"
      |         ^~~~~~~~~
/tmp/B.yrz327wa/BUILD/ceph-17.2.3/src/common/dout.h:106:21: note: 'ceph::dout::dynamic_marker_t<T> ceph::dout::need_dynamic(T&&) [with T = unsigned int]' declared here
  106 | dynamic_marker_t<T> need_dynamic(T&& t) {
      |                     ^~~~~~~~~~~~
/tmp/B.yrz327wa/BUILD/ceph-17.2.3/src/osd/osd_types.h: In lambda function:
/tmp/B.yrz327wa/BUILD/ceph-17.2.3/src/common/dout.h:185:56: error: call to non-'constexpr' function 'ceph::dout::dynamic_marker_t<T> ceph::dout::need_dynamic(T&&) [with T = unsigned int]'
  185 |     dout_impl(pdpp->get_cct(), ceph::dout::need_dynamic(pdpp->get_subsys()), v) \
      |                                ~~~~~~~~~~~~~~~~~~~~~~~~^~~~~~~~~~~~~~~~~~~~
/tmp/B.yrz327wa/BUILD/ceph-17.2.3/src/common/dout.h:156:58: note: in definition of macro 'dout_impl'
  156 |       return (cctX->_conf->subsys.template should_gather<sub, v>());    \
      |                                                          ^~~
/tmp/B.yrz327wa/BUILD/ceph-17.2.3/src/osd/osd_types.h:3726:3: note: in expansion of macro 'ldpp_dout'
 3726 |   ldpp_dout(dpp, 10) << "build_prior final: probe " << probe
      |   ^~~~~~~~~
/tmp/B.yrz327wa/BUILD/ceph-17.2.3/src/common/dout.h:106:21: note: 'ceph::dout::dynamic_marker_t<T> ceph::dout::need_dynamic(T&&) [with T = unsigned int]' declared here
  106 | dynamic_marker_t<T> need_dynamic(T&& t) {
      |                     ^~~~~~~~~~~~
make[2]: *** [src/crush/CMakeFiles/crush_objs.dir/build.make:135: src/crush/CMakeFiles/crush_objs.dir/CrushWrapper.cc.o] Error 1
make[2]: Leaving directory '/tmp/B.yrz327wa/BUILD/ceph-17.2.3/build'
make[1]: *** [CMakeFiles/Makefile2:3031: src/crush/CMakeFiles/crush_objs.dir/all] Error 2
make[2]: Entering directory '/tmp/B.yrz327wa/BUILD/ceph-17.2.3/build'
[  5%] Building CXX object src/common/options/CMakeFiles/common-options-objs.dir/cephfs-mirror_options.cc.o
cd /tmp/B.yrz327wa/BUILD/ceph-17.2.3/build/src/common/options && /usr/bin/i686-pld-linux-g++ -DBOOST_ASIO_DISABLE_THREAD_KEYWORD_EXTENSION -DBOOST_ASIO_USE_TS_EXECUTOR_AS_DEFAULT -DHAVE_CONFIG_H -D_FILE_OFFSET_BITS=64 -D_FORTIFY_SOURCE=2 -D_GNU_SOURCE -D_REENTRANT -D_THREAD_SAFE -D__CEPH__ -D__STDC_FORMAT_MACROS -D__linux__ -I/tmp/B.yrz327wa/BUILD/ceph-17.2.3/build/src/include -I/tmp/B.yrz327wa/BUILD/ceph-17.2.3/src -isystem /tmp/B.yrz327wa/BUILD/ceph-17.2.3/build/include -isystem /tmp/B.yrz327wa/BUILD/ceph-17.2.3/src/xxHash -isystem /tmp/B.yrz327wa/BUILD/ceph-17.2.3/src/rapidjson/include -O2 -fwrapv -pipe -Wformat -Werror=format-security -gdwarf-4 -fno-debug-types-section -fvar-tracking-assignments -g2 -Wp,-D_FORTIFY_SOURCE=2 -fstack-protector-strong --param=ssp-buffer-size=4 -Werror=trampolines -fomit-frame-pointer -march=i686 -fasynchronous-unwind-tables -mtune=pentium4 -gdwarf-4 -fno-debug-types-section -fvar-tracking-assignments -g2  -DNDEBUG -DQT_NO_DEBUG -fPIC   -U_FORTIFY_SOURCE -Wall -fno-strict-aliasing -fsigned-char -Wtype-limits -Wignored-qualifiers -Wpointer-arith -Werror=format-security -Winit-self -Wno-unknown-pragmas -Wnon-virtual-dtor -Wno-ignored-qualifiers -ftemplate-depth-1024 -Wpessimizing-move -Wredundant-move -Wstrict-null-sentinel -Woverloaded-virtual -fno-new-ttp-matching -fstack-protector-strong -fdiagnostics-color=auto -fno-builtin-malloc -fno-builtin-calloc -fno-builtin-realloc -fno-builtin-free -std=c++17 -MD -MT src/common/options/CMakeFiles/common-options-objs.dir/cephfs-mirror_options.cc.o -MF CMakeFiles/common-options-objs.dir/cephfs-mirror_options.cc.o.d -o CMakeFiles/common-options-objs.dir/cephfs-mirror_options.cc.o -c /tmp/B.yrz327wa/BUILD/ceph-17.2.3/build/src/common/options/cephfs-mirror_options.cc
make[2]: Leaving directory '/tmp/B.yrz327wa/BUILD/ceph-17.2.3/build'
make[2]: Entering directory '/tmp/B.yrz327wa/BUILD/ceph-17.2.3/build'
[  6%] Building CXX object src/cls/CMakeFiles/cls_lock_client.dir/lock/cls_lock_types.cc.o
cd /tmp/B.yrz327wa/BUILD/ceph-17.2.3/build/src/cls && /usr/bin/i686-pld-linux-g++ -DBOOST_ASIO_DISABLE_THREAD_KEYWORD_EXTENSION -DBOOST_ASIO_USE_TS_EXECUTOR_AS_DEFAULT -DHAVE_CONFIG_H -D_FILE_OFFSET_BITS=64 -D_FORTIFY_SOURCE=2 -D_GNU_SOURCE -D_REENTRANT -D_THREAD_SAFE -D__CEPH__ -D__STDC_FORMAT_MACROS -D__linux__ -I/tmp/B.yrz327wa/BUILD/ceph-17.2.3/build/src/include -I/tmp/B.yrz327wa/BUILD/ceph-17.2.3/src -isystem /tmp/B.yrz327wa/BUILD/ceph-17.2.3/build/include -isystem /tmp/B.yrz327wa/BUILD/ceph-17.2.3/src/xxHash -isystem /tmp/B.yrz327wa/BUILD/ceph-17.2.3/src/rapidjson/include -O2 -fwrapv -pipe -Wformat -Werror=format-security -gdwarf-4 -fno-debug-types-section -fvar-tracking-assignments -g2 -Wp,-D_FORTIFY_SOURCE=2 -fstack-protector-strong --param=ssp-buffer-size=4 -Werror=trampolines -fomit-frame-pointer -march=i686 -fasynchronous-unwind-tables -mtune=pentium4 -gdwarf-4 -fno-debug-types-section -fvar-tracking-assignments -g2  -DNDEBUG -DQT_NO_DEBUG -fPIC   -U_FORTIFY_SOURCE -Wall -fno-strict-aliasing -fsigned-char -Wtype-limits -Wignored-qualifiers -Wpointer-arith -Werror=format-security -Winit-self -Wno-unknown-pragmas -Wnon-virtual-dtor -Wno-ignored-qualifiers -ftemplate-depth-1024 -Wpessimizing-move -Wredundant-move -Wstrict-null-sentinel -Woverloaded-virtual -fno-new-ttp-matching -fstack-protector-strong -fdiagnostics-color=auto -fno-builtin-malloc -fno-builtin-calloc -fno-builtin-realloc -fno-builtin-free -std=c++17 -MD -MT src/cls/CMakeFiles/cls_lock_client.dir/lock/cls_lock_types.cc.o -MF CMakeFiles/cls_lock_client.dir/lock/cls_lock_types.cc.o.d -o CMakeFiles/cls_lock_client.dir/lock/cls_lock_types.cc.o -c /tmp/B.yrz327wa/BUILD/ceph-17.2.3/src/cls/lock/cls_lock_types.cc
make[2]: Leaving directory '/tmp/B.yrz327wa/BUILD/ceph-17.2.3/build'
make[2]: Entering directory '/tmp/B.yrz327wa/BUILD/ceph-17.2.3/build'
[  5%] Building CXX object src/cls/CMakeFiles/cls_lock_client.dir/lock/cls_lock_client.cc.o
cd /tmp/B.yrz327wa/BUILD/ceph-17.2.3/build/src/cls && /usr/bin/i686-pld-linux-g++ -DBOOST_ASIO_DISABLE_THREAD_KEYWORD_EXTENSION -DBOOST_ASIO_USE_TS_EXECUTOR_AS_DEFAULT -DHAVE_CONFIG_H -D_FILE_OFFSET_BITS=64 -D_FORTIFY_SOURCE=2 -D_GNU_SOURCE -D_REENTRANT -D_THREAD_SAFE -D__CEPH__ -D__STDC_FORMAT_MACROS -D__linux__ -I/tmp/B.yrz327wa/BUILD/ceph-17.2.3/build/src/include -I/tmp/B.yrz327wa/BUILD/ceph-17.2.3/src -isystem /tmp/B.yrz327wa/BUILD/ceph-17.2.3/build/include -isystem /tmp/B.yrz327wa/BUILD/ceph-17.2.3/src/xxHash -isystem /tmp/B.yrz327wa/BUILD/ceph-17.2.3/src/rapidjson/include -O2 -fwrapv -pipe -Wformat -Werror=format-security -gdwarf-4 -fno-debug-types-section -fvar-tracking-assignments -g2 -Wp,-D_FORTIFY_SOURCE=2 -fstack-protector-strong --param=ssp-buffer-size=4 -Werror=trampolines -fomit-frame-pointer -march=i686 -fasynchronous-unwind-tables -mtune=pentium4 -gdwarf-4 -fno-debug-types-section -fvar-tracking-assignments -g2  -DNDEBUG -DQT_NO_DEBUG -fPIC   -U_FORTIFY_SOURCE -Wall -fno-strict-aliasing -fsigned-char -Wtype-limits -Wignored-qualifiers -Wpointer-arith -Werror=format-security -Winit-self -Wno-unknown-pragmas -Wnon-virtual-dtor -Wno-ignored-qualifiers -ftemplate-depth-1024 -Wpessimizing-move -Wredundant-move -Wstrict-null-sentinel -Woverloaded-virtual -fno-new-ttp-matching -fstack-protector-strong -fdiagnostics-color=auto -fno-builtin-malloc -fno-builtin-calloc -fno-builtin-realloc -fno-builtin-free -std=c++17 -MD -MT src/cls/CMakeFiles/cls_lock_client.dir/lock/cls_lock_client.cc.o -MF CMakeFiles/cls_lock_client.dir/lock/cls_lock_client.cc.o.d -o CMakeFiles/cls_lock_client.dir/lock/cls_lock_client.cc.o -c /tmp/B.yrz327wa/BUILD/ceph-17.2.3/src/cls/lock/cls_lock_client.cc
In file included from /tmp/B.yrz327wa/BUILD/ceph-17.2.3/src/cls/lock/cls_lock_client.cc:17:
/tmp/B.yrz327wa/BUILD/ceph-17.2.3/src/include/rados/librados.hpp:107:54: warning: 'template<class _Category, class _Tp, class _Distance, class _Pointer, class _Reference> struct std::iterator' is deprecated [-Wdeprecated-declarations]
  107 |   class CEPH_RADOS_API NObjectIterator : public std::iterator <std::forward_iterator_tag, ListObject> {
      |                                                      ^~~~~~~~
In file included from /usr/include/c++/12.2.0/bits/stl_algobase.h:65,
                 from /usr/include/c++/12.2.0/bits/stl_tree.h:63,
                 from /usr/include/c++/12.2.0/set:60,
                 from /tmp/B.yrz327wa/BUILD/ceph-17.2.3/src/include/encoding.h:17,
                 from /tmp/B.yrz327wa/BUILD/ceph-17.2.3/src/include/uuid.h:9,
                 from /tmp/B.yrz327wa/BUILD/ceph-17.2.3/src/include/types.h:21,
                 from /tmp/B.yrz327wa/BUILD/ceph-17.2.3/src/cls/lock/cls_lock_client.cc:15:
/usr/include/c++/12.2.0/bits/stl_iterator_base_types.h:127:34: note: declared here
  127 |     struct _GLIBCXX17_DEPRECATED iterator
      |                                  ^~~~~~~~
make[2]: Leaving directory '/tmp/B.yrz327wa/BUILD/ceph-17.2.3/build'
make[2]: Entering directory '/tmp/B.yrz327wa/BUILD/ceph-17.2.3/build'
[  6%] Building CXX object src/cls/CMakeFiles/cls_lock_client.dir/lock/cls_lock_ops.cc.o
cd /tmp/B.yrz327wa/BUILD/ceph-17.2.3/build/src/cls && /usr/bin/i686-pld-linux-g++ -DBOOST_ASIO_DISABLE_THREAD_KEYWORD_EXTENSION -DBOOST_ASIO_USE_TS_EXECUTOR_AS_DEFAULT -DHAVE_CONFIG_H -D_FILE_OFFSET_BITS=64 -D_FORTIFY_SOURCE=2 -D_GNU_SOURCE -D_REENTRANT -D_THREAD_SAFE -D__CEPH__ -D__STDC_FORMAT_MACROS -D__linux__ -I/tmp/B.yrz327wa/BUILD/ceph-17.2.3/build/src/include -I/tmp/B.yrz327wa/BUILD/ceph-17.2.3/src -isystem /tmp/B.yrz327wa/BUILD/ceph-17.2.3/build/include -isystem /tmp/B.yrz327wa/BUILD/ceph-17.2.3/src/xxHash -isystem /tmp/B.yrz327wa/BUILD/ceph-17.2.3/src/rapidjson/include -O2 -fwrapv -pipe -Wformat -Werror=format-security -gdwarf-4 -fno-debug-types-section -fvar-tracking-assignments -g2 -Wp,-D_FORTIFY_SOURCE=2 -fstack-protector-strong --param=ssp-buffer-size=4 -Werror=trampolines -fomit-frame-pointer -march=i686 -fasynchronous-unwind-tables -mtune=pentium4 -gdwarf-4 -fno-debug-types-section -fvar-tracking-assignments -g2  -DNDEBUG -DQT_NO_DEBUG -fPIC   -U_FORTIFY_SOURCE -Wall -fno-strict-aliasing -fsigned-char -Wtype-limits -Wignored-qualifiers -Wpointer-arith -Werror=format-security -Winit-self -Wno-unknown-pragmas -Wnon-virtual-dtor -Wno-ignored-qualifiers -ftemplate-depth-1024 -Wpessimizing-move -Wredundant-move -Wstrict-null-sentinel -Woverloaded-virtual -fno-new-ttp-matching -fstack-protector-strong -fdiagnostics-color=auto -fno-builtin-malloc -fno-builtin-calloc -fno-builtin-realloc -fno-builtin-free -std=c++17 -MD -MT src/cls/CMakeFiles/cls_lock_client.dir/lock/cls_lock_ops.cc.o -MF CMakeFiles/cls_lock_client.dir/lock/cls_lock_ops.cc.o.d -o CMakeFiles/cls_lock_client.dir/lock/cls_lock_ops.cc.o -c /tmp/B.yrz327wa/BUILD/ceph-17.2.3/src/cls/lock/cls_lock_ops.cc
make[2]: Leaving directory '/tmp/B.yrz327wa/BUILD/ceph-17.2.3/build'
make[2]: Entering directory '/tmp/B.yrz327wa/BUILD/ceph-17.2.3/build'
[  6%] Linking CXX static library ../../lib/libcls_lock_client.a
cd /tmp/B.yrz327wa/BUILD/ceph-17.2.3/build/src/cls && /usr/bin/cmake -P CMakeFiles/cls_lock_client.dir/cmake_clean_target.cmake
cd /tmp/B.yrz327wa/BUILD/ceph-17.2.3/build/src/cls && /usr/bin/cmake -E cmake_link_script CMakeFiles/cls_lock_client.dir/link.txt --verbose=1
/usr/bin/ar qc ../../lib/libcls_lock_client.a CMakeFiles/cls_lock_client.dir/lock/cls_lock_client.cc.o CMakeFiles/cls_lock_client.dir/lock/cls_lock_types.cc.o CMakeFiles/cls_lock_client.dir/lock/cls_lock_ops.cc.o
/usr/bin/ranlib ../../lib/libcls_lock_client.a
make[2]: Leaving directory '/tmp/B.yrz327wa/BUILD/ceph-17.2.3/build'
make[1]: Entering directory '/tmp/B.yrz327wa/BUILD/ceph-17.2.3/build'
[  6%] Built target cls_lock_client
make[1]: Leaving directory '/tmp/B.yrz327wa/BUILD/ceph-17.2.3/build'
make[2]: Entering directory '/tmp/B.yrz327wa/BUILD/ceph-17.2.3/build'
[  6%] Building CXX object src/common/options/CMakeFiles/common-options-objs.dir/crimson_options.cc.o
cd /tmp/B.yrz327wa/BUILD/ceph-17.2.3/build/src/common/options && /usr/bin/i686-pld-linux-g++ -DBOOST_ASIO_DISABLE_THREAD_KEYWORD_EXTENSION -DBOOST_ASIO_USE_TS_EXECUTOR_AS_DEFAULT -DHAVE_CONFIG_H -D_FILE_OFFSET_BITS=64 -D_FORTIFY_SOURCE=2 -D_GNU_SOURCE -D_REENTRANT -D_THREAD_SAFE -D__CEPH__ -D__STDC_FORMAT_MACROS -D__linux__ -I/tmp/B.yrz327wa/BUILD/ceph-17.2.3/build/src/include -I/tmp/B.yrz327wa/BUILD/ceph-17.2.3/src -isystem /tmp/B.yrz327wa/BUILD/ceph-17.2.3/build/include -isystem /tmp/B.yrz327wa/BUILD/ceph-17.2.3/src/xxHash -isystem /tmp/B.yrz327wa/BUILD/ceph-17.2.3/src/rapidjson/include -O2 -fwrapv -pipe -Wformat -Werror=format-security -gdwarf-4 -fno-debug-types-section -fvar-tracking-assignments -g2 -Wp,-D_FORTIFY_SOURCE=2 -fstack-protector-strong --param=ssp-buffer-size=4 -Werror=trampolines -fomit-frame-pointer -march=i686 -fasynchronous-unwind-tables -mtune=pentium4 -gdwarf-4 -fno-debug-types-section -fvar-tracking-assignments -g2  -DNDEBUG -DQT_NO_DEBUG -fPIC   -U_FORTIFY_SOURCE -Wall -fno-strict-aliasing -fsigned-char -Wtype-limits -Wignored-qualifiers -Wpointer-arith -Werror=format-security -Winit-self -Wno-unknown-pragmas -Wnon-virtual-dtor -Wno-ignored-qualifiers -ftemplate-depth-1024 -Wpessimizing-move -Wredundant-move -Wstrict-null-sentinel -Woverloaded-virtual -fno-new-ttp-matching -fstack-protector-strong -fdiagnostics-color=auto -fno-builtin-malloc -fno-builtin-calloc -fno-builtin-realloc -fno-builtin-free -std=c++17 -MD -MT src/common/options/CMakeFiles/common-options-objs.dir/crimson_options.cc.o -MF CMakeFiles/common-options-objs.dir/crimson_options.cc.o.d -o CMakeFiles/common-options-objs.dir/crimson_options.cc.o -c /tmp/B.yrz327wa/BUILD/ceph-17.2.3/build/src/common/options/crimson_options.cc
make[2]: Leaving directory '/tmp/B.yrz327wa/BUILD/ceph-17.2.3/build'
make[2]: Entering directory '/tmp/B.yrz327wa/BUILD/ceph-17.2.3/build'
[  6%] Building CXX object src/common/options/CMakeFiles/common-options-objs.dir/mgr_options.cc.o
cd /tmp/B.yrz327wa/BUILD/ceph-17.2.3/build/src/common/options && /usr/bin/i686-pld-linux-g++ -DBOOST_ASIO_DISABLE_THREAD_KEYWORD_EXTENSION -DBOOST_ASIO_USE_TS_EXECUTOR_AS_DEFAULT -DHAVE_CONFIG_H -D_FILE_OFFSET_BITS=64 -D_FORTIFY_SOURCE=2 -D_GNU_SOURCE -D_REENTRANT -D_THREAD_SAFE -D__CEPH__ -D__STDC_FORMAT_MACROS -D__linux__ -I/tmp/B.yrz327wa/BUILD/ceph-17.2.3/build/src/include -I/tmp/B.yrz327wa/BUILD/ceph-17.2.3/src -isystem /tmp/B.yrz327wa/BUILD/ceph-17.2.3/build/include -isystem /tmp/B.yrz327wa/BUILD/ceph-17.2.3/src/xxHash -isystem /tmp/B.yrz327wa/BUILD/ceph-17.2.3/src/rapidjson/include -O2 -fwrapv -pipe -Wformat -Werror=format-security -gdwarf-4 -fno-debug-types-section -fvar-tracking-assignments -g2 -Wp,-D_FORTIFY_SOURCE=2 -fstack-protector-strong --param=ssp-buffer-size=4 -Werror=trampolines -fomit-frame-pointer -march=i686 -fasynchronous-unwind-tables -mtune=pentium4 -gdwarf-4 -fno-debug-types-section -fvar-tracking-assignments -g2  -DNDEBUG -DQT_NO_DEBUG -fPIC   -U_FORTIFY_SOURCE -Wall -fno-strict-aliasing -fsigned-char -Wtype-limits -Wignored-qualifiers -Wpointer-arith -Werror=format-security -Winit-self -Wno-unknown-pragmas -Wnon-virtual-dtor -Wno-ignored-qualifiers -ftemplate-depth-1024 -Wpessimizing-move -Wredundant-move -Wstrict-null-sentinel -Woverloaded-virtual -fno-new-ttp-matching -fstack-protector-strong -fdiagnostics-color=auto -fno-builtin-malloc -fno-builtin-calloc -fno-builtin-realloc -fno-builtin-free -std=c++17 -MD -MT src/common/options/CMakeFiles/common-options-objs.dir/mgr_options.cc.o -MF CMakeFiles/common-options-objs.dir/mgr_options.cc.o.d -o CMakeFiles/common-options-objs.dir/mgr_options.cc.o -c /tmp/B.yrz327wa/BUILD/ceph-17.2.3/build/src/common/options/mgr_options.cc
make[2]: Leaving directory '/tmp/B.yrz327wa/BUILD/ceph-17.2.3/build'
make[2]: Entering directory '/tmp/B.yrz327wa/BUILD/ceph-17.2.3/build'
[  6%] Building CXX object src/msg/CMakeFiles/common-msg-objs.dir/Connection.cc.o
cd /tmp/B.yrz327wa/BUILD/ceph-17.2.3/build/src/msg && /usr/bin/i686-pld-linux-g++ -DBOOST_ASIO_DISABLE_THREAD_KEYWORD_EXTENSION -DBOOST_ASIO_USE_TS_EXECUTOR_AS_DEFAULT -DHAVE_CONFIG_H -D_FILE_OFFSET_BITS=64 -D_FORTIFY_SOURCE=2 -D_GNU_SOURCE -D_REENTRANT -D_THREAD_SAFE -D__CEPH__ -D__STDC_FORMAT_MACROS -D__linux__ -I/tmp/B.yrz327wa/BUILD/ceph-17.2.3/build/src/include -I/tmp/B.yrz327wa/BUILD/ceph-17.2.3/src -isystem /tmp/B.yrz327wa/BUILD/ceph-17.2.3/build/include -isystem /tmp/B.yrz327wa/BUILD/ceph-17.2.3/src/xxHash -isystem /tmp/B.yrz327wa/BUILD/ceph-17.2.3/src/rapidjson/include -O2 -fwrapv -pipe -Wformat -Werror=format-security -gdwarf-4 -fno-debug-types-section -fvar-tracking-assignments -g2 -Wp,-D_FORTIFY_SOURCE=2 -fstack-protector-strong --param=ssp-buffer-size=4 -Werror=trampolines -fomit-frame-pointer -march=i686 -fasynchronous-unwind-tables -mtune=pentium4 -gdwarf-4 -fno-debug-types-section -fvar-tracking-assignments -g2  -DNDEBUG -DQT_NO_DEBUG -fPIC   -U_FORTIFY_SOURCE -Wall -fno-strict-aliasing -fsigned-char -Wtype-limits -Wignored-qualifiers -Wpointer-arith -Werror=format-security -Winit-self -Wno-unknown-pragmas -Wnon-virtual-dtor -Wno-ignored-qualifiers -ftemplate-depth-1024 -Wpessimizing-move -Wredundant-move -Wstrict-null-sentinel -Woverloaded-virtual -fno-new-ttp-matching -fstack-protector-strong -fdiagnostics-color=auto -fno-builtin-malloc -fno-builtin-calloc -fno-builtin-realloc -fno-builtin-free -std=c++17 -MD -MT src/msg/CMakeFiles/common-msg-objs.dir/Connection.cc.o -MF CMakeFiles/common-msg-objs.dir/Connection.cc.o.d -o CMakeFiles/common-msg-objs.dir/Connection.cc.o -c /tmp/B.yrz327wa/BUILD/ceph-17.2.3/src/msg/Connection.cc
make[2]: Leaving directory '/tmp/B.yrz327wa/BUILD/ceph-17.2.3/build'
make[2]: Entering directory '/tmp/B.yrz327wa/BUILD/ceph-17.2.3/build'
[  6%] Building CXX object src/msg/CMakeFiles/common-msg-objs.dir/msg_types.cc.o
cd /tmp/B.yrz327wa/BUILD/ceph-17.2.3/build/src/msg && /usr/bin/i686-pld-linux-g++ -DBOOST_ASIO_DISABLE_THREAD_KEYWORD_EXTENSION -DBOOST_ASIO_USE_TS_EXECUTOR_AS_DEFAULT -DHAVE_CONFIG_H -D_FILE_OFFSET_BITS=64 -D_FORTIFY_SOURCE=2 -D_GNU_SOURCE -D_REENTRANT -D_THREAD_SAFE -D__CEPH__ -D__STDC_FORMAT_MACROS -D__linux__ -I/tmp/B.yrz327wa/BUILD/ceph-17.2.3/build/src/include -I/tmp/B.yrz327wa/BUILD/ceph-17.2.3/src -isystem /tmp/B.yrz327wa/BUILD/ceph-17.2.3/build/include -isystem /tmp/B.yrz327wa/BUILD/ceph-17.2.3/src/xxHash -isystem /tmp/B.yrz327wa/BUILD/ceph-17.2.3/src/rapidjson/include -O2 -fwrapv -pipe -Wformat -Werror=format-security -gdwarf-4 -fno-debug-types-section -fvar-tracking-assignments -g2 -Wp,-D_FORTIFY_SOURCE=2 -fstack-protector-strong --param=ssp-buffer-size=4 -Werror=trampolines -fomit-frame-pointer -march=i686 -fasynchronous-unwind-tables -mtune=pentium4 -gdwarf-4 -fno-debug-types-section -fvar-tracking-assignments -g2  -DNDEBUG -DQT_NO_DEBUG -fPIC   -U_FORTIFY_SOURCE -Wall -fno-strict-aliasing -fsigned-char -Wtype-limits -Wignored-qualifiers -Wpointer-arith -Werror=format-security -Winit-self -Wno-unknown-pragmas -Wnon-virtual-dtor -Wno-ignored-qualifiers -ftemplate-depth-1024 -Wpessimizing-move -Wredundant-move -Wstrict-null-sentinel -Woverloaded-virtual -fno-new-ttp-matching -fstack-protector-strong -fdiagnostics-color=auto -fno-builtin-malloc -fno-builtin-calloc -fno-builtin-realloc -fno-builtin-free -std=c++17 -MD -MT src/msg/CMakeFiles/common-msg-objs.dir/msg_types.cc.o -MF CMakeFiles/common-msg-objs.dir/msg_types.cc.o.d -o CMakeFiles/common-msg-objs.dir/msg_types.cc.o -c /tmp/B.yrz327wa/BUILD/ceph-17.2.3/src/msg/msg_types.cc
make[2]: Leaving directory '/tmp/B.yrz327wa/BUILD/ceph-17.2.3/build'
make[2]: Entering directory '/tmp/B.yrz327wa/BUILD/ceph-17.2.3/build'
[  6%] Building CXX object src/common/options/CMakeFiles/common-options-objs.dir/mds-client_options.cc.o
cd /tmp/B.yrz327wa/BUILD/ceph-17.2.3/build/src/common/options && /usr/bin/i686-pld-linux-g++ -DBOOST_ASIO_DISABLE_THREAD_KEYWORD_EXTENSION -DBOOST_ASIO_USE_TS_EXECUTOR_AS_DEFAULT -DHAVE_CONFIG_H -D_FILE_OFFSET_BITS=64 -D_FORTIFY_SOURCE=2 -D_GNU_SOURCE -D_REENTRANT -D_THREAD_SAFE -D__CEPH__ -D__STDC_FORMAT_MACROS -D__linux__ -I/tmp/B.yrz327wa/BUILD/ceph-17.2.3/build/src/include -I/tmp/B.yrz327wa/BUILD/ceph-17.2.3/src -isystem /tmp/B.yrz327wa/BUILD/ceph-17.2.3/build/include -isystem /tmp/B.yrz327wa/BUILD/ceph-17.2.3/src/xxHash -isystem /tmp/B.yrz327wa/BUILD/ceph-17.2.3/src/rapidjson/include -O2 -fwrapv -pipe -Wformat -Werror=format-security -gdwarf-4 -fno-debug-types-section -fvar-tracking-assignments -g2 -Wp,-D_FORTIFY_SOURCE=2 -fstack-protector-strong --param=ssp-buffer-size=4 -Werror=trampolines -fomit-frame-pointer -march=i686 -fasynchronous-unwind-tables -mtune=pentium4 -gdwarf-4 -fno-debug-types-section -fvar-tracking-assignments -g2  -DNDEBUG -DQT_NO_DEBUG -fPIC   -U_FORTIFY_SOURCE -Wall -fno-strict-aliasing -fsigned-char -Wtype-limits -Wignored-qualifiers -Wpointer-arith -Werror=format-security -Winit-self -Wno-unknown-pragmas -Wnon-virtual-dtor -Wno-ignored-qualifiers -ftemplate-depth-1024 -Wpessimizing-move -Wredundant-move -Wstrict-null-sentinel -Woverloaded-virtual -fno-new-ttp-matching -fstack-protector-strong -fdiagnostics-color=auto -fno-builtin-malloc -fno-builtin-calloc -fno-builtin-realloc -fno-builtin-free -std=c++17 -MD -MT src/common/options/CMakeFiles/common-options-objs.dir/mds-client_options.cc.o -MF CMakeFiles/common-options-objs.dir/mds-client_options.cc.o.d -o CMakeFiles/common-options-objs.dir/mds-client_options.cc.o -c /tmp/B.yrz327wa/BUILD/ceph-17.2.3/build/src/common/options/mds-client_options.cc
make[2]: Leaving directory '/tmp/B.yrz327wa/BUILD/ceph-17.2.3/build'
make[2]: Entering directory '/tmp/B.yrz327wa/BUILD/ceph-17.2.3/build'
[  6%] Building CXX object src/common/options/CMakeFiles/common-options-objs.dir/mds_options.cc.o
cd /tmp/B.yrz327wa/BUILD/ceph-17.2.3/build/src/common/options && /usr/bin/i686-pld-linux-g++ -DBOOST_ASIO_DISABLE_THREAD_KEYWORD_EXTENSION -DBOOST_ASIO_USE_TS_EXECUTOR_AS_DEFAULT -DHAVE_CONFIG_H -D_FILE_OFFSET_BITS=64 -D_FORTIFY_SOURCE=2 -D_GNU_SOURCE -D_REENTRANT -D_THREAD_SAFE -D__CEPH__ -D__STDC_FORMAT_MACROS -D__linux__ -I/tmp/B.yrz327wa/BUILD/ceph-17.2.3/build/src/include -I/tmp/B.yrz327wa/BUILD/ceph-17.2.3/src -isystem /tmp/B.yrz327wa/BUILD/ceph-17.2.3/build/include -isystem /tmp/B.yrz327wa/BUILD/ceph-17.2.3/src/xxHash -isystem /tmp/B.yrz327wa/BUILD/ceph-17.2.3/src/rapidjson/include -O2 -fwrapv -pipe -Wformat -Werror=format-security -gdwarf-4 -fno-debug-types-section -fvar-tracking-assignments -g2 -Wp,-D_FORTIFY_SOURCE=2 -fstack-protector-strong --param=ssp-buffer-size=4 -Werror=trampolines -fomit-frame-pointer -march=i686 -fasynchronous-unwind-tables -mtune=pentium4 -gdwarf-4 -fno-debug-types-section -fvar-tracking-assignments -g2  -DNDEBUG -DQT_NO_DEBUG -fPIC   -U_FORTIFY_SOURCE -Wall -fno-strict-aliasing -fsigned-char -Wtype-limits -Wignored-qualifiers -Wpointer-arith -Werror=format-security -Winit-self -Wno-unknown-pragmas -Wnon-virtual-dtor -Wno-ignored-qualifiers -ftemplate-depth-1024 -Wpessimizing-move -Wredundant-move -Wstrict-null-sentinel -Woverloaded-virtual -fno-new-ttp-matching -fstack-protector-strong -fdiagnostics-color=auto -fno-builtin-malloc -fno-builtin-calloc -fno-builtin-realloc -fno-builtin-free -std=c++17 -MD -MT src/common/options/CMakeFiles/common-options-objs.dir/mds_options.cc.o -MF CMakeFiles/common-options-objs.dir/mds_options.cc.o.d -o CMakeFiles/common-options-objs.dir/mds_options.cc.o -c /tmp/B.yrz327wa/BUILD/ceph-17.2.3/build/src/common/options/mds_options.cc
make[2]: Leaving directory '/tmp/B.yrz327wa/BUILD/ceph-17.2.3/build'
make[2]: Entering directory '/tmp/B.yrz327wa/BUILD/ceph-17.2.3/build'
[  6%] Building CXX object src/msg/CMakeFiles/common-msg-objs.dir/compressor_registry.cc.o
cd /tmp/B.yrz327wa/BUILD/ceph-17.2.3/build/src/msg && /usr/bin/i686-pld-linux-g++ -DBOOST_ASIO_DISABLE_THREAD_KEYWORD_EXTENSION -DBOOST_ASIO_USE_TS_EXECUTOR_AS_DEFAULT -DHAVE_CONFIG_H -D_FILE_OFFSET_BITS=64 -D_FORTIFY_SOURCE=2 -D_GNU_SOURCE -D_REENTRANT -D_THREAD_SAFE -D__CEPH__ -D__STDC_FORMAT_MACROS -D__linux__ -I/tmp/B.yrz327wa/BUILD/ceph-17.2.3/build/src/include -I/tmp/B.yrz327wa/BUILD/ceph-17.2.3/src -isystem /tmp/B.yrz327wa/BUILD/ceph-17.2.3/build/include -isystem /tmp/B.yrz327wa/BUILD/ceph-17.2.3/src/xxHash -isystem /tmp/B.yrz327wa/BUILD/ceph-17.2.3/src/rapidjson/include -O2 -fwrapv -pipe -Wformat -Werror=format-security -gdwarf-4 -fno-debug-types-section -fvar-tracking-assignments -g2 -Wp,-D_FORTIFY_SOURCE=2 -fstack-protector-strong --param=ssp-buffer-size=4 -Werror=trampolines -fomit-frame-pointer -march=i686 -fasynchronous-unwind-tables -mtune=pentium4 -gdwarf-4 -fno-debug-types-section -fvar-tracking-assignments -g2  -DNDEBUG -DQT_NO_DEBUG -fPIC   -U_FORTIFY_SOURCE -Wall -fno-strict-aliasing -fsigned-char -Wtype-limits -Wignored-qualifiers -Wpointer-arith -Werror=format-security -Winit-self -Wno-unknown-pragmas -Wnon-virtual-dtor -Wno-ignored-qualifiers -ftemplate-depth-1024 -Wpessimizing-move -Wredundant-move -Wstrict-null-sentinel -Woverloaded-virtual -fno-new-ttp-matching -fstack-protector-strong -fdiagnostics-color=auto -fno-builtin-malloc -fno-builtin-calloc -fno-builtin-realloc -fno-builtin-free -std=c++17 -MD -MT src/msg/CMakeFiles/common-msg-objs.dir/compressor_registry.cc.o -MF CMakeFiles/common-msg-objs.dir/compressor_registry.cc.o.d -o CMakeFiles/common-msg-objs.dir/compressor_registry.cc.o -c /tmp/B.yrz327wa/BUILD/ceph-17.2.3/src/msg/compressor_registry.cc
make[2]: Leaving directory '/tmp/B.yrz327wa/BUILD/ceph-17.2.3/build'
make[2]: Entering directory '/tmp/B.yrz327wa/BUILD/ceph-17.2.3/build'
[  6%] Building CXX object src/common/options/CMakeFiles/common-options-objs.dir/mon_options.cc.o
cd /tmp/B.yrz327wa/BUILD/ceph-17.2.3/build/src/common/options && /usr/bin/i686-pld-linux-g++ -DBOOST_ASIO_DISABLE_THREAD_KEYWORD_EXTENSION -DBOOST_ASIO_USE_TS_EXECUTOR_AS_DEFAULT -DHAVE_CONFIG_H -D_FILE_OFFSET_BITS=64 -D_FORTIFY_SOURCE=2 -D_GNU_SOURCE -D_REENTRANT -D_THREAD_SAFE -D__CEPH__ -D__STDC_FORMAT_MACROS -D__linux__ -I/tmp/B.yrz327wa/BUILD/ceph-17.2.3/build/src/include -I/tmp/B.yrz327wa/BUILD/ceph-17.2.3/src -isystem /tmp/B.yrz327wa/BUILD/ceph-17.2.3/build/include -isystem /tmp/B.yrz327wa/BUILD/ceph-17.2.3/src/xxHash -isystem /tmp/B.yrz327wa/BUILD/ceph-17.2.3/src/rapidjson/include -O2 -fwrapv -pipe -Wformat -Werror=format-security -gdwarf-4 -fno-debug-types-section -fvar-tracking-assignments -g2 -Wp,-D_FORTIFY_SOURCE=2 -fstack-protector-strong --param=ssp-buffer-size=4 -Werror=trampolines -fomit-frame-pointer -march=i686 -fasynchronous-unwind-tables -mtune=pentium4 -gdwarf-4 -fno-debug-types-section -fvar-tracking-assignments -g2  -DNDEBUG -DQT_NO_DEBUG -fPIC   -U_FORTIFY_SOURCE -Wall -fno-strict-aliasing -fsigned-char -Wtype-limits -Wignored-qualifiers -Wpointer-arith -Werror=format-security -Winit-self -Wno-unknown-pragmas -Wnon-virtual-dtor -Wno-ignored-qualifiers -ftemplate-depth-1024 -Wpessimizing-move -Wredundant-move -Wstrict-null-sentinel -Woverloaded-virtual -fno-new-ttp-matching -fstack-protector-strong -fdiagnostics-color=auto -fno-builtin-malloc -fno-builtin-calloc -fno-builtin-realloc -fno-builtin-free -std=c++17 -MD -MT src/common/options/CMakeFiles/common-options-objs.dir/mon_options.cc.o -MF CMakeFiles/common-options-objs.dir/mon_options.cc.o.d -o CMakeFiles/common-options-objs.dir/mon_options.cc.o -c /tmp/B.yrz327wa/BUILD/ceph-17.2.3/build/src/common/options/mon_options.cc
make[2]: Leaving directory '/tmp/B.yrz327wa/BUILD/ceph-17.2.3/build'
make[2]: Entering directory '/tmp/B.yrz327wa/BUILD/ceph-17.2.3/build'
[  6%] Building CXX object src/common/options/CMakeFiles/common-options-objs.dir/osd_options.cc.o
cd /tmp/B.yrz327wa/BUILD/ceph-17.2.3/build/src/common/options && /usr/bin/i686-pld-linux-g++ -DBOOST_ASIO_DISABLE_THREAD_KEYWORD_EXTENSION -DBOOST_ASIO_USE_TS_EXECUTOR_AS_DEFAULT -DHAVE_CONFIG_H -D_FILE_OFFSET_BITS=64 -D_FORTIFY_SOURCE=2 -D_GNU_SOURCE -D_REENTRANT -D_THREAD_SAFE -D__CEPH__ -D__STDC_FORMAT_MACROS -D__linux__ -I/tmp/B.yrz327wa/BUILD/ceph-17.2.3/build/src/include -I/tmp/B.yrz327wa/BUILD/ceph-17.2.3/src -isystem /tmp/B.yrz327wa/BUILD/ceph-17.2.3/build/include -isystem /tmp/B.yrz327wa/BUILD/ceph-17.2.3/src/xxHash -isystem /tmp/B.yrz327wa/BUILD/ceph-17.2.3/src/rapidjson/include -O2 -fwrapv -pipe -Wformat -Werror=format-security -gdwarf-4 -fno-debug-types-section -fvar-tracking-assignments -g2 -Wp,-D_FORTIFY_SOURCE=2 -fstack-protector-strong --param=ssp-buffer-size=4 -Werror=trampolines -fomit-frame-pointer -march=i686 -fasynchronous-unwind-tables -mtune=pentium4 -gdwarf-4 -fno-debug-types-section -fvar-tracking-assignments -g2  -DNDEBUG -DQT_NO_DEBUG -fPIC   -U_FORTIFY_SOURCE -Wall -fno-strict-aliasing -fsigned-char -Wtype-limits -Wignored-qualifiers -Wpointer-arith -Werror=format-security -Winit-self -Wno-unknown-pragmas -Wnon-virtual-dtor -Wno-ignored-qualifiers -ftemplate-depth-1024 -Wpessimizing-move -Wredundant-move -Wstrict-null-sentinel -Woverloaded-virtual -fno-new-ttp-matching -fstack-protector-strong -fdiagnostics-color=auto -fno-builtin-malloc -fno-builtin-calloc -fno-builtin-realloc -fno-builtin-free -std=c++17 -MD -MT src/common/options/CMakeFiles/common-options-objs.dir/osd_options.cc.o -MF CMakeFiles/common-options-objs.dir/osd_options.cc.o.d -o CMakeFiles/common-options-objs.dir/osd_options.cc.o -c /tmp/B.yrz327wa/BUILD/ceph-17.2.3/build/src/common/options/osd_options.cc
make[2]: Leaving directory '/tmp/B.yrz327wa/BUILD/ceph-17.2.3/build'
make[2]: Entering directory '/tmp/B.yrz327wa/BUILD/ceph-17.2.3/build'
[  4%] Building CXX object src/msg/CMakeFiles/common-msg-objs.dir/Message.cc.o
cd /tmp/B.yrz327wa/BUILD/ceph-17.2.3/build/src/msg && /usr/bin/i686-pld-linux-g++ -DBOOST_ASIO_DISABLE_THREAD_KEYWORD_EXTENSION -DBOOST_ASIO_USE_TS_EXECUTOR_AS_DEFAULT -DHAVE_CONFIG_H -D_FILE_OFFSET_BITS=64 -D_FORTIFY_SOURCE=2 -D_GNU_SOURCE -D_REENTRANT -D_THREAD_SAFE -D__CEPH__ -D__STDC_FORMAT_MACROS -D__linux__ -I/tmp/B.yrz327wa/BUILD/ceph-17.2.3/build/src/include -I/tmp/B.yrz327wa/BUILD/ceph-17.2.3/src -isystem /tmp/B.yrz327wa/BUILD/ceph-17.2.3/build/include -isystem /tmp/B.yrz327wa/BUILD/ceph-17.2.3/src/xxHash -isystem /tmp/B.yrz327wa/BUILD/ceph-17.2.3/src/rapidjson/include -O2 -fwrapv -pipe -Wformat -Werror=format-security -gdwarf-4 -fno-debug-types-section -fvar-tracking-assignments -g2 -Wp,-D_FORTIFY_SOURCE=2 -fstack-protector-strong --param=ssp-buffer-size=4 -Werror=trampolines -fomit-frame-pointer -march=i686 -fasynchronous-unwind-tables -mtune=pentium4 -gdwarf-4 -fno-debug-types-section -fvar-tracking-assignments -g2  -DNDEBUG -DQT_NO_DEBUG -fPIC   -U_FORTIFY_SOURCE -Wall -fno-strict-aliasing -fsigned-char -Wtype-limits -Wignored-qualifiers -Wpointer-arith -Werror=format-security -Winit-self -Wno-unknown-pragmas -Wnon-virtual-dtor -Wno-ignored-qualifiers -ftemplate-depth-1024 -Wpessimizing-move -Wredundant-move -Wstrict-null-sentinel -Woverloaded-virtual -fno-new-ttp-matching -fstack-protector-strong -fdiagnostics-color=auto -fno-builtin-malloc -fno-builtin-calloc -fno-builtin-realloc -fno-builtin-free -std=c++17 -MD -MT src/msg/CMakeFiles/common-msg-objs.dir/Message.cc.o -MF CMakeFiles/common-msg-objs.dir/Message.cc.o.d -o CMakeFiles/common-msg-objs.dir/Message.cc.o -c /tmp/B.yrz327wa/BUILD/ceph-17.2.3/src/msg/Message.cc
In file included from /tmp/B.yrz327wa/BUILD/ceph-17.2.3/src/librados/ListObjectImpl.h:19,
                 from /tmp/B.yrz327wa/BUILD/ceph-17.2.3/src/osd/osd_types.h:51,
                 from /tmp/B.yrz327wa/BUILD/ceph-17.2.3/src/messages/MPGStats.h:18,
                 from /tmp/B.yrz327wa/BUILD/ceph-17.2.3/src/msg/Message.cc:17:
/tmp/B.yrz327wa/BUILD/ceph-17.2.3/src/include/rados/librados.hpp:107:54: warning: 'template<class _Category, class _Tp, class _Distance, class _Pointer, class _Reference> struct std::iterator' is deprecated [-Wdeprecated-declarations]
  107 |   class CEPH_RADOS_API NObjectIterator : public std::iterator <std::forward_iterator_tag, ListObject> {
      |                                                      ^~~~~~~~
In file included from /usr/include/c++/12.2.0/string:45,
                 from /usr/include/c++/12.2.0/bits/locale_classes.h:40,
                 from /usr/include/c++/12.2.0/bits/ios_base.h:41,
                 from /usr/include/c++/12.2.0/ios:42,
                 from /usr/include/c++/12.2.0/ostream:38,
                 from /usr/include/c++/12.2.0/iostream:39,
                 from /tmp/B.yrz327wa/BUILD/ceph-17.2.3/src/msg/Message.cc:9:
/usr/include/c++/12.2.0/bits/stl_iterator_base_types.h:127:34: note: declared here
  127 |     struct _GLIBCXX17_DEPRECATED iterator
      |                                  ^~~~~~~~
In file included from /tmp/B.yrz327wa/BUILD/ceph-17.2.3/src/include/Context.h:19,
                 from /tmp/B.yrz327wa/BUILD/ceph-17.2.3/src/msg/Message.h:24,
                 from /tmp/B.yrz327wa/BUILD/ceph-17.2.3/src/msg/Message.cc:15:
/tmp/B.yrz327wa/BUILD/ceph-17.2.3/src/osd/osd_types.h: In lambda function:
/tmp/B.yrz327wa/BUILD/ceph-17.2.3/src/common/dout.h:185:56: error: call to non-'constexpr' function 'ceph::dout::dynamic_marker_t<T> ceph::dout::need_dynamic(T&&) [with T = unsigned int]'
  185 |     dout_impl(pdpp->get_cct(), ceph::dout::need_dynamic(pdpp->get_subsys()), v) \
      |                                ~~~~~~~~~~~~~~~~~~~~~~~~^~~~~~~~~~~~~~~~~~~~
/tmp/B.yrz327wa/BUILD/ceph-17.2.3/src/common/dout.h:156:58: note: in definition of macro 'dout_impl'
  156 |       return (cctX->_conf->subsys.template should_gather<sub, v>());    \
      |                                                          ^~~
/tmp/B.yrz327wa/BUILD/ceph-17.2.3/src/osd/osd_types.h:3651:3: note: in expansion of macro 'ldpp_dout'
 3651 |   ldpp_dout(dpp, 10) << "build_prior all_probe " << all_probe << dendl;
      |   ^~~~~~~~~
/tmp/B.yrz327wa/BUILD/ceph-17.2.3/src/common/dout.h:106:21: note: 'ceph::dout::dynamic_marker_t<T> ceph::dout::need_dynamic(T&&) [with T = unsigned int]' declared here
  106 | dynamic_marker_t<T> need_dynamic(T&& t) {
      |                     ^~~~~~~~~~~~
/tmp/B.yrz327wa/BUILD/ceph-17.2.3/src/osd/osd_types.h: In lambda function:
/tmp/B.yrz327wa/BUILD/ceph-17.2.3/src/common/dout.h:185:56: error: call to non-'constexpr' function 'ceph::dout::dynamic_marker_t<T> ceph::dout::need_dynamic(T&&) [with T = unsigned int]'
  185 |     dout_impl(pdpp->get_cct(), ceph::dout::need_dynamic(pdpp->get_subsys()), v) \
      |                                ~~~~~~~~~~~~~~~~~~~~~~~~^~~~~~~~~~~~~~~~~~~~
/tmp/B.yrz327wa/BUILD/ceph-17.2.3/src/common/dout.h:156:58: note: in definition of macro 'dout_impl'
  156 |       return (cctX->_conf->subsys.template should_gather<sub, v>());    \
      |                                                          ^~~
/tmp/B.yrz327wa/BUILD/ceph-17.2.3/src/osd/osd_types.h:3670:7: note: in expansion of macro 'ldpp_dout'
 3670 |       ldpp_dout(dpp, 10) << "build_prior maybe_rw interval:" << start
      |       ^~~~~~~~~
/tmp/B.yrz327wa/BUILD/ceph-17.2.3/src/common/dout.h:106:21: note: 'ceph::dout::dynamic_marker_t<T> ceph::dout::need_dynamic(T&&) [with T = unsigned int]' declared here
  106 | dynamic_marker_t<T> need_dynamic(T&& t) {
      |                     ^~~~~~~~~~~~
/tmp/B.yrz327wa/BUILD/ceph-17.2.3/src/osd/osd_types.h: In lambda function:
/tmp/B.yrz327wa/BUILD/ceph-17.2.3/src/common/dout.h:185:56: error: call to non-'constexpr' function 'ceph::dout::dynamic_marker_t<T> ceph::dout::need_dynamic(T&&) [with T = unsigned int]'
  185 |     dout_impl(pdpp->get_cct(), ceph::dout::need_dynamic(pdpp->get_subsys()), v) \
      |                                ~~~~~~~~~~~~~~~~~~~~~~~~^~~~~~~~~~~~~~~~~~~~
/tmp/B.yrz327wa/BUILD/ceph-17.2.3/src/common/dout.h:156:58: note: in definition of macro 'dout_impl'
  156 |       return (cctX->_conf->subsys.template should_gather<sub, v>());    \
      |                                                          ^~~
/tmp/B.yrz327wa/BUILD/ceph-17.2.3/src/osd/osd_types.h:3691:11: note: in expansion of macro 'ldpp_dout'
 3691 |           ldpp_dout(dpp, 10) << "build_prior  prior osd." << so.osd
      |           ^~~~~~~~~
/tmp/B.yrz327wa/BUILD/ceph-17.2.3/src/common/dout.h:106:21: note: 'ceph::dout::dynamic_marker_t<T> ceph::dout::need_dynamic(T&&) [with T = unsigned int]' declared here
  106 | dynamic_marker_t<T> need_dynamic(T&& t) {
      |                     ^~~~~~~~~~~~
/tmp/B.yrz327wa/BUILD/ceph-17.2.3/src/osd/osd_types.h: In lambda function:
/tmp/B.yrz327wa/BUILD/ceph-17.2.3/src/common/dout.h:185:56: error: call to non-'constexpr' function 'ceph::dout::dynamic_marker_t<T> ceph::dout::need_dynamic(T&&) [with T = unsigned int]'
  185 |     dout_impl(pdpp->get_cct(), ceph::dout::need_dynamic(pdpp->get_subsys()), v) \
      |                                ~~~~~~~~~~~~~~~~~~~~~~~~^~~~~~~~~~~~~~~~~~~~
/tmp/B.yrz327wa/BUILD/ceph-17.2.3/src/common/dout.h:156:58: note: in definition of macro 'dout_impl'
  156 |       return (cctX->_conf->subsys.template should_gather<sub, v>());    \
      |                                                          ^~~
/tmp/B.yrz327wa/BUILD/ceph-17.2.3/src/osd/osd_types.h:3696:11: note: in expansion of macro 'ldpp_dout'
 3696 |           ldpp_dout(dpp, 10) << "build_prior  prior osd." << so.osd
      |           ^~~~~~~~~
/tmp/B.yrz327wa/BUILD/ceph-17.2.3/src/common/dout.h:106:21: note: 'ceph::dout::dynamic_marker_t<T> ceph::dout::need_dynamic(T&&) [with T = unsigned int]' declared here
  106 | dynamic_marker_t<T> need_dynamic(T&& t) {
      |                     ^~~~~~~~~~~~
/tmp/B.yrz327wa/BUILD/ceph-17.2.3/src/osd/osd_types.h: In lambda function:
/tmp/B.yrz327wa/BUILD/ceph-17.2.3/src/common/dout.h:185:56: error: call to non-'constexpr' function 'ceph::dout::dynamic_marker_t<T> ceph::dout::need_dynamic(T&&) [with T = unsigned int]'
  185 |     dout_impl(pdpp->get_cct(), ceph::dout::need_dynamic(pdpp->get_subsys()), v) \
      |                                ~~~~~~~~~~~~~~~~~~~~~~~~^~~~~~~~~~~~~~~~~~~~
/tmp/B.yrz327wa/BUILD/ceph-17.2.3/src/common/dout.h:156:58: note: in definition of macro 'dout_impl'
  156 |       return (cctX->_conf->subsys.template should_gather<sub, v>());    \
      |                                                          ^~~
/tmp/B.yrz327wa/BUILD/ceph-17.2.3/src/osd/osd_types.h:3702:11: note: in expansion of macro 'ldpp_dout'
 3702 |           ldpp_dout(dpp, 10) << "build_prior  prior osd." << so.osd
      |           ^~~~~~~~~
/tmp/B.yrz327wa/BUILD/ceph-17.2.3/src/common/dout.h:106:21: note: 'ceph::dout::dynamic_marker_t<T> ceph::dout::need_dynamic(T&&) [with T = unsigned int]' declared here
  106 | dynamic_marker_t<T> need_dynamic(T&& t) {
      |                     ^~~~~~~~~~~~
/tmp/B.yrz327wa/BUILD/ceph-17.2.3/src/osd/osd_types.h: In lambda function:
/tmp/B.yrz327wa/BUILD/ceph-17.2.3/src/common/dout.h:185:56: error: call to non-'constexpr' function 'ceph::dout::dynamic_marker_t<T> ceph::dout::need_dynamic(T&&) [with T = unsigned int]'
  185 |     dout_impl(pdpp->get_cct(), ceph::dout::need_dynamic(pdpp->get_subsys()), v) \
      |                                ~~~~~~~~~~~~~~~~~~~~~~~~^~~~~~~~~~~~~~~~~~~~
/tmp/B.yrz327wa/BUILD/ceph-17.2.3/src/common/dout.h:156:58: note: in definition of macro 'dout_impl'
  156 |       return (cctX->_conf->subsys.template should_gather<sub, v>());    \
      |                                                          ^~~
/tmp/B.yrz327wa/BUILD/ceph-17.2.3/src/osd/osd_types.h:3716:9: note: in expansion of macro 'ldpp_dout'
 3716 |         ldpp_dout(dpp, 10) << "build_prior  possibly went active+rw,"
      |         ^~~~~~~~~
/tmp/B.yrz327wa/BUILD/ceph-17.2.3/src/common/dout.h:106:21: note: 'ceph::dout::dynamic_marker_t<T> ceph::dout::need_dynamic(T&&) [with T = unsigned int]' declared here
  106 | dynamic_marker_t<T> need_dynamic(T&& t) {
      |                     ^~~~~~~~~~~~
/tmp/B.yrz327wa/BUILD/ceph-17.2.3/src/osd/osd_types.h: In lambda function:
/tmp/B.yrz327wa/BUILD/ceph-17.2.3/src/common/dout.h:185:56: error: call to non-'constexpr' function 'ceph::dout::dynamic_marker_t<T> ceph::dout::need_dynamic(T&&) [with T = unsigned int]'
  185 |     dout_impl(pdpp->get_cct(), ceph::dout::need_dynamic(pdpp->get_subsys()), v) \
      |                                ~~~~~~~~~~~~~~~~~~~~~~~~^~~~~~~~~~~~~~~~~~~~
/tmp/B.yrz327wa/BUILD/ceph-17.2.3/src/common/dout.h:156:58: note: in definition of macro 'dout_impl'
  156 |       return (cctX->_conf->subsys.template should_gather<sub, v>());    \
      |                                                          ^~~
/tmp/B.yrz327wa/BUILD/ceph-17.2.3/src/osd/osd_types.h:3726:3: note: in expansion of macro 'ldpp_dout'
 3726 |   ldpp_dout(dpp, 10) << "build_prior final: probe " << probe
      |   ^~~~~~~~~
/tmp/B.yrz327wa/BUILD/ceph-17.2.3/src/common/dout.h:106:21: note: 'ceph::dout::dynamic_marker_t<T> ceph::dout::need_dynamic(T&&) [with T = unsigned int]' declared here
  106 | dynamic_marker_t<T> need_dynamic(T&& t) {
      |                     ^~~~~~~~~~~~
In file included from /tmp/B.yrz327wa/BUILD/ceph-17.2.3/src/mon/Session.h:22,
                 from /tmp/B.yrz327wa/BUILD/ceph-17.2.3/src/messages/PaxosServiceMessage.h:7,
                 from /tmp/B.yrz327wa/BUILD/ceph-17.2.3/src/messages/MPGStats.h:19:
/tmp/B.yrz327wa/BUILD/ceph-17.2.3/src/include/xlist.h: At global scope:
/tmp/B.yrz327wa/BUILD/ceph-17.2.3/src/include/xlist.h:162:24: warning: 'template<class _Category, class _Tp, class _Distance, class _Pointer, class _Reference> struct std::iterator' is deprecated [-Wdeprecated-declarations]
  162 |   class iterator: std::iterator<std::forward_iterator_tag, T> {
      |                        ^~~~~~~~
/usr/include/c++/12.2.0/bits/stl_iterator_base_types.h:127:34: note: declared here
  127 |     struct _GLIBCXX17_DEPRECATED iterator
      |                                  ^~~~~~~~
/tmp/B.yrz327wa/BUILD/ceph-17.2.3/src/include/xlist.h:186:30: warning: 'template<class _Category, class _Tp, class _Distance, class _Pointer, class _Reference> struct std::iterator' is deprecated [-Wdeprecated-declarations]
  186 |   class const_iterator: std::iterator<std::forward_iterator_tag, T> {
      |                              ^~~~~~~~
/usr/include/c++/12.2.0/bits/stl_iterator_base_types.h:127:34: note: declared here
  127 |     struct _GLIBCXX17_DEPRECATED iterator
      |                                  ^~~~~~~~
/tmp/B.yrz327wa/BUILD/ceph-17.2.3/src/msg/Message.cc: In lambda function:
/tmp/B.yrz327wa/BUILD/ceph-17.2.3/src/msg/Message.cc:971:42: error: call to non-'constexpr' function 'ceph::dout::dynamic_marker_t<T> ceph::dout::need_dynamic(T&&) [with T = long long int&]'
  971 |       ldout(cct, ceph::dout::need_dynamic(
      |                  ~~~~~~~~~~~~~~~~~~~~~~~~^
  972 |         cct->_conf->ms_dump_corrupt_message_level)) << "dump: \n";
      |         ~~~~~~~~~~~~~~~~~~~~~~~~~~~~~~~~~~~~~~~~~~
/tmp/B.yrz327wa/BUILD/ceph-17.2.3/src/common/dout.h:156:63: note: in definition of macro 'dout_impl'
  156 |       return (cctX->_conf->subsys.template should_gather<sub, v>());    \
      |                                                               ^
/tmp/B.yrz327wa/BUILD/ceph-17.2.3/src/msg/Message.cc:971:7: note: in expansion of macro 'ldout'
  971 |       ldout(cct, ceph::dout::need_dynamic(
      |       ^~~~~
/tmp/B.yrz327wa/BUILD/ceph-17.2.3/src/common/dout.h:106:21: note: 'ceph::dout::dynamic_marker_t<T> ceph::dout::need_dynamic(T&&) [with T = long long int&]' declared here
  106 | dynamic_marker_t<T> need_dynamic(T&& t) {
      |                     ^~~~~~~~~~~~
make[2]: *** [src/msg/CMakeFiles/common-msg-objs.dir/build.make:93: src/msg/CMakeFiles/common-msg-objs.dir/Message.cc.o] Error 1
make[2]: Leaving directory '/tmp/B.yrz327wa/BUILD/ceph-17.2.3/build'
make[2]: *** Waiting for unfinished jobs....
make[2]: Entering directory '/tmp/B.yrz327wa/BUILD/ceph-17.2.3/build'
[  6%] Building CXX object src/msg/CMakeFiles/common-msg-objs.dir/async/AsyncConnection.cc.o
cd /tmp/B.yrz327wa/BUILD/ceph-17.2.3/build/src/msg && /usr/bin/i686-pld-linux-g++ -DBOOST_ASIO_DISABLE_THREAD_KEYWORD_EXTENSION -DBOOST_ASIO_USE_TS_EXECUTOR_AS_DEFAULT -DHAVE_CONFIG_H -D_FILE_OFFSET_BITS=64 -D_FORTIFY_SOURCE=2 -D_GNU_SOURCE -D_REENTRANT -D_THREAD_SAFE -D__CEPH__ -D__STDC_FORMAT_MACROS -D__linux__ -I/tmp/B.yrz327wa/BUILD/ceph-17.2.3/build/src/include -I/tmp/B.yrz327wa/BUILD/ceph-17.2.3/src -isystem /tmp/B.yrz327wa/BUILD/ceph-17.2.3/build/include -isystem /tmp/B.yrz327wa/BUILD/ceph-17.2.3/src/xxHash -isystem /tmp/B.yrz327wa/BUILD/ceph-17.2.3/src/rapidjson/include -O2 -fwrapv -pipe -Wformat -Werror=format-security -gdwarf-4 -fno-debug-types-section -fvar-tracking-assignments -g2 -Wp,-D_FORTIFY_SOURCE=2 -fstack-protector-strong --param=ssp-buffer-size=4 -Werror=trampolines -fomit-frame-pointer -march=i686 -fasynchronous-unwind-tables -mtune=pentium4 -gdwarf-4 -fno-debug-types-section -fvar-tracking-assignments -g2  -DNDEBUG -DQT_NO_DEBUG -fPIC   -U_FORTIFY_SOURCE -Wall -fno-strict-aliasing -fsigned-char -Wtype-limits -Wignored-qualifiers -Wpointer-arith -Werror=format-security -Winit-self -Wno-unknown-pragmas -Wnon-virtual-dtor -Wno-ignored-qualifiers -ftemplate-depth-1024 -Wpessimizing-move -Wredundant-move -Wstrict-null-sentinel -Woverloaded-virtual -fno-new-ttp-matching -fstack-protector-strong -fdiagnostics-color=auto -fno-builtin-malloc -fno-builtin-calloc -fno-builtin-realloc -fno-builtin-free -std=c++17 -MD -MT src/msg/CMakeFiles/common-msg-objs.dir/async/AsyncConnection.cc.o -MF CMakeFiles/common-msg-objs.dir/async/AsyncConnection.cc.o.d -o CMakeFiles/common-msg-objs.dir/async/AsyncConnection.cc.o -c /tmp/B.yrz327wa/BUILD/ceph-17.2.3/src/msg/async/AsyncConnection.cc
In file included from /tmp/B.yrz327wa/BUILD/ceph-17.2.3/src/msg/async/AsyncMessenger.h:23,
                 from /tmp/B.yrz327wa/BUILD/ceph-17.2.3/src/msg/async/AsyncConnection.cc:22:
/tmp/B.yrz327wa/BUILD/ceph-17.2.3/src/include/xlist.h:162:24: warning: 'template<class _Category, class _Tp, class _Distance, class _Pointer, class _Reference> struct std::iterator' is deprecated [-Wdeprecated-declarations]
  162 |   class iterator: std::iterator<std::forward_iterator_tag, T> {
      |                        ^~~~~~~~
In file included from /usr/include/c++/12.2.0/string:45,
                 from /tmp/B.yrz327wa/BUILD/ceph-17.2.3/src/include/ceph_assert.h:5,
                 from /tmp/B.yrz327wa/BUILD/ceph-17.2.3/src/common/dout.h:21,
                 from /tmp/B.yrz327wa/BUILD/ceph-17.2.3/src/include/Context.h:19,
                 from /tmp/B.yrz327wa/BUILD/ceph-17.2.3/src/msg/async/AsyncConnection.cc:19:
/usr/include/c++/12.2.0/bits/stl_iterator_base_types.h:127:34: note: declared here
  127 |     struct _GLIBCXX17_DEPRECATED iterator
      |                                  ^~~~~~~~
/tmp/B.yrz327wa/BUILD/ceph-17.2.3/src/include/xlist.h:186:30: warning: 'template<class _Category, class _Tp, class _Distance, class _Pointer, class _Reference> struct std::iterator' is deprecated [-Wdeprecated-declarations]
  186 |   class const_iterator: std::iterator<std::forward_iterator_tag, T> {
      |                              ^~~~~~~~
/usr/include/c++/12.2.0/bits/stl_iterator_base_types.h:127:34: note: declared here
  127 |     struct _GLIBCXX17_DEPRECATED iterator
      |                                  ^~~~~~~~
In file included from /tmp/B.yrz327wa/BUILD/ceph-17.2.3/src/librados/ListObjectImpl.h:19,
                 from /tmp/B.yrz327wa/BUILD/ceph-17.2.3/src/osd/osd_types.h:51,
                 from /tmp/B.yrz327wa/BUILD/ceph-17.2.3/src/messages/MOSDFastDispatchOp.h:8,
                 from /tmp/B.yrz327wa/BUILD/ceph-17.2.3/src/messages/MOSDOp.h:21,
                 from /tmp/B.yrz327wa/BUILD/ceph-17.2.3/src/msg/async/AsyncConnection.cc:28:
/tmp/B.yrz327wa/BUILD/ceph-17.2.3/src/include/rados/librados.hpp:107:54: warning: 'template<class _Category, class _Tp, class _Distance, class _Pointer, class _Reference> struct std::iterator' is deprecated [-Wdeprecated-declarations]
  107 |   class CEPH_RADOS_API NObjectIterator : public std::iterator <std::forward_iterator_tag, ListObject> {
      |                                                      ^~~~~~~~
/usr/include/c++/12.2.0/bits/stl_iterator_base_types.h:127:34: note: declared here
  127 |     struct _GLIBCXX17_DEPRECATED iterator
      |                                  ^~~~~~~~
/tmp/B.yrz327wa/BUILD/ceph-17.2.3/src/osd/osd_types.h: In lambda function:
/tmp/B.yrz327wa/BUILD/ceph-17.2.3/src/common/dout.h:185:56: error: call to non-'constexpr' function 'ceph::dout::dynamic_marker_t<T> ceph::dout::need_dynamic(T&&) [with T = unsigned int]'
  185 |     dout_impl(pdpp->get_cct(), ceph::dout::need_dynamic(pdpp->get_subsys()), v) \
      |                                ~~~~~~~~~~~~~~~~~~~~~~~~^~~~~~~~~~~~~~~~~~~~
/tmp/B.yrz327wa/BUILD/ceph-17.2.3/src/common/dout.h:156:58: note: in definition of macro 'dout_impl'
  156 |       return (cctX->_conf->subsys.template should_gather<sub, v>());    \
      |                                                          ^~~
/tmp/B.yrz327wa/BUILD/ceph-17.2.3/src/osd/osd_types.h:3651:3: note: in expansion of macro 'ldpp_dout'
 3651 |   ldpp_dout(dpp, 10) << "build_prior all_probe " << all_probe << dendl;
      |   ^~~~~~~~~
/tmp/B.yrz327wa/BUILD/ceph-17.2.3/src/common/dout.h:106:21: note: 'ceph::dout::dynamic_marker_t<T> ceph::dout::need_dynamic(T&&) [with T = unsigned int]' declared here
  106 | dynamic_marker_t<T> need_dynamic(T&& t) {
      |                     ^~~~~~~~~~~~
/tmp/B.yrz327wa/BUILD/ceph-17.2.3/src/osd/osd_types.h: In lambda function:
/tmp/B.yrz327wa/BUILD/ceph-17.2.3/src/common/dout.h:185:56: error: call to non-'constexpr' function 'ceph::dout::dynamic_marker_t<T> ceph::dout::need_dynamic(T&&) [with T = unsigned int]'
  185 |     dout_impl(pdpp->get_cct(), ceph::dout::need_dynamic(pdpp->get_subsys()), v) \
      |                                ~~~~~~~~~~~~~~~~~~~~~~~~^~~~~~~~~~~~~~~~~~~~
/tmp/B.yrz327wa/BUILD/ceph-17.2.3/src/common/dout.h:156:58: note: in definition of macro 'dout_impl'
  156 |       return (cctX->_conf->subsys.template should_gather<sub, v>());    \
      |                                                          ^~~
/tmp/B.yrz327wa/BUILD/ceph-17.2.3/src/osd/osd_types.h:3670:7: note: in expansion of macro 'ldpp_dout'
 3670 |       ldpp_dout(dpp, 10) << "build_prior maybe_rw interval:" << start
      |       ^~~~~~~~~
/tmp/B.yrz327wa/BUILD/ceph-17.2.3/src/common/dout.h:106:21: note: 'ceph::dout::dynamic_marker_t<T> ceph::dout::need_dynamic(T&&) [with T = unsigned int]' declared here
  106 | dynamic_marker_t<T> need_dynamic(T&& t) {
      |                     ^~~~~~~~~~~~
/tmp/B.yrz327wa/BUILD/ceph-17.2.3/src/osd/osd_types.h: In lambda function:
/tmp/B.yrz327wa/BUILD/ceph-17.2.3/src/common/dout.h:185:56: error: call to non-'constexpr' function 'ceph::dout::dynamic_marker_t<T> ceph::dout::need_dynamic(T&&) [with T = unsigned int]'
  185 |     dout_impl(pdpp->get_cct(), ceph::dout::need_dynamic(pdpp->get_subsys()), v) \
      |                                ~~~~~~~~~~~~~~~~~~~~~~~~^~~~~~~~~~~~~~~~~~~~
/tmp/B.yrz327wa/BUILD/ceph-17.2.3/src/common/dout.h:156:58: note: in definition of macro 'dout_impl'
  156 |       return (cctX->_conf->subsys.template should_gather<sub, v>());    \
      |                                                          ^~~
/tmp/B.yrz327wa/BUILD/ceph-17.2.3/src/osd/osd_types.h:3691:11: note: in expansion of macro 'ldpp_dout'
 3691 |           ldpp_dout(dpp, 10) << "build_prior  prior osd." << so.osd
      |           ^~~~~~~~~
/tmp/B.yrz327wa/BUILD/ceph-17.2.3/src/common/dout.h:106:21: note: 'ceph::dout::dynamic_marker_t<T> ceph::dout::need_dynamic(T&&) [with T = unsigned int]' declared here
  106 | dynamic_marker_t<T> need_dynamic(T&& t) {
      |                     ^~~~~~~~~~~~
/tmp/B.yrz327wa/BUILD/ceph-17.2.3/src/osd/osd_types.h: In lambda function:
/tmp/B.yrz327wa/BUILD/ceph-17.2.3/src/common/dout.h:185:56: error: call to non-'constexpr' function 'ceph::dout::dynamic_marker_t<T> ceph::dout::need_dynamic(T&&) [with T = unsigned int]'
  185 |     dout_impl(pdpp->get_cct(), ceph::dout::need_dynamic(pdpp->get_subsys()), v) \
      |                                ~~~~~~~~~~~~~~~~~~~~~~~~^~~~~~~~~~~~~~~~~~~~
/tmp/B.yrz327wa/BUILD/ceph-17.2.3/src/common/dout.h:156:58: note: in definition of macro 'dout_impl'
  156 |       return (cctX->_conf->subsys.template should_gather<sub, v>());    \
      |                                                          ^~~
/tmp/B.yrz327wa/BUILD/ceph-17.2.3/src/osd/osd_types.h:3696:11: note: in expansion of macro 'ldpp_dout'
 3696 |           ldpp_dout(dpp, 10) << "build_prior  prior osd." << so.osd
      |           ^~~~~~~~~
/tmp/B.yrz327wa/BUILD/ceph-17.2.3/src/common/dout.h:106:21: note: 'ceph::dout::dynamic_marker_t<T> ceph::dout::need_dynamic(T&&) [with T = unsigned int]' declared here
  106 | dynamic_marker_t<T> need_dynamic(T&& t) {
      |                     ^~~~~~~~~~~~
/tmp/B.yrz327wa/BUILD/ceph-17.2.3/src/osd/osd_types.h: In lambda function:
/tmp/B.yrz327wa/BUILD/ceph-17.2.3/src/common/dout.h:185:56: error: call to non-'constexpr' function 'ceph::dout::dynamic_marker_t<T> ceph::dout::need_dynamic(T&&) [with T = unsigned int]'
  185 |     dout_impl(pdpp->get_cct(), ceph::dout::need_dynamic(pdpp->get_subsys()), v) \
      |                                ~~~~~~~~~~~~~~~~~~~~~~~~^~~~~~~~~~~~~~~~~~~~
/tmp/B.yrz327wa/BUILD/ceph-17.2.3/src/common/dout.h:156:58: note: in definition of macro 'dout_impl'
  156 |       return (cctX->_conf->subsys.template should_gather<sub, v>());    \
      |                                                          ^~~
/tmp/B.yrz327wa/BUILD/ceph-17.2.3/src/osd/osd_types.h:3702:11: note: in expansion of macro 'ldpp_dout'
 3702 |           ldpp_dout(dpp, 10) << "build_prior  prior osd." << so.osd
      |           ^~~~~~~~~
/tmp/B.yrz327wa/BUILD/ceph-17.2.3/src/common/dout.h:106:21: note: 'ceph::dout::dynamic_marker_t<T> ceph::dout::need_dynamic(T&&) [with T = unsigned int]' declared here
  106 | dynamic_marker_t<T> need_dynamic(T&& t) {
      |                     ^~~~~~~~~~~~
/tmp/B.yrz327wa/BUILD/ceph-17.2.3/src/osd/osd_types.h: In lambda function:
/tmp/B.yrz327wa/BUILD/ceph-17.2.3/src/common/dout.h:185:56: error: call to non-'constexpr' function 'ceph::dout::dynamic_marker_t<T> ceph::dout::need_dynamic(T&&) [with T = unsigned int]'
  185 |     dout_impl(pdpp->get_cct(), ceph::dout::need_dynamic(pdpp->get_subsys()), v) \
      |                                ~~~~~~~~~~~~~~~~~~~~~~~~^~~~~~~~~~~~~~~~~~~~
/tmp/B.yrz327wa/BUILD/ceph-17.2.3/src/common/dout.h:156:58: note: in definition of macro 'dout_impl'
  156 |       return (cctX->_conf->subsys.template should_gather<sub, v>());    \
      |                                                          ^~~
/tmp/B.yrz327wa/BUILD/ceph-17.2.3/src/osd/osd_types.h:3716:9: note: in expansion of macro 'ldpp_dout'
 3716 |         ldpp_dout(dpp, 10) << "build_prior  possibly went active+rw,"
      |         ^~~~~~~~~
/tmp/B.yrz327wa/BUILD/ceph-17.2.3/src/common/dout.h:106:21: note: 'ceph::dout::dynamic_marker_t<T> ceph::dout::need_dynamic(T&&) [with T = unsigned int]' declared here
  106 | dynamic_marker_t<T> need_dynamic(T&& t) {
      |                     ^~~~~~~~~~~~
/tmp/B.yrz327wa/BUILD/ceph-17.2.3/src/osd/osd_types.h: In lambda function:
/tmp/B.yrz327wa/BUILD/ceph-17.2.3/src/common/dout.h:185:56: error: call to non-'constexpr' function 'ceph::dout::dynamic_marker_t<T> ceph::dout::need_dynamic(T&&) [with T = unsigned int]'
  185 |     dout_impl(pdpp->get_cct(), ceph::dout::need_dynamic(pdpp->get_subsys()), v) \
      |                                ~~~~~~~~~~~~~~~~~~~~~~~~^~~~~~~~~~~~~~~~~~~~
/tmp/B.yrz327wa/BUILD/ceph-17.2.3/src/common/dout.h:156:58: note: in definition of macro 'dout_impl'
  156 |       return (cctX->_conf->subsys.template should_gather<sub, v>());    \
      |                                                          ^~~
/tmp/B.yrz327wa/BUILD/ceph-17.2.3/src/osd/osd_types.h:3726:3: note: in expansion of macro 'ldpp_dout'
 3726 |   ldpp_dout(dpp, 10) << "build_prior final: probe " << probe
      |   ^~~~~~~~~
/tmp/B.yrz327wa/BUILD/ceph-17.2.3/src/common/dout.h:106:21: note: 'ceph::dout::dynamic_marker_t<T> ceph::dout::need_dynamic(T&&) [with T = unsigned int]' declared here
  106 | dynamic_marker_t<T> need_dynamic(T&& t) {
      |                     ^~~~~~~~~~~~
make[2]: *** [src/msg/CMakeFiles/common-msg-objs.dir/build.make:163: src/msg/CMakeFiles/common-msg-objs.dir/async/AsyncConnection.cc.o] Error 1
make[2]: Leaving directory '/tmp/B.yrz327wa/BUILD/ceph-17.2.3/build'
make[2]: Entering directory '/tmp/B.yrz327wa/BUILD/ceph-17.2.3/build'
[  6%] Building CXX object src/msg/CMakeFiles/common-msg-objs.dir/async/AsyncMessenger.cc.o
cd /tmp/B.yrz327wa/BUILD/ceph-17.2.3/build/src/msg && /usr/bin/i686-pld-linux-g++ -DBOOST_ASIO_DISABLE_THREAD_KEYWORD_EXTENSION -DBOOST_ASIO_USE_TS_EXECUTOR_AS_DEFAULT -DHAVE_CONFIG_H -D_FILE_OFFSET_BITS=64 -D_FORTIFY_SOURCE=2 -D_GNU_SOURCE -D_REENTRANT -D_THREAD_SAFE -D__CEPH__ -D__STDC_FORMAT_MACROS -D__linux__ -I/tmp/B.yrz327wa/BUILD/ceph-17.2.3/build/src/include -I/tmp/B.yrz327wa/BUILD/ceph-17.2.3/src -isystem /tmp/B.yrz327wa/BUILD/ceph-17.2.3/build/include -isystem /tmp/B.yrz327wa/BUILD/ceph-17.2.3/src/xxHash -isystem /tmp/B.yrz327wa/BUILD/ceph-17.2.3/src/rapidjson/include -O2 -fwrapv -pipe -Wformat -Werror=format-security -gdwarf-4 -fno-debug-types-section -fvar-tracking-assignments -g2 -Wp,-D_FORTIFY_SOURCE=2 -fstack-protector-strong --param=ssp-buffer-size=4 -Werror=trampolines -fomit-frame-pointer -march=i686 -fasynchronous-unwind-tables -mtune=pentium4 -gdwarf-4 -fno-debug-types-section -fvar-tracking-assignments -g2  -DNDEBUG -DQT_NO_DEBUG -fPIC   -U_FORTIFY_SOURCE -Wall -fno-strict-aliasing -fsigned-char -Wtype-limits -Wignored-qualifiers -Wpointer-arith -Werror=format-security -Winit-self -Wno-unknown-pragmas -Wnon-virtual-dtor -Wno-ignored-qualifiers -ftemplate-depth-1024 -Wpessimizing-move -Wredundant-move -Wstrict-null-sentinel -Woverloaded-virtual -fno-new-ttp-matching -fstack-protector-strong -fdiagnostics-color=auto -fno-builtin-malloc -fno-builtin-calloc -fno-builtin-realloc -fno-builtin-free -std=c++17 -MD -MT src/msg/CMakeFiles/common-msg-objs.dir/async/AsyncMessenger.cc.o -MF CMakeFiles/common-msg-objs.dir/async/AsyncMessenger.cc.o.d -o CMakeFiles/common-msg-objs.dir/async/AsyncMessenger.cc.o -c /tmp/B.yrz327wa/BUILD/ceph-17.2.3/src/msg/async/AsyncMessenger.cc
In file included from /tmp/B.yrz327wa/BUILD/ceph-17.2.3/src/msg/async/AsyncMessenger.h:23,
                 from /tmp/B.yrz327wa/BUILD/ceph-17.2.3/src/msg/async/AsyncMessenger.cc:22:
/tmp/B.yrz327wa/BUILD/ceph-17.2.3/src/include/xlist.h:162:24: warning: 'template<class _Category, class _Tp, class _Distance, class _Pointer, class _Reference> struct std::iterator' is deprecated [-Wdeprecated-declarations]
  162 |   class iterator: std::iterator<std::forward_iterator_tag, T> {
      |                        ^~~~~~~~
In file included from /usr/include/c++/12.2.0/string:45,
                 from /usr/include/c++/12.2.0/bits/locale_classes.h:40,
                 from /usr/include/c++/12.2.0/bits/ios_base.h:41,
                 from /usr/include/c++/12.2.0/ios:42,
                 from /usr/include/c++/12.2.0/ostream:38,
                 from /usr/include/c++/12.2.0/iostream:39,
                 from /tmp/B.yrz327wa/BUILD/ceph-17.2.3/src/msg/async/AsyncMessenger.cc:19:
/usr/include/c++/12.2.0/bits/stl_iterator_base_types.h:127:34: note: declared here
  127 |     struct _GLIBCXX17_DEPRECATED iterator
      |                                  ^~~~~~~~
/tmp/B.yrz327wa/BUILD/ceph-17.2.3/src/include/xlist.h:186:30: warning: 'template<class _Category, class _Tp, class _Distance, class _Pointer, class _Reference> struct std::iterator' is deprecated [-Wdeprecated-declarations]
  186 |   class const_iterator: std::iterator<std::forward_iterator_tag, T> {
      |                              ^~~~~~~~
/usr/include/c++/12.2.0/bits/stl_iterator_base_types.h:127:34: note: declared here
  127 |     struct _GLIBCXX17_DEPRECATED iterator
      |                                  ^~~~~~~~
In file included from /tmp/B.yrz327wa/BUILD/ceph-17.2.3/src/librados/ListObjectImpl.h:19,
                 from /tmp/B.yrz327wa/BUILD/ceph-17.2.3/src/osd/osd_types.h:51,
                 from /tmp/B.yrz327wa/BUILD/ceph-17.2.3/src/messages/MOSDFastDispatchOp.h:8,
                 from /tmp/B.yrz327wa/BUILD/ceph-17.2.3/src/messages/MOSDOp.h:21,
                 from /tmp/B.yrz327wa/BUILD/ceph-17.2.3/src/msg/async/AsyncMessenger.cc:28:
/tmp/B.yrz327wa/BUILD/ceph-17.2.3/src/include/rados/librados.hpp:107:54: warning: 'template<class _Category, class _Tp, class _Distance, class _Pointer, class _Reference> struct std::iterator' is deprecated [-Wdeprecated-declarations]
  107 |   class CEPH_RADOS_API NObjectIterator : public std::iterator <std::forward_iterator_tag, ListObject> {
      |                                                      ^~~~~~~~
/usr/include/c++/12.2.0/bits/stl_iterator_base_types.h:127:34: note: declared here
  127 |     struct _GLIBCXX17_DEPRECATED iterator
      |                                  ^~~~~~~~
In file included from /tmp/B.yrz327wa/BUILD/ceph-17.2.3/src/include/Context.h:19,
                 from /tmp/B.yrz327wa/BUILD/ceph-17.2.3/src/common/Cond.h:21,
                 from /tmp/B.yrz327wa/BUILD/ceph-17.2.3/src/msg/async/AsyncMessenger.h:29:
/tmp/B.yrz327wa/BUILD/ceph-17.2.3/src/osd/osd_types.h: In lambda function:
/tmp/B.yrz327wa/BUILD/ceph-17.2.3/src/common/dout.h:185:56: error: call to non-'constexpr' function 'ceph::dout::dynamic_marker_t<T> ceph::dout::need_dynamic(T&&) [with T = unsigned int]'
  185 |     dout_impl(pdpp->get_cct(), ceph::dout::need_dynamic(pdpp->get_subsys()), v) \
      |                                ~~~~~~~~~~~~~~~~~~~~~~~~^~~~~~~~~~~~~~~~~~~~
/tmp/B.yrz327wa/BUILD/ceph-17.2.3/src/common/dout.h:156:58: note: in definition of macro 'dout_impl'
  156 |       return (cctX->_conf->subsys.template should_gather<sub, v>());    \
      |                                                          ^~~
/tmp/B.yrz327wa/BUILD/ceph-17.2.3/src/osd/osd_types.h:3651:3: note: in expansion of macro 'ldpp_dout'
 3651 |   ldpp_dout(dpp, 10) << "build_prior all_probe " << all_probe << dendl;
      |   ^~~~~~~~~
/tmp/B.yrz327wa/BUILD/ceph-17.2.3/src/common/dout.h:106:21: note: 'ceph::dout::dynamic_marker_t<T> ceph::dout::need_dynamic(T&&) [with T = unsigned int]' declared here
  106 | dynamic_marker_t<T> need_dynamic(T&& t) {
      |                     ^~~~~~~~~~~~
/tmp/B.yrz327wa/BUILD/ceph-17.2.3/src/osd/osd_types.h: In lambda function:
/tmp/B.yrz327wa/BUILD/ceph-17.2.3/src/common/dout.h:185:56: error: call to non-'constexpr' function 'ceph::dout::dynamic_marker_t<T> ceph::dout::need_dynamic(T&&) [with T = unsigned int]'
  185 |     dout_impl(pdpp->get_cct(), ceph::dout::need_dynamic(pdpp->get_subsys()), v) \
      |                                ~~~~~~~~~~~~~~~~~~~~~~~~^~~~~~~~~~~~~~~~~~~~
/tmp/B.yrz327wa/BUILD/ceph-17.2.3/src/common/dout.h:156:58: note: in definition of macro 'dout_impl'
  156 |       return (cctX->_conf->subsys.template should_gather<sub, v>());    \
      |                                                          ^~~
/tmp/B.yrz327wa/BUILD/ceph-17.2.3/src/osd/osd_types.h:3670:7: note: in expansion of macro 'ldpp_dout'
 3670 |       ldpp_dout(dpp, 10) << "build_prior maybe_rw interval:" << start
      |       ^~~~~~~~~
/tmp/B.yrz327wa/BUILD/ceph-17.2.3/src/common/dout.h:106:21: note: 'ceph::dout::dynamic_marker_t<T> ceph::dout::need_dynamic(T&&) [with T = unsigned int]' declared here
  106 | dynamic_marker_t<T> need_dynamic(T&& t) {
      |                     ^~~~~~~~~~~~
/tmp/B.yrz327wa/BUILD/ceph-17.2.3/src/osd/osd_types.h: In lambda function:
/tmp/B.yrz327wa/BUILD/ceph-17.2.3/src/common/dout.h:185:56: error: call to non-'constexpr' function 'ceph::dout::dynamic_marker_t<T> ceph::dout::need_dynamic(T&&) [with T = unsigned int]'
  185 |     dout_impl(pdpp->get_cct(), ceph::dout::need_dynamic(pdpp->get_subsys()), v) \
      |                                ~~~~~~~~~~~~~~~~~~~~~~~~^~~~~~~~~~~~~~~~~~~~
/tmp/B.yrz327wa/BUILD/ceph-17.2.3/src/common/dout.h:156:58: note: in definition of macro 'dout_impl'
  156 |       return (cctX->_conf->subsys.template should_gather<sub, v>());    \
      |                                                          ^~~
/tmp/B.yrz327wa/BUILD/ceph-17.2.3/src/osd/osd_types.h:3691:11: note: in expansion of macro 'ldpp_dout'
 3691 |           ldpp_dout(dpp, 10) << "build_prior  prior osd." << so.osd
      |           ^~~~~~~~~
/tmp/B.yrz327wa/BUILD/ceph-17.2.3/src/common/dout.h:106:21: note: 'ceph::dout::dynamic_marker_t<T> ceph::dout::need_dynamic(T&&) [with T = unsigned int]' declared here
  106 | dynamic_marker_t<T> need_dynamic(T&& t) {
      |                     ^~~~~~~~~~~~
/tmp/B.yrz327wa/BUILD/ceph-17.2.3/src/osd/osd_types.h: In lambda function:
/tmp/B.yrz327wa/BUILD/ceph-17.2.3/src/common/dout.h:185:56: error: call to non-'constexpr' function 'ceph::dout::dynamic_marker_t<T> ceph::dout::need_dynamic(T&&) [with T = unsigned int]'
  185 |     dout_impl(pdpp->get_cct(), ceph::dout::need_dynamic(pdpp->get_subsys()), v) \
      |                                ~~~~~~~~~~~~~~~~~~~~~~~~^~~~~~~~~~~~~~~~~~~~
/tmp/B.yrz327wa/BUILD/ceph-17.2.3/src/common/dout.h:156:58: note: in definition of macro 'dout_impl'
  156 |       return (cctX->_conf->subsys.template should_gather<sub, v>());    \
      |                                                          ^~~
/tmp/B.yrz327wa/BUILD/ceph-17.2.3/src/osd/osd_types.h:3696:11: note: in expansion of macro 'ldpp_dout'
 3696 |           ldpp_dout(dpp, 10) << "build_prior  prior osd." << so.osd
      |           ^~~~~~~~~
/tmp/B.yrz327wa/BUILD/ceph-17.2.3/src/common/dout.h:106:21: note: 'ceph::dout::dynamic_marker_t<T> ceph::dout::need_dynamic(T&&) [with T = unsigned int]' declared here
  106 | dynamic_marker_t<T> need_dynamic(T&& t) {
      |                     ^~~~~~~~~~~~
/tmp/B.yrz327wa/BUILD/ceph-17.2.3/src/osd/osd_types.h: In lambda function:
/tmp/B.yrz327wa/BUILD/ceph-17.2.3/src/common/dout.h:185:56: error: call to non-'constexpr' function 'ceph::dout::dynamic_marker_t<T> ceph::dout::need_dynamic(T&&) [with T = unsigned int]'
  185 |     dout_impl(pdpp->get_cct(), ceph::dout::need_dynamic(pdpp->get_subsys()), v) \
      |                                ~~~~~~~~~~~~~~~~~~~~~~~~^~~~~~~~~~~~~~~~~~~~
/tmp/B.yrz327wa/BUILD/ceph-17.2.3/src/common/dout.h:156:58: note: in definition of macro 'dout_impl'
  156 |       return (cctX->_conf->subsys.template should_gather<sub, v>());    \
      |                                                          ^~~
/tmp/B.yrz327wa/BUILD/ceph-17.2.3/src/osd/osd_types.h:3702:11: note: in expansion of macro 'ldpp_dout'
 3702 |           ldpp_dout(dpp, 10) << "build_prior  prior osd." << so.osd
      |           ^~~~~~~~~
/tmp/B.yrz327wa/BUILD/ceph-17.2.3/src/common/dout.h:106:21: note: 'ceph::dout::dynamic_marker_t<T> ceph::dout::need_dynamic(T&&) [with T = unsigned int]' declared here
  106 | dynamic_marker_t<T> need_dynamic(T&& t) {
      |                     ^~~~~~~~~~~~
/tmp/B.yrz327wa/BUILD/ceph-17.2.3/src/osd/osd_types.h: In lambda function:
/tmp/B.yrz327wa/BUILD/ceph-17.2.3/src/common/dout.h:185:56: error: call to non-'constexpr' function 'ceph::dout::dynamic_marker_t<T> ceph::dout::need_dynamic(T&&) [with T = unsigned int]'
  185 |     dout_impl(pdpp->get_cct(), ceph::dout::need_dynamic(pdpp->get_subsys()), v) \
      |                                ~~~~~~~~~~~~~~~~~~~~~~~~^~~~~~~~~~~~~~~~~~~~
/tmp/B.yrz327wa/BUILD/ceph-17.2.3/src/common/dout.h:156:58: note: in definition of macro 'dout_impl'
  156 |       return (cctX->_conf->subsys.template should_gather<sub, v>());    \
      |                                                          ^~~
/tmp/B.yrz327wa/BUILD/ceph-17.2.3/src/osd/osd_types.h:3716:9: note: in expansion of macro 'ldpp_dout'
 3716 |         ldpp_dout(dpp, 10) << "build_prior  possibly went active+rw,"
      |         ^~~~~~~~~
/tmp/B.yrz327wa/BUILD/ceph-17.2.3/src/common/dout.h:106:21: note: 'ceph::dout::dynamic_marker_t<T> ceph::dout::need_dynamic(T&&) [with T = unsigned int]' declared here
  106 | dynamic_marker_t<T> need_dynamic(T&& t) {
      |                     ^~~~~~~~~~~~
/tmp/B.yrz327wa/BUILD/ceph-17.2.3/src/osd/osd_types.h: In lambda function:
/tmp/B.yrz327wa/BUILD/ceph-17.2.3/src/common/dout.h:185:56: error: call to non-'constexpr' function 'ceph::dout::dynamic_marker_t<T> ceph::dout::need_dynamic(T&&) [with T = unsigned int]'
  185 |     dout_impl(pdpp->get_cct(), ceph::dout::need_dynamic(pdpp->get_subsys()), v) \
      |                                ~~~~~~~~~~~~~~~~~~~~~~~~^~~~~~~~~~~~~~~~~~~~
/tmp/B.yrz327wa/BUILD/ceph-17.2.3/src/common/dout.h:156:58: note: in definition of macro 'dout_impl'
  156 |       return (cctX->_conf->subsys.template should_gather<sub, v>());    \
      |                                                          ^~~
/tmp/B.yrz327wa/BUILD/ceph-17.2.3/src/osd/osd_types.h:3726:3: note: in expansion of macro 'ldpp_dout'
 3726 |   ldpp_dout(dpp, 10) << "build_prior final: probe " << probe
      |   ^~~~~~~~~
/tmp/B.yrz327wa/BUILD/ceph-17.2.3/src/common/dout.h:106:21: note: 'ceph::dout::dynamic_marker_t<T> ceph::dout::need_dynamic(T&&) [with T = unsigned int]' declared here
  106 | dynamic_marker_t<T> need_dynamic(T&& t) {
      |                     ^~~~~~~~~~~~
make[2]: *** [src/msg/CMakeFiles/common-msg-objs.dir/build.make:177: src/msg/CMakeFiles/common-msg-objs.dir/async/AsyncMessenger.cc.o] Error 1
make[2]: Leaving directory '/tmp/B.yrz327wa/BUILD/ceph-17.2.3/build'
make[2]: Entering directory '/tmp/B.yrz327wa/BUILD/ceph-17.2.3/build'
[  6%] Building CXX object src/common/options/CMakeFiles/common-options-objs.dir/rbd_options.cc.o
cd /tmp/B.yrz327wa/BUILD/ceph-17.2.3/build/src/common/options && /usr/bin/i686-pld-linux-g++ -DBOOST_ASIO_DISABLE_THREAD_KEYWORD_EXTENSION -DBOOST_ASIO_USE_TS_EXECUTOR_AS_DEFAULT -DHAVE_CONFIG_H -D_FILE_OFFSET_BITS=64 -D_FORTIFY_SOURCE=2 -D_GNU_SOURCE -D_REENTRANT -D_THREAD_SAFE -D__CEPH__ -D__STDC_FORMAT_MACROS -D__linux__ -I/tmp/B.yrz327wa/BUILD/ceph-17.2.3/build/src/include -I/tmp/B.yrz327wa/BUILD/ceph-17.2.3/src -isystem /tmp/B.yrz327wa/BUILD/ceph-17.2.3/build/include -isystem /tmp/B.yrz327wa/BUILD/ceph-17.2.3/src/xxHash -isystem /tmp/B.yrz327wa/BUILD/ceph-17.2.3/src/rapidjson/include -O2 -fwrapv -pipe -Wformat -Werror=format-security -gdwarf-4 -fno-debug-types-section -fvar-tracking-assignments -g2 -Wp,-D_FORTIFY_SOURCE=2 -fstack-protector-strong --param=ssp-buffer-size=4 -Werror=trampolines -fomit-frame-pointer -march=i686 -fasynchronous-unwind-tables -mtune=pentium4 -gdwarf-4 -fno-debug-types-section -fvar-tracking-assignments -g2  -DNDEBUG -DQT_NO_DEBUG -fPIC   -U_FORTIFY_SOURCE -Wall -fno-strict-aliasing -fsigned-char -Wtype-limits -Wignored-qualifiers -Wpointer-arith -Werror=format-security -Winit-self -Wno-unknown-pragmas -Wnon-virtual-dtor -Wno-ignored-qualifiers -ftemplate-depth-1024 -Wpessimizing-move -Wredundant-move -Wstrict-null-sentinel -Woverloaded-virtual -fno-new-ttp-matching -fstack-protector-strong -fdiagnostics-color=auto -fno-builtin-malloc -fno-builtin-calloc -fno-builtin-realloc -fno-builtin-free -std=c++17 -MD -MT src/common/options/CMakeFiles/common-options-objs.dir/rbd_options.cc.o -MF CMakeFiles/common-options-objs.dir/rbd_options.cc.o.d -o CMakeFiles/common-options-objs.dir/rbd_options.cc.o -c /tmp/B.yrz327wa/BUILD/ceph-17.2.3/build/src/common/options/rbd_options.cc
make[2]: Leaving directory '/tmp/B.yrz327wa/BUILD/ceph-17.2.3/build'
make[2]: Entering directory '/tmp/B.yrz327wa/BUILD/ceph-17.2.3/build'
[  6%] Building CXX object src/common/options/CMakeFiles/common-options-objs.dir/rbd-mirror_options.cc.o
cd /tmp/B.yrz327wa/BUILD/ceph-17.2.3/build/src/common/options && /usr/bin/i686-pld-linux-g++ -DBOOST_ASIO_DISABLE_THREAD_KEYWORD_EXTENSION -DBOOST_ASIO_USE_TS_EXECUTOR_AS_DEFAULT -DHAVE_CONFIG_H -D_FILE_OFFSET_BITS=64 -D_FORTIFY_SOURCE=2 -D_GNU_SOURCE -D_REENTRANT -D_THREAD_SAFE -D__CEPH__ -D__STDC_FORMAT_MACROS -D__linux__ -I/tmp/B.yrz327wa/BUILD/ceph-17.2.3/build/src/include -I/tmp/B.yrz327wa/BUILD/ceph-17.2.3/src -isystem /tmp/B.yrz327wa/BUILD/ceph-17.2.3/build/include -isystem /tmp/B.yrz327wa/BUILD/ceph-17.2.3/src/xxHash -isystem /tmp/B.yrz327wa/BUILD/ceph-17.2.3/src/rapidjson/include -O2 -fwrapv -pipe -Wformat -Werror=format-security -gdwarf-4 -fno-debug-types-section -fvar-tracking-assignments -g2 -Wp,-D_FORTIFY_SOURCE=2 -fstack-protector-strong --param=ssp-buffer-size=4 -Werror=trampolines -fomit-frame-pointer -march=i686 -fasynchronous-unwind-tables -mtune=pentium4 -gdwarf-4 -fno-debug-types-section -fvar-tracking-assignments -g2  -DNDEBUG -DQT_NO_DEBUG -fPIC   -U_FORTIFY_SOURCE -Wall -fno-strict-aliasing -fsigned-char -Wtype-limits -Wignored-qualifiers -Wpointer-arith -Werror=format-security -Winit-self -Wno-unknown-pragmas -Wnon-virtual-dtor -Wno-ignored-qualifiers -ftemplate-depth-1024 -Wpessimizing-move -Wredundant-move -Wstrict-null-sentinel -Woverloaded-virtual -fno-new-ttp-matching -fstack-protector-strong -fdiagnostics-color=auto -fno-builtin-malloc -fno-builtin-calloc -fno-builtin-realloc -fno-builtin-free -std=c++17 -MD -MT src/common/options/CMakeFiles/common-options-objs.dir/rbd-mirror_options.cc.o -MF CMakeFiles/common-options-objs.dir/rbd-mirror_options.cc.o.d -o CMakeFiles/common-options-objs.dir/rbd-mirror_options.cc.o -c /tmp/B.yrz327wa/BUILD/ceph-17.2.3/build/src/common/options/rbd-mirror_options.cc
make[2]: Leaving directory '/tmp/B.yrz327wa/BUILD/ceph-17.2.3/build'
make[2]: Entering directory '/tmp/B.yrz327wa/BUILD/ceph-17.2.3/build'
[  6%] Building CXX object src/common/options/CMakeFiles/common-options-objs.dir/immutable-object-cache_options.cc.o
cd /tmp/B.yrz327wa/BUILD/ceph-17.2.3/build/src/common/options && /usr/bin/i686-pld-linux-g++ -DBOOST_ASIO_DISABLE_THREAD_KEYWORD_EXTENSION -DBOOST_ASIO_USE_TS_EXECUTOR_AS_DEFAULT -DHAVE_CONFIG_H -D_FILE_OFFSET_BITS=64 -D_FORTIFY_SOURCE=2 -D_GNU_SOURCE -D_REENTRANT -D_THREAD_SAFE -D__CEPH__ -D__STDC_FORMAT_MACROS -D__linux__ -I/tmp/B.yrz327wa/BUILD/ceph-17.2.3/build/src/include -I/tmp/B.yrz327wa/BUILD/ceph-17.2.3/src -isystem /tmp/B.yrz327wa/BUILD/ceph-17.2.3/build/include -isystem /tmp/B.yrz327wa/BUILD/ceph-17.2.3/src/xxHash -isystem /tmp/B.yrz327wa/BUILD/ceph-17.2.3/src/rapidjson/include -O2 -fwrapv -pipe -Wformat -Werror=format-security -gdwarf-4 -fno-debug-types-section -fvar-tracking-assignments -g2 -Wp,-D_FORTIFY_SOURCE=2 -fstack-protector-strong --param=ssp-buffer-size=4 -Werror=trampolines -fomit-frame-pointer -march=i686 -fasynchronous-unwind-tables -mtune=pentium4 -gdwarf-4 -fno-debug-types-section -fvar-tracking-assignments -g2  -DNDEBUG -DQT_NO_DEBUG -fPIC   -U_FORTIFY_SOURCE -Wall -fno-strict-aliasing -fsigned-char -Wtype-limits -Wignored-qualifiers -Wpointer-arith -Werror=format-security -Winit-self -Wno-unknown-pragmas -Wnon-virtual-dtor -Wno-ignored-qualifiers -ftemplate-depth-1024 -Wpessimizing-move -Wredundant-move -Wstrict-null-sentinel -Woverloaded-virtual -fno-new-ttp-matching -fstack-protector-strong -fdiagnostics-color=auto -fno-builtin-malloc -fno-builtin-calloc -fno-builtin-realloc -fno-builtin-free -std=c++17 -MD -MT src/common/options/CMakeFiles/common-options-objs.dir/immutable-object-cache_options.cc.o -MF CMakeFiles/common-options-objs.dir/immutable-object-cache_options.cc.o.d -o CMakeFiles/common-options-objs.dir/immutable-object-cache_options.cc.o -c /tmp/B.yrz327wa/BUILD/ceph-17.2.3/build/src/common/options/immutable-object-cache_options.cc
make[2]: Leaving directory '/tmp/B.yrz327wa/BUILD/ceph-17.2.3/build'
make[2]: Entering directory '/tmp/B.yrz327wa/BUILD/ceph-17.2.3/build'
[  6%] Building CXX object src/msg/CMakeFiles/common-msg-objs.dir/async/Protocol.cc.o
cd /tmp/B.yrz327wa/BUILD/ceph-17.2.3/build/src/msg && /usr/bin/i686-pld-linux-g++ -DBOOST_ASIO_DISABLE_THREAD_KEYWORD_EXTENSION -DBOOST_ASIO_USE_TS_EXECUTOR_AS_DEFAULT -DHAVE_CONFIG_H -D_FILE_OFFSET_BITS=64 -D_FORTIFY_SOURCE=2 -D_GNU_SOURCE -D_REENTRANT -D_THREAD_SAFE -D__CEPH__ -D__STDC_FORMAT_MACROS -D__linux__ -I/tmp/B.yrz327wa/BUILD/ceph-17.2.3/build/src/include -I/tmp/B.yrz327wa/BUILD/ceph-17.2.3/src -isystem /tmp/B.yrz327wa/BUILD/ceph-17.2.3/build/include -isystem /tmp/B.yrz327wa/BUILD/ceph-17.2.3/src/xxHash -isystem /tmp/B.yrz327wa/BUILD/ceph-17.2.3/src/rapidjson/include -O2 -fwrapv -pipe -Wformat -Werror=format-security -gdwarf-4 -fno-debug-types-section -fvar-tracking-assignments -g2 -Wp,-D_FORTIFY_SOURCE=2 -fstack-protector-strong --param=ssp-buffer-size=4 -Werror=trampolines -fomit-frame-pointer -march=i686 -fasynchronous-unwind-tables -mtune=pentium4 -gdwarf-4 -fno-debug-types-section -fvar-tracking-assignments -g2  -DNDEBUG -DQT_NO_DEBUG -fPIC   -U_FORTIFY_SOURCE -Wall -fno-strict-aliasing -fsigned-char -Wtype-limits -Wignored-qualifiers -Wpointer-arith -Werror=format-security -Winit-self -Wno-unknown-pragmas -Wnon-virtual-dtor -Wno-ignored-qualifiers -ftemplate-depth-1024 -Wpessimizing-move -Wredundant-move -Wstrict-null-sentinel -Woverloaded-virtual -fno-new-ttp-matching -fstack-protector-strong -fdiagnostics-color=auto -fno-builtin-malloc -fno-builtin-calloc -fno-builtin-realloc -fno-builtin-free -std=c++17 -MD -MT src/msg/CMakeFiles/common-msg-objs.dir/async/Protocol.cc.o -MF CMakeFiles/common-msg-objs.dir/async/Protocol.cc.o.d -o CMakeFiles/common-msg-objs.dir/async/Protocol.cc.o -c /tmp/B.yrz327wa/BUILD/ceph-17.2.3/src/msg/async/Protocol.cc
In file included from /tmp/B.yrz327wa/BUILD/ceph-17.2.3/src/msg/async/AsyncMessenger.h:23,
                 from /tmp/B.yrz327wa/BUILD/ceph-17.2.3/src/msg/async/Protocol.cc:4:
/tmp/B.yrz327wa/BUILD/ceph-17.2.3/src/include/xlist.h:162:24: warning: 'template<class _Category, class _Tp, class _Distance, class _Pointer, class _Reference> struct std::iterator' is deprecated [-Wdeprecated-declarations]
  162 |   class iterator: std::iterator<std::forward_iterator_tag, T> {
      |                        ^~~~~~~~
In file included from /usr/include/c++/12.2.0/bits/stl_algobase.h:65,
                 from /usr/include/c++/12.2.0/list:60,
                 from /tmp/B.yrz327wa/BUILD/ceph-17.2.3/src/msg/async/Protocol.h:7,
                 from /tmp/B.yrz327wa/BUILD/ceph-17.2.3/src/msg/async/Protocol.cc:1:
/usr/include/c++/12.2.0/bits/stl_iterator_base_types.h:127:34: note: declared here
  127 |     struct _GLIBCXX17_DEPRECATED iterator
      |                                  ^~~~~~~~
/tmp/B.yrz327wa/BUILD/ceph-17.2.3/src/include/xlist.h:186:30: warning: 'template<class _Category, class _Tp, class _Distance, class _Pointer, class _Reference> struct std::iterator' is deprecated [-Wdeprecated-declarations]
  186 |   class const_iterator: std::iterator<std::forward_iterator_tag, T> {
      |                              ^~~~~~~~
/usr/include/c++/12.2.0/bits/stl_iterator_base_types.h:127:34: note: declared here
  127 |     struct _GLIBCXX17_DEPRECATED iterator
      |                                  ^~~~~~~~
make[2]: Leaving directory '/tmp/B.yrz327wa/BUILD/ceph-17.2.3/build'
make[2]: Entering directory '/tmp/B.yrz327wa/BUILD/ceph-17.2.3/build'
[  6%] Building CXX object src/msg/CMakeFiles/common-msg-objs.dir/async/ProtocolV1.cc.o
cd /tmp/B.yrz327wa/BUILD/ceph-17.2.3/build/src/msg && /usr/bin/i686-pld-linux-g++ -DBOOST_ASIO_DISABLE_THREAD_KEYWORD_EXTENSION -DBOOST_ASIO_USE_TS_EXECUTOR_AS_DEFAULT -DHAVE_CONFIG_H -D_FILE_OFFSET_BITS=64 -D_FORTIFY_SOURCE=2 -D_GNU_SOURCE -D_REENTRANT -D_THREAD_SAFE -D__CEPH__ -D__STDC_FORMAT_MACROS -D__linux__ -I/tmp/B.yrz327wa/BUILD/ceph-17.2.3/build/src/include -I/tmp/B.yrz327wa/BUILD/ceph-17.2.3/src -isystem /tmp/B.yrz327wa/BUILD/ceph-17.2.3/build/include -isystem /tmp/B.yrz327wa/BUILD/ceph-17.2.3/src/xxHash -isystem /tmp/B.yrz327wa/BUILD/ceph-17.2.3/src/rapidjson/include -O2 -fwrapv -pipe -Wformat -Werror=format-security -gdwarf-4 -fno-debug-types-section -fvar-tracking-assignments -g2 -Wp,-D_FORTIFY_SOURCE=2 -fstack-protector-strong --param=ssp-buffer-size=4 -Werror=trampolines -fomit-frame-pointer -march=i686 -fasynchronous-unwind-tables -mtune=pentium4 -gdwarf-4 -fno-debug-types-section -fvar-tracking-assignments -g2  -DNDEBUG -DQT_NO_DEBUG -fPIC   -U_FORTIFY_SOURCE -Wall -fno-strict-aliasing -fsigned-char -Wtype-limits -Wignored-qualifiers -Wpointer-arith -Werror=format-security -Winit-self -Wno-unknown-pragmas -Wnon-virtual-dtor -Wno-ignored-qualifiers -ftemplate-depth-1024 -Wpessimizing-move -Wredundant-move -Wstrict-null-sentinel -Woverloaded-virtual -fno-new-ttp-matching -fstack-protector-strong -fdiagnostics-color=auto -fno-builtin-malloc -fno-builtin-calloc -fno-builtin-realloc -fno-builtin-free -std=c++17 -MD -MT src/msg/CMakeFiles/common-msg-objs.dir/async/ProtocolV1.cc.o -MF CMakeFiles/common-msg-objs.dir/async/ProtocolV1.cc.o.d -o CMakeFiles/common-msg-objs.dir/async/ProtocolV1.cc.o -c /tmp/B.yrz327wa/BUILD/ceph-17.2.3/src/msg/async/ProtocolV1.cc
In file included from /tmp/B.yrz327wa/BUILD/ceph-17.2.3/src/msg/async/AsyncMessenger.h:23,
                 from /tmp/B.yrz327wa/BUILD/ceph-17.2.3/src/msg/async/ProtocolV1.cc:9:
/tmp/B.yrz327wa/BUILD/ceph-17.2.3/src/include/xlist.h:162:24: warning: 'template<class _Category, class _Tp, class _Distance, class _Pointer, class _Reference> struct std::iterator' is deprecated [-Wdeprecated-declarations]
  162 |   class iterator: std::iterator<std::forward_iterator_tag, T> {
      |                        ^~~~~~~~
In file included from /usr/include/c++/12.2.0/bits/stl_algobase.h:65,
                 from /usr/include/c++/12.2.0/list:60,
                 from /tmp/B.yrz327wa/BUILD/ceph-17.2.3/src/msg/async/Protocol.h:7,
                 from /tmp/B.yrz327wa/BUILD/ceph-17.2.3/src/msg/async/ProtocolV1.h:7,
                 from /tmp/B.yrz327wa/BUILD/ceph-17.2.3/src/msg/async/ProtocolV1.cc:4:
/usr/include/c++/12.2.0/bits/stl_iterator_base_types.h:127:34: note: declared here
  127 |     struct _GLIBCXX17_DEPRECATED iterator
      |                                  ^~~~~~~~
/tmp/B.yrz327wa/BUILD/ceph-17.2.3/src/include/xlist.h:186:30: warning: 'template<class _Category, class _Tp, class _Distance, class _Pointer, class _Reference> struct std::iterator' is deprecated [-Wdeprecated-declarations]
  186 |   class const_iterator: std::iterator<std::forward_iterator_tag, T> {
      |                              ^~~~~~~~
/usr/include/c++/12.2.0/bits/stl_iterator_base_types.h:127:34: note: declared here
  127 |     struct _GLIBCXX17_DEPRECATED iterator
      |                                  ^~~~~~~~
make[2]: Leaving directory '/tmp/B.yrz327wa/BUILD/ceph-17.2.3/build'
make[1]: *** [CMakeFiles/Makefile2:3057: src/msg/CMakeFiles/common-msg-objs.dir/all] Error 2
make[2]: Entering directory '/tmp/B.yrz327wa/BUILD/ceph-17.2.3/build'
[  6%] Building CXX object src/common/options/CMakeFiles/common-options-objs.dir/rgw_options.cc.o
cd /tmp/B.yrz327wa/BUILD/ceph-17.2.3/build/src/common/options && /usr/bin/i686-pld-linux-g++ -DBOOST_ASIO_DISABLE_THREAD_KEYWORD_EXTENSION -DBOOST_ASIO_USE_TS_EXECUTOR_AS_DEFAULT -DHAVE_CONFIG_H -D_FILE_OFFSET_BITS=64 -D_FORTIFY_SOURCE=2 -D_GNU_SOURCE -D_REENTRANT -D_THREAD_SAFE -D__CEPH__ -D__STDC_FORMAT_MACROS -D__linux__ -I/tmp/B.yrz327wa/BUILD/ceph-17.2.3/build/src/include -I/tmp/B.yrz327wa/BUILD/ceph-17.2.3/src -isystem /tmp/B.yrz327wa/BUILD/ceph-17.2.3/build/include -isystem /tmp/B.yrz327wa/BUILD/ceph-17.2.3/src/xxHash -isystem /tmp/B.yrz327wa/BUILD/ceph-17.2.3/src/rapidjson/include -O2 -fwrapv -pipe -Wformat -Werror=format-security -gdwarf-4 -fno-debug-types-section -fvar-tracking-assignments -g2 -Wp,-D_FORTIFY_SOURCE=2 -fstack-protector-strong --param=ssp-buffer-size=4 -Werror=trampolines -fomit-frame-pointer -march=i686 -fasynchronous-unwind-tables -mtune=pentium4 -gdwarf-4 -fno-debug-types-section -fvar-tracking-assignments -g2  -DNDEBUG -DQT_NO_DEBUG -fPIC   -U_FORTIFY_SOURCE -Wall -fno-strict-aliasing -fsigned-char -Wtype-limits -Wignored-qualifiers -Wpointer-arith -Werror=format-security -Winit-self -Wno-unknown-pragmas -Wnon-virtual-dtor -Wno-ignored-qualifiers -ftemplate-depth-1024 -Wpessimizing-move -Wredundant-move -Wstrict-null-sentinel -Woverloaded-virtual -fno-new-ttp-matching -fstack-protector-strong -fdiagnostics-color=auto -fno-builtin-malloc -fno-builtin-calloc -fno-builtin-realloc -fno-builtin-free -std=c++17 -MD -MT src/common/options/CMakeFiles/common-options-objs.dir/rgw_options.cc.o -MF CMakeFiles/common-options-objs.dir/rgw_options.cc.o.d -o CMakeFiles/common-options-objs.dir/rgw_options.cc.o -c /tmp/B.yrz327wa/BUILD/ceph-17.2.3/build/src/common/options/rgw_options.cc
make[2]: Leaving directory '/tmp/B.yrz327wa/BUILD/ceph-17.2.3/build'
make[2]: Entering directory '/tmp/B.yrz327wa/BUILD/ceph-17.2.3/build'
[  4%] Building CXX object src/common/options/CMakeFiles/common-options-objs.dir/global_options.cc.o
cd /tmp/B.yrz327wa/BUILD/ceph-17.2.3/build/src/common/options && /usr/bin/i686-pld-linux-g++ -DBOOST_ASIO_DISABLE_THREAD_KEYWORD_EXTENSION -DBOOST_ASIO_USE_TS_EXECUTOR_AS_DEFAULT -DHAVE_CONFIG_H -D_FILE_OFFSET_BITS=64 -D_FORTIFY_SOURCE=2 -D_GNU_SOURCE -D_REENTRANT -D_THREAD_SAFE -D__CEPH__ -D__STDC_FORMAT_MACROS -D__linux__ -I/tmp/B.yrz327wa/BUILD/ceph-17.2.3/build/src/include -I/tmp/B.yrz327wa/BUILD/ceph-17.2.3/src -isystem /tmp/B.yrz327wa/BUILD/ceph-17.2.3/build/include -isystem /tmp/B.yrz327wa/BUILD/ceph-17.2.3/src/xxHash -isystem /tmp/B.yrz327wa/BUILD/ceph-17.2.3/src/rapidjson/include -O2 -fwrapv -pipe -Wformat -Werror=format-security -gdwarf-4 -fno-debug-types-section -fvar-tracking-assignments -g2 -Wp,-D_FORTIFY_SOURCE=2 -fstack-protector-strong --param=ssp-buffer-size=4 -Werror=trampolines -fomit-frame-pointer -march=i686 -fasynchronous-unwind-tables -mtune=pentium4 -gdwarf-4 -fno-debug-types-section -fvar-tracking-assignments -g2  -DNDEBUG -DQT_NO_DEBUG -fPIC   -U_FORTIFY_SOURCE -Wall -fno-strict-aliasing -fsigned-char -Wtype-limits -Wignored-qualifiers -Wpointer-arith -Werror=format-security -Winit-self -Wno-unknown-pragmas -Wnon-virtual-dtor -Wno-ignored-qualifiers -ftemplate-depth-1024 -Wpessimizing-move -Wredundant-move -Wstrict-null-sentinel -Woverloaded-virtual -fno-new-ttp-matching -fstack-protector-strong -fdiagnostics-color=auto -fno-builtin-malloc -fno-builtin-calloc -fno-builtin-realloc -fno-builtin-free -std=c++17 -MD -MT src/common/options/CMakeFiles/common-options-objs.dir/global_options.cc.o -MF CMakeFiles/common-options-objs.dir/global_options.cc.o.d -o CMakeFiles/common-options-objs.dir/global_options.cc.o -c /tmp/B.yrz327wa/BUILD/ceph-17.2.3/build/src/common/options/global_options.cc
/tmp/B.yrz327wa/BUILD/ceph-17.2.3/build/src/common/options/global_options.cc: In function 'std::vector<Option> get_global_options()':
/tmp/B.yrz327wa/BUILD/ceph-17.2.3/build/src/common/options/global_options.cc:4:21: note: variable tracking size limit exceeded with '-fvar-tracking-assignments', retrying without
    4 | std::vector<Option> get_global_options() {
      |                     ^~~~~~~~~~~~~~~~~~
make[2]: Leaving directory '/tmp/B.yrz327wa/BUILD/ceph-17.2.3/build'
make[1]: Entering directory '/tmp/B.yrz327wa/BUILD/ceph-17.2.3/build'
[  7%] Built target common-options-objs
make[1]: Leaving directory '/tmp/B.yrz327wa/BUILD/ceph-17.2.3/build'
make: *** [Makefile:149: all] Error 2
error: Bad exit status from /tmp/B.yrz327wa/BUILD/tmp/rpm-tmp.WlZEtT (%build)

RPM build warnings:
    Could not canonicalize hostname: nereid

RPM build errors:
    Bad exit status from /tmp/B.yrz327wa/BUILD/tmp/rpm-tmp.WlZEtT (%build)
ended at: Thu Sep 15 01:44:25 2022, done in 0:07:35.154604
error: No files produced.
+ chmod -R u+rwX /tmp/B.yrz327wa/BUILD
+ rm -rf /tmp/B.yrz327wa/tmp /tmp/B.yrz327wa/BUILD
+ rm -rf /tmp/B.yrz327wa
Begin-PLD-Builder-Info
Build-Time: user:888.45s sys:45.20s real:473.35s (faults io:484 non-io:5299471)

End-PLD-Builder-Info
[Back to list of logs] [View rpm -qa of builder]