FailedOk

th/SRPMS[OK]
th/x32[OK]
th/i686[OK]
th/x86_64[OK]

ac/SRPMS[OK]
ac/i386[OK]
ac/i586[OK]
ac/i686[OK]
ac/alpha[OK]
ac/amd64[OK]
ac/athlon[OK]
ac/ppc[OK]
ac/sparc[OK]
ac/sparc64[OK]

Advanced Search
main()
Powered by PLD Linux
(c) 2002-2024 PLD Team
$Revision: 1.37 $
Powered by six Cray XMT Supercomputers.
Your IP: 3.238.235.248

cpu_features 58127fd7-146a-49c0-8247-f8d6db476aa7

Status:Failed
Source URL:https://buildlogs.pld-linux.org/pld/th/i686/FAIL/cpu_features,58127fd7-146a-49c0-8247-f8d6db476aa7.bz2
text/plain URL:View!
rpm -qa of builder:View!
Date:2024/02/18 14:34:18
Runtime:0:00:08.912866

Toc:

  • prep
  • Executing(%prep): /bin/sh -e /tmp/B.nzilg07a/BUILD/tmp/rpm-tmp.3EOcY3
  • build
  • Executing(%build): /bin/sh -e /tmp/B.nzilg07a/BUILD/tmp/rpm-tmp.VKTb2S
  • error 1
  • gmake[2]: *** [CMakeFiles/googletest.dir/build.make:99: googletest-prefix/src/googletest-stamp/googletest-download] Error 1
  • error 2
  • gmake[1]: *** [CMakeFiles/Makefile2:83: CMakeFiles/googletest.dir/all] Error 2
  • error 3
  • error: Bad exit status from /tmp/B.nzilg07a/BUILD/tmp/rpm-tmp.VKTb2S (%build)
  • error 4
  • RPM build errors:
  • error 5
  • error: No files produced.

Content:

request from: qboosh
checking if we should skip the build
started at: Sun Feb 18 14:34:07 2024
killing old processes on a builder
sending signal 9 to pid -1
cleaning up /tmp
fetching https://srcbuilder.pld-linux.org/th//srpms/58127fd7-146a-49c0-8247-f8d6db476aa7/cpu_features-0.9.0-1.src.rpm
fetched 117671 bytes, 414.0 K/s
installing srpm: cpu_features-0.9.0-1.src.rpm
+ install -d /tmp/B.nzilg07a/BUILD /tmp/B.nzilg07a/RPMS
+ LC_ALL=en_US.UTF-8
+ rpm -qp --changelog cpu_features-0.9.0-1.src.rpm
* Sun Feb 18 2024 PLD Linux Team <feedback@pld-linux.org>
- For complete changelog see: http://git.pld-linux.org/?p=packages/cpu_features.git;a=log;h=master
* Sun Feb 18 2024 Jakub Bogusz <qboosh@pld-linux.org> ed9e9ac
- new + rpm -Uhv --nodeps --define '_topdir /tmp/B.nzilg07a' --define '_specdir %{_topdir}' --define '_sourcedir %{_specdir}' --define '_rpmdir %{_topdir}/RPMS' --define '_builddir %{_topdir}/BUILD' cpu_features-0.9.0-1.src.rpm Updating / installing... cpu_features-0.9.0-1 ######################################## + rm -f cpu_features-0.9.0-1.src.rpm + install -m 700 -d /tmp/B.nzilg07a/BUILD/tmp + TMPDIR=/tmp/B.nzilg07a/BUILD/tmp + exec nice -n 0 rpmbuild -bp --short-circuit --nodeps --define '_topdir /tmp/B.nzilg07a' --define '_specdir %{_topdir}' --define '_sourcedir %{_specdir}' --define '_rpmdir %{_topdir}/RPMS' --define '_builddir %{_topdir}/BUILD' --target i686-pld-linux --define 'prep exit 0' /tmp/B.nzilg07a/cpu_features.spec warning: Could not canonicalize hostname: nereid Building target platforms: i686-pld-linux Building for target i686-pld-linux RPM build warnings: Could not canonicalize hostname: nereid checking BuildConflict-ing packages rpm: warning: Could not canonicalize hostname: nereid rpm: Building target platforms: i686-pld-linux rpm: Building for target i686-pld-linux rpm: rpm: RPM build warnings: rpm: Could not canonicalize hostname: nereid no BuildConflicts found checking BR rpm: warning: Could not canonicalize hostname: nereid rpm: Building target platforms: i686-pld-linux rpm: Building for target i686-pld-linux rpm: rpm: RPM build warnings: rpm: Could not canonicalize hostname: nereid no BR needed building RPM using: set -ex; : build-id: 58127fd7-146a-49c0-8247-f8d6db476aa7; TMPDIR=/tmp/B.nzilg07a/BUILD/tmp exec nice -n 0 rpmbuild -bb --define '__jobs 28' --define '_smp_mflags -j28' --define '_make_opts -Otarget' --define '_pld_builder 1' --define '_topdir /tmp/B.nzilg07a' --define '_specdir %{_topdir}' --define '_sourcedir %{_specdir}' --define '_rpmdir %{_topdir}/RPMS' --define '_builddir %{_topdir}/BUILD' --target i686-pld-linux /tmp/B.nzilg07a/cpu_features.spec + : build-id: 58127fd7-146a-49c0-8247-f8d6db476aa7 + TMPDIR=/tmp/B.nzilg07a/BUILD/tmp + exec nice -n 0 rpmbuild -bb --define '__jobs 28' --define '_smp_mflags -j28' --define '_make_opts -Otarget' --define '_pld_builder 1' --define '_topdir /tmp/B.nzilg07a' --define '_specdir %{_topdir}' --define '_sourcedir %{_specdir}' --define '_rpmdir %{_topdir}/RPMS' --define '_builddir %{_topdir}/BUILD' --target i686-pld-linux /tmp/B.nzilg07a/cpu_features.spec warning: Could not canonicalize hostname: nereid Building target platforms: i686-pld-linux Building for target i686-pld-linux Executing(%prep): /bin/sh -e /tmp/B.nzilg07a/BUILD/tmp/rpm-tmp.3EOcY3 + umask 022 + cd /tmp/B.nzilg07a/BUILD + cd /tmp/B.nzilg07a/BUILD + rm -rf cpu_features-0.9.0 + /bin/gzip -dc /tmp/B.nzilg07a/cpu_features-0.9.0.tar.gz + /bin/tar -xof - + STATUS=0 + '[' 0 -ne 0 ']' + cd cpu_features-0.9.0 + /bin/chmod -Rf a+rX,u+w,g-w,o-w . + RPM_EC=0 + jobs -p + exit 0 Executing(%build): /bin/sh -e /tmp/B.nzilg07a/BUILD/tmp/rpm-tmp.VKTb2S TMP=/home/users/builder/tmp HOME=/home/users/builder PATH=/home/users/builder/GNUstep/Tools:/bin:/usr/bin:/usr/local/bin:/home/users/builder/bin TMPDIR=/tmp/B.nzilg07a/BUILD/tmp + umask 022 + cd /tmp/B.nzilg07a/BUILD + cd cpu_features-0.9.0 + CC=i686-pld-linux-gcc CXX=i686-pld-linux-g++ CPPFLAGS='' /usr/bin/cmake '-DCMAKE_VERBOSE_MAKEFILE:BOOL=ON' '-DCMAKE_BUILD_TYPE=PLD' '-DCMAKE_SYSTEM_NAME=Linux' '-DCMAKE_SYSTEM_VERSION=6.6.15-1' '-DCMAKE_CROSSCOMPILING:BOOL=FALSE' '-DCMAKE_SYSTEM_PROCESSOR=i686' '-DCMAKE_INSTALL_BINDIR:PATH=/usr/bin' '-DCMAKE_INSTALL_SBINDIR:PATH=/usr/sbin' '-DCMAKE_INSTALL_LIBEXECDIR:PATH=/usr/libexec' '-DCMAKE_INSTALL_SYSCONFDIR:PATH=/etc' '-DCMAKE_INSTALL_SHAREDSTATEDIRPATH:PATH=/var/lib' '-DCMAKE_INSTALL_LOCALSTATEDIRPATH:PATH=/var' '-DCMAKE_INSTALL_LIBDIR:PATH=/usr/lib' '-DCMAKE_INSTALL_INCLUDEDIR:PATH=/usr/include' '-DCMAKE_INSTALL_OLDINCLUDEDIR:PATH=/usr/include' '-DCMAKE_INSTALL_DATAROOTDIR:PATH=/usr/share' '-DCMAKE_INSTALL_DATADIR:PATH=/usr/share' '-DCMAKE_INSTALL_INFODIR:PATH=/usr/share/info' '-DCMAKE_INSTALL_LOCALEDIR:PATH=/usr/share/locale' '-DCMAKE_INSTALL_MANDIR:PATH=/usr/share/man' '-DCMAKE_INSTALL_DOCDIR:PATH=/usr/share/doc' '-DCMAKE_INSTALL_PREFIX:PATH=/usr' '-DSYSCONF_INSTALL_DIR:PATH=/etc' '-DCMAKE_CXX_FLAGS_PLD=-O2 -fwrapv -pipe -Wformat -Werror=format-security -gdwarf-4 -fno-debug-types-section -fvar-tracking-assignments -g2 -Wp,-D_FORTIFY_SOURCE=2 -fstack-protector-strong --param=ssp-buffer-size=4 -Werror=trampolines -fomit-frame-pointer -march=i686 -fasynchronous-unwind-tables -mtune=pentium4 -gdwarf-4 -fno-debug-types-section -fvar-tracking-assignments -g2 -DNDEBUG -DQT_NO_DEBUG' '-DCMAKE_C_FLAGS_PLD=-O2 -fwrapv -pipe -Wformat -Werror=format-security -gdwarf-4 -fno-debug-types-section -fvar-tracking-assignments -g2 -Wp,-D_FORTIFY_SOURCE=2 -fstack-protector-strong --param=ssp-buffer-size=4 -Werror=trampolines -fomit-frame-pointer -march=i686 -fasynchronous-unwind-tables -mtune=pentium4 -gdwarf-4 -fno-debug-types-section -fvar-tracking-assignments -g2 -DNDEBUG -DQT_NO_DEBUG' '-DCMAKE_Fortran_FLAGS_PLD=-O2 -fwrapv -pipe -Wformat -Werror=format-security -gdwarf-4 -fno-debug-types-section -fvar-tracking-assignments -g2 -Wp,-D_FORTIFY_SOURCE=2 -fstack-protector-strong --param=ssp-buffer-size=4 -Werror=trampolines -fomit-frame-pointer -march=i686 -fasynchronous-unwind-tables -mtune=pentium4 -gdwarf-4 -fno-debug-types-section -fvar-tracking-assignments -g2 -DNDEBUG -DQT_NO_DEBUG' '-DCMAKE_EXE_LINKER_FLAGS_PLD=-Wl,--as-needed -Wl,--no-copy-dt-needed-entries -Wl,-z,relro -Wl,-z,combreloc ' '-DCMAKE_SHARED_LINKER_FLAGS_PLD=-Wl,--as-needed -Wl,--no-copy-dt-needed-entries -Wl,-z,relro -Wl,-z,combreloc ' '-DCMAKE_MODULE_LINKER_FLAGS_PLD=-Wl,--as-needed -Wl,--no-copy-dt-needed-entries -Wl,-z,relro -Wl,-z,combreloc ' '-DBUILD_SHARED_LIBS:BOOL=ON' -B build -- The C compiler identification is GNU 13.2.0 -- Detecting C compiler ABI info -- Detecting C compiler ABI info - done -- Check for working C compiler: /usr/bin/i686-pld-linux-gcc - skipped -- Detecting C compile features -- Detecting C compile features - done -- Looking for dlfcn.h -- Looking for dlfcn.h - found -- Looking for getauxval -- Looking for getauxval - found -- The CXX compiler identification is GNU 13.2.0 -- Detecting CXX compiler ABI info -- Detecting CXX compiler ABI info - done -- Check for working CXX compiler: /usr/bin/i686-pld-linux-g++ - skipped -- Detecting CXX compile features -- Detecting CXX compile features - done CMake Deprecation Warning at CMakeLists.txt:1 (cmake_minimum_required): Compatibility with CMake < 3.5 will be removed from a future version of CMake. Update the VERSION argument <min> value or use a ...<max> suffix to tell CMake that the project does not need compatibility with older versions. -- Configuring done (0.1s) -- Generating done (0.0s) -- Build files have been written to: /tmp/B.nzilg07a/BUILD/cpu_features-0.9.0/build/googletest-download [ 11%] Creating directories for 'googletest' [ 22%] Performing download step (git clone) for 'googletest' Cloning into 'googletest-src'... fatal: unable to access 'https://github.com/google/googletest.git/': Could not resolve host: github.com Cloning into 'googletest-src'... fatal: unable to access 'https://github.com/google/googletest.git/': Could not resolve host: github.com Cloning into 'googletest-src'... fatal: unable to access 'https://github.com/google/googletest.git/': Could not resolve host: github.com -- Had to git clone more than once: 3 times. CMake Error at googletest-download/googletest-prefix/tmp/googletest-gitclone.cmake:39 (message): Failed to clone repository: 'https://github.com/google/googletest.git' gmake[2]: *** [CMakeFiles/googletest.dir/build.make:99: googletest-prefix/src/googletest-stamp/googletest-download] Error 1 gmake[1]: *** [CMakeFiles/Makefile2:83: CMakeFiles/googletest.dir/all] Error 2 gmake: *** [Makefile:91: all] Error 2 CMake Error at CMakeLists.txt:239 (message): Build step for googletest failed: 2 -- Configuring incomplete, errors occurred! error: Bad exit status from /tmp/B.nzilg07a/BUILD/tmp/rpm-tmp.VKTb2S (%build) RPM build warnings: Could not canonicalize hostname: nereid RPM build errors: Bad exit status from /tmp/B.nzilg07a/BUILD/tmp/rpm-tmp.VKTb2S (%build) ended at: Sun Feb 18 14:34:18 2024, done in 0:00:08.912866 error: No files produced. + chmod -R u+rwX /tmp/B.nzilg07a/BUILD + rm -rf /tmp/B.nzilg07a/tmp /tmp/B.nzilg07a/BUILD + rm -rf /tmp/B.nzilg07a Begin-PLD-Builder-Info Build-Time: user:2.32s sys:1.49s real:11.28s (faults io:0 non-io:180172) End-PLD-Builder-Info
[Back to list of logs] [View rpm -qa of builder]