FailedOk

th/SRPMS[OK]
th/x32[OK]
th/i686[OK]
th/x86_64[OK]

ac/SRPMS[OK]
ac/i386[OK]
ac/i586[OK]
ac/i686[OK]
ac/alpha[OK]
ac/amd64[OK]
ac/athlon[OK]
ac/ppc[OK]
ac/sparc[OK]
ac/sparc64[OK]

Advanced Search
main()
Powered by PLD Linux
(c) 2002-2024 PLD Team
$Revision: 1.37 $
Powered by computron.
Your IP: 44.200.77.92

cyrus-imapd 9301c558-43f1-431c-8634-e9352470f23a

Status:Failed
Source URL:https://buildlogs.pld-linux.org/pld/th/i686/FAIL/cyrus-imapd,9301c558-43f1-431c-8634-e9352470f23a.bz2
text/plain URL:View!
full text:View!
rpm -qa of builder:View!
Date:2023/11/26 10:28:17
Runtime:0:01:17.614863

Toc:

  • error 1
  • /usr/include/bits/resource.h:131:18: error: storage class specified for parameter 'rlim_t'
  • error 2
  • /usr/include/bits/resource.h:136:20: error: storage class specified for parameter 'rlim64_t'
  • error 3
  • /usr/include/bits/resource.h:142:5: error: expected specifier-qualifier-list before 'rlim_t'
  • error 4
  • /usr/include/bits/resource.h:151:5: error: expected specifier-qualifier-list before 'rlim64_t'
  • error 5
  • /usr/include/bits/resource.h:203:12: error: storage class specified for parameter 'prlimit'
  • error 6
  • /usr/include/bits/resource.h:217:12: error: storage class specified for parameter 'prlimit64'
  • error 7
  • /usr/include/sys/resource.h:38:32: error: storage class specified for parameter '__rlimit_resource_t'
  • error 8
  • /usr/include/sys/resource.h:39:27: error: storage class specified for parameter '__rusage_who_t'
  • error 9
  • /usr/include/sys/resource.h:40:31: error: storage class specified for parameter '__priority_which_t'
  • error 10
  • /usr/include/sys/resource.h:50:23: error: expected declaration specifiers or '...' before '__rlimit_resource_t'
  • error 11
  • /usr/include/sys/resource.h:62:25: error: expected declaration specifiers or '...' before '__rlimit_resource_t'
  • error 12
  • /usr/include/sys/resource.h:70:23: error: expected declaration specifiers or '...' before '__rlimit_resource_t'
  • error 13
  • /usr/include/sys/resource.h:82:25: error: expected declaration specifiers or '...' before '__rlimit_resource_t'
  • error 14
  • /usr/include/sys/resource.h:89:23: error: expected declaration specifiers or '...' before '__rusage_who_t'
  • error 15
  • /usr/include/sys/resource.h:105:25: error: expected declaration specifiers or '...' before '__priority_which_t'
  • error 16
  • /usr/include/sys/resource.h:109:25: error: expected declaration specifiers or '...' before '__priority_which_t'
  • error 17
  • ./lib/imapopts.h:647:25: error: storage class specified for parameter 'imapopts'
  • error 18
  • ./lib/libconfig.h:50:13: error: storage class specified for parameter 'config_reset'
  • error 19
  • ./lib/libconfig.h:51:13: error: storage class specified for parameter 'config_read'
  • error 20
  • ./lib/libconfig.h:52:20: error: storage class specified for parameter 'config_getstring'
  • error 21
  • ./lib/libconfig.h:53:12: error: storage class specified for parameter 'config_getint'
  • error 22
  • ./lib/libconfig.h:54:12: error: storage class specified for parameter 'config_getswitch'
  • error 23
  • ./lib/libconfig.h:55:24: error: storage class specified for parameter 'config_getenum'
  • error 24
  • ./lib/libconfig.h:56:22: error: storage class specified for parameter 'config_getbitfield'
  • error 25
  • ./lib/libconfig.h:60:20: error: storage class specified for parameter 'config_getoverflowstring'
  • error 26
  • ./lib/libconfig.h:61:13: error: storage class specified for parameter 'config_foreachoverflowstring'
  • error 27
  • ./lib/libconfig.h:63:20: error: storage class specified for parameter 'config_partitiondir'
  • error 28
  • ./lib/libconfig.h:64:20: error: storage class specified for parameter 'config_metapartitiondir'
  • error 29
  • ./lib/libconfig.h:65:20: error: storage class specified for parameter 'config_archivepartitiondir'
  • error 30
  • ./lib/libconfig.h:67:20: error: storage class specified for parameter 'config_backupstagingpath'
  • error 31
  • ./lib/libconfig.h:70:20: error: storage class specified for parameter 'config_filename'
  • error 32
  • ./lib/libconfig.h:71:20: error: storage class specified for parameter 'config_dir'
  • error 33
  • ./lib/libconfig.h:72:20: error: storage class specified for parameter 'config_defpartition'
  • error 34
  • ./lib/libconfig.h:73:20: error: storage class specified for parameter 'config_servername'
  • error 35
  • ./lib/libconfig.h:74:24: error: storage class specified for parameter 'config_serverinfo'
  • error 36
  • ./lib/libconfig.h:75:20: error: storage class specified for parameter 'config_mupdate_server'
  • error 37
  • ./lib/libconfig.h:76:20: error: storage class specified for parameter 'config_defdomain'
  • error 38
  • ./lib/libconfig.h:77:20: error: storage class specified for parameter 'config_ident'
  • error 39
  • ./lib/libconfig.h:78:12: error: storage class specified for parameter 'config_hashimapspool'
  • error 40
  • ./lib/libconfig.h:79:12: error: storage class specified for parameter 'config_implicitrights'
  • error 41
  • ./lib/libconfig.h:80:24: error: storage class specified for parameter 'config_virtdomains'
  • error 42
  • ./lib/libconfig.h:81:24: error: storage class specified for parameter 'config_mupdate_config'
  • error 43
  • ./lib/libconfig.h:82:12: error: storage class specified for parameter 'config_auditlog'
  • error 44
  • ./lib/libconfig.h:83:12: error: storage class specified for parameter 'config_iolog'
  • error 45
  • ./lib/libconfig.h:84:17: error: storage class specified for parameter 'config_maxquoted'
  • error 46
  • ./lib/libconfig.h:85:17: error: storage class specified for parameter 'config_maxword'
  • error 47
  • ./lib/libconfig.h:86:12: error: storage class specified for parameter 'config_qosmarking'
  • error 48
  • ./lib/libconfig.h:87:12: error: storage class specified for parameter 'config_debug'
  • error 49
  • ./lib/strarray.h:57:3: error: storage class specified for parameter 'strarray_t'
  • error 50
  • ./lib/strarray.h:61:20: error: expected declaration specifiers or '...' before 'strarray_t'
  • error 51
  • ./lib/strarray.h:63:1: error: expected declaration specifiers before 'strarray_t'
  • error 52
  • ./lib/strarray.h:64:20: error: expected declaration specifiers or '...' before 'strarray_t'
  • error 53
  • ./lib/strarray.h:66:21: error: expected declaration specifiers or '...' before 'strarray_t'
  • error 54
  • ./lib/strarray.h:67:18: error: expected declaration specifiers or '...' before 'strarray_t'
  • error 55
  • ./lib/strarray.h:68:23: error: expected declaration specifiers or '...' before 'strarray_t'
  • error 56
  • ./lib/strarray.h:69:22: error: expected declaration specifiers or '...' before 'strarray_t'
  • error 57
  • ./lib/strarray.h:70:19: error: expected declaration specifiers or '...' before 'strarray_t'
  • error 58
  • ./lib/strarray.h:71:20: error: expected declaration specifiers or '...' before 'strarray_t'
  • error 59
  • ./lib/strarray.h:72:22: error: expected declaration specifiers or '...' before 'strarray_t'
  • error 60
  • ./lib/strarray.h:73:23: error: expected declaration specifiers or '...' before 'strarray_t'
  • error 61
  • ./lib/strarray.h:74:23: error: expected declaration specifiers or '...' before 'strarray_t'
  • error 62
  • ./lib/strarray.h:75:26: error: expected declaration specifiers or '...' before 'strarray_t'
  • error 63
  • ./lib/strarray.h:76:31: error: expected declaration specifiers or '...' before 'strarray_t'
  • error 64
  • ./lib/strarray.h:77:43: error: expected ';', ',' or ')' before '*' token
  • error 65
  • ./lib/strarray.h:78:47: error: expected ';', ',' or ')' before '*' token
  • error 66
  • ./lib/strarray.h:79:24: error: expected declaration specifiers or '...' before 'strarray_t'
  • error 67
  • ./lib/strarray.h:80:1: error: expected declaration specifiers before 'strarray_t'
  • error 68
  • ./lib/strarray.h:81:19: error: expected declaration specifiers or '...' before 'strarray_t'
  • error 69
  • ./lib/strarray.h:81:54: error: expected ';', ',' or ')' before '*' token
  • error 70
  • ./lib/strarray.h:91:38: error: expected ';', ',' or ')' before '*' token
  • error 71
  • ./lib/strarray.h:93:1: error: expected declaration specifiers before 'strarray_t'
  • error 72
  • ./lib/strarray.h:94:1: error: expected declaration specifiers before 'strarray_t'
  • error 73
  • ./lib/strarray.h:95:1: error: expected declaration specifiers before 'strarray_t'
  • error 74
  • ./lib/strarray.h:98:13: error: storage class specified for parameter 'strarray_cmp_fn_t'
  • error 75
  • ./lib/strarray.h:99:20: error: expected declaration specifiers or '...' before 'strarray_t'
  • error 76
  • ./lib/strarray.h:99:34: error: expected declaration specifiers or '...' before 'strarray_cmp_fn_t'
  • error 77
  • ./lib/strarray.h:101:20: error: expected declaration specifiers or '...' before 'strarray_t'
  • error 78
  • ./lib/strarray.h:103:24: error: expected declaration specifiers or '...' before 'strarray_t'
  • error 79
  • ./lib/strarray.h:105:36: error: expected ';', ',' or ')' before '*' token
  • error 80
  • ./lib/strarray.h:107:41: error: expected ';', ',' or ')' before '*' token
  • error 81
  • ./lib/strarray.h:110:36: error: expected ';', ',' or ')' before '*' token
  • error 82
  • ./lib/strarray.h:112:35: error: expected ';', ',' or ')' before '*' token
  • error 83
  • master/master.h:15:5: error: expected specifier-qualifier-list before 'strarray_t'
  • error 84
  • master/master.h:47:24: error: storage class specified for parameter 'Services'
  • error 85
  • master/master.h:48:12: error: storage class specified for parameter 'nservices'
  • error 86
  • master/cyrusMasterMIB.c:62:1: error: parameter 'cyrusMasterMIB_variables_oid' is initialized
  • error 87
  • master/cyrusMasterMIB.c:62:38: error: variable-sized object may not be initialized except with an empty initializer
  • error 88
  • master/cyrusMasterMIB.c:72:8: error: parameter 'cyrusMasterMIB_variables' is initialized
  • error 89
  • master/cyrusMasterMIB.c:72:47: error: variable-sized object may not be initialized except with an empty initializer
  • error 90
  • master/cyrusMasterMIB.c:94:15: error: storage class specified for parameter 'startTime'
  • error 91
  • master/cyrusMasterMIB.c:94:1: error: parameter 'startTime' is initialized
  • error 92
  • master/cyrusMasterMIB.c:102:1: error: expected '=', ',', ';', 'asm' or '__attribute__' before '{' token
  • error 93
  • master/cyrusMasterMIB.c:134:1: error: expected '=', ',', ';', 'asm' or '__attribute__' before '{' token
  • error 94
  • master/cyrusMasterMIB.c:182:1: error: expected '=', ',', ';', 'asm' or '__attribute__' before '{' token
  • error 95
  • master/cyrusMasterMIB.h:12:1: error: old-style parameter declarations in prototyped function definition
  • error 96
  • master/cyrusMasterMIB.c:250: error: expected '{' at end of input
  • error 97
  • make[2]: *** [Makefile:4856: master/cyrusMasterMIB.o] Error 1
  • error 98
  • make[1]: *** [Makefile:6488: all-recursive] Error 1
  • error 99
  • error: Bad exit status from /tmp/B.vw7b_hov/BUILD/tmp/rpm-tmp.tlfjel (%build)
  • error 100
  • RPM build errors:
  • error 101
  • error: No files produced.

Content:

libtool: compile:  i686-pld-linux-gcc -DHAVE_CONFIG_H -I. -I/usr/include/et -I. -I./lib -I. -I./lib -DLIBEXEC_DIR=\"/usr/libexec/cyrus\" -DSBIN_DIR=\"/usr/sbin\" -DSYSCONF_DIR=\"/etc\" -DHAVE_CONFIG_H -I/usr/include/libxml2 -I/usr/include/mysql -DKRB5_HEIMDAL -I/usr/include -fPIC -fvisibility=hidden -O2 -fwrapv -pipe -Wformat -Werror=format-security -gdwarf-4 -fno-debug-types-section -fvar-tracking-assignments -g2 -Wp,-D_FORTIFY_SOURCE=2 -fstack-protector-strong --param=ssp-buffer-size=4 -Werror=trampolines -fomit-frame-pointer -march=i686 -fasynchronous-unwind-tables -mtune=pentium4 -gdwarf-4 -fno-debug-types-section -fvar-tracking-assignments -g2 -MT lib/lib_libcyrus_min_la-libconfig.lo -MD -MP -MF lib/.deps/lib_libcyrus_min_la-libconfig.Tpo -c lib/libconfig.c -o lib/lib_libcyrus_min_la-libconfig.o >/dev/null 2>&1
mv -f lib/.deps/lib_libcyrus_min_la-libconfig.Tpo lib/.deps/lib_libcyrus_min_la-libconfig.Plo
/bin/sh ./libtool  --tag=CC   --mode=compile i686-pld-linux-gcc -DHAVE_CONFIG_H -I.  -I/usr/include/et -I. -I./lib -I. -I./lib -DLIBEXEC_DIR=\"/usr/libexec/cyrus\" -DSBIN_DIR=\"/usr/sbin\" -DSYSCONF_DIR=\"/etc\" -DHAVE_CONFIG_H      -I/usr/include/libxml2       -I/usr/include/mysql   -DKRB5_HEIMDAL -I/usr/include -fPIC  -fvisibility=hidden -O2 -fwrapv -pipe -Wformat -Werror=format-security -gdwarf-4 -fno-debug-types-section -fvar-tracking-assignments -g2 -Wp,-D_FORTIFY_SOURCE=2 -fstack-protector-strong --param=ssp-buffer-size=4 -Werror=trampolines -fomit-frame-pointer -march=i686 -fasynchronous-unwind-tables -mtune=pentium4 -gdwarf-4 -fno-debug-types-section -fvar-tracking-assignments -g2  -MT lib/lib_libcyrus_min_la-mpool.lo -MD -MP -MF lib/.deps/lib_libcyrus_min_la-mpool.Tpo -c -o lib/lib_libcyrus_min_la-mpool.lo `test -f 'lib/mpool.c' || echo './'`lib/mpool.c
libtool: compile:  i686-pld-linux-gcc -DHAVE_CONFIG_H -I. -I/usr/include/et -I. -I./lib -I. -I./lib -DLIBEXEC_DIR=\"/usr/libexec/cyrus\" -DSBIN_DIR=\"/usr/sbin\" -DSYSCONF_DIR=\"/etc\" -DHAVE_CONFIG_H -I/usr/include/libxml2 -I/usr/include/mysql -DKRB5_HEIMDAL -I/usr/include -fPIC -fvisibility=hidden -O2 -fwrapv -pipe -Wformat -Werror=format-security -gdwarf-4 -fno-debug-types-section -fvar-tracking-assignments -g2 -Wp,-D_FORTIFY_SOURCE=2 -fstack-protector-strong --param=ssp-buffer-size=4 -Werror=trampolines -fomit-frame-pointer -march=i686 -fasynchronous-unwind-tables -mtune=pentium4 -gdwarf-4 -fno-debug-types-section -fvar-tracking-assignments -g2 -MT lib/lib_libcyrus_min_la-mpool.lo -MD -MP -MF lib/.deps/lib_libcyrus_min_la-mpool.Tpo -c lib/mpool.c  -fPIC -DPIC -o lib/.libs/lib_libcyrus_min_la-mpool.o
libtool: compile:  i686-pld-linux-gcc -DHAVE_CONFIG_H -I. -I/usr/include/et -I. -I./lib -I. -I./lib -DLIBEXEC_DIR=\"/usr/libexec/cyrus\" -DSBIN_DIR=\"/usr/sbin\" -DSYSCONF_DIR=\"/etc\" -DHAVE_CONFIG_H -I/usr/include/libxml2 -I/usr/include/mysql -DKRB5_HEIMDAL -I/usr/include -fPIC -fvisibility=hidden -O2 -fwrapv -pipe -Wformat -Werror=format-security -gdwarf-4 -fno-debug-types-section -fvar-tracking-assignments -g2 -Wp,-D_FORTIFY_SOURCE=2 -fstack-protector-strong --param=ssp-buffer-size=4 -Werror=trampolines -fomit-frame-pointer -march=i686 -fasynchronous-unwind-tables -mtune=pentium4 -gdwarf-4 -fno-debug-types-section -fvar-tracking-assignments -g2 -MT lib/lib_libcyrus_min_la-mpool.lo -MD -MP -MF lib/.deps/lib_libcyrus_min_la-mpool.Tpo -c lib/mpool.c -o lib/lib_libcyrus_min_la-mpool.o >/dev/null 2>&1
mv -f lib/.deps/lib_libcyrus_min_la-mpool.Tpo lib/.deps/lib_libcyrus_min_la-mpool.Plo
/bin/sh ./libtool  --tag=CC   --mode=compile i686-pld-linux-gcc -DHAVE_CONFIG_H -I.  -I/usr/include/et -I. -I./lib -I. -I./lib -DLIBEXEC_DIR=\"/usr/libexec/cyrus\" -DSBIN_DIR=\"/usr/sbin\" -DSYSCONF_DIR=\"/etc\" -DHAVE_CONFIG_H      -I/usr/include/libxml2       -I/usr/include/mysql   -DKRB5_HEIMDAL -I/usr/include -fPIC  -fvisibility=hidden -O2 -fwrapv -pipe -Wformat -Werror=format-security -gdwarf-4 -fno-debug-types-section -fvar-tracking-assignments -g2 -Wp,-D_FORTIFY_SOURCE=2 -fstack-protector-strong --param=ssp-buffer-size=4 -Werror=trampolines -fomit-frame-pointer -march=i686 -fasynchronous-unwind-tables -mtune=pentium4 -gdwarf-4 -fno-debug-types-section -fvar-tracking-assignments -g2  -MT lib/lib_libcyrus_min_la-retry.lo -MD -MP -MF lib/.deps/lib_libcyrus_min_la-retry.Tpo -c -o lib/lib_libcyrus_min_la-retry.lo `test -f 'lib/retry.c' || echo './'`lib/retry.c
libtool: compile:  i686-pld-linux-gcc -DHAVE_CONFIG_H -I. -I/usr/include/et -I. -I./lib -I. -I./lib -DLIBEXEC_DIR=\"/usr/libexec/cyrus\" -DSBIN_DIR=\"/usr/sbin\" -DSYSCONF_DIR=\"/etc\" -DHAVE_CONFIG_H -I/usr/include/libxml2 -I/usr/include/mysql -DKRB5_HEIMDAL -I/usr/include -fPIC -fvisibility=hidden -O2 -fwrapv -pipe -Wformat -Werror=format-security -gdwarf-4 -fno-debug-types-section -fvar-tracking-assignments -g2 -Wp,-D_FORTIFY_SOURCE=2 -fstack-protector-strong --param=ssp-buffer-size=4 -Werror=trampolines -fomit-frame-pointer -march=i686 -fasynchronous-unwind-tables -mtune=pentium4 -gdwarf-4 -fno-debug-types-section -fvar-tracking-assignments -g2 -MT lib/lib_libcyrus_min_la-retry.lo -MD -MP -MF lib/.deps/lib_libcyrus_min_la-retry.Tpo -c lib/retry.c  -fPIC -DPIC -o lib/.libs/lib_libcyrus_min_la-retry.o
lib/retry.c: In function 'retry_writev':
lib/retry.c:139:19: warning: argument 3 value [-2147483648, -1] is negative [-Wstringop-overflow=]
  139 |     n = written = writev(fd, srciov, iovcnt > iov_max ? iov_max : iovcnt);
      |                   ^~~~~~~~~~~~~~~~~~~~~~~~~~~~~~~~~~~~~~~~~~~~~~~~~~~~~~~
In file included from lib/retry.c:46:
/usr/include/sys/uio.h:52:16: note: in a call to function 'writev' declared with attribute 'access (read_only, 2, 3)'
   52 | extern ssize_t writev (int __fd, const struct iovec *__iovec, int __count)
      |                ^~~~~~
libtool: compile:  i686-pld-linux-gcc -DHAVE_CONFIG_H -I. -I/usr/include/et -I. -I./lib -I. -I./lib -DLIBEXEC_DIR=\"/usr/libexec/cyrus\" -DSBIN_DIR=\"/usr/sbin\" -DSYSCONF_DIR=\"/etc\" -DHAVE_CONFIG_H -I/usr/include/libxml2 -I/usr/include/mysql -DKRB5_HEIMDAL -I/usr/include -fPIC -fvisibility=hidden -O2 -fwrapv -pipe -Wformat -Werror=format-security -gdwarf-4 -fno-debug-types-section -fvar-tracking-assignments -g2 -Wp,-D_FORTIFY_SOURCE=2 -fstack-protector-strong --param=ssp-buffer-size=4 -Werror=trampolines -fomit-frame-pointer -march=i686 -fasynchronous-unwind-tables -mtune=pentium4 -gdwarf-4 -fno-debug-types-section -fvar-tracking-assignments -g2 -MT lib/lib_libcyrus_min_la-retry.lo -MD -MP -MF lib/.deps/lib_libcyrus_min_la-retry.Tpo -c lib/retry.c -o lib/lib_libcyrus_min_la-retry.o >/dev/null 2>&1
mv -f lib/.deps/lib_libcyrus_min_la-retry.Tpo lib/.deps/lib_libcyrus_min_la-retry.Plo
/bin/sh ./libtool  --tag=CC   --mode=compile i686-pld-linux-gcc -DHAVE_CONFIG_H -I.  -I/usr/include/et -I. -I./lib -I. -I./lib -DLIBEXEC_DIR=\"/usr/libexec/cyrus\" -DSBIN_DIR=\"/usr/sbin\" -DSYSCONF_DIR=\"/etc\" -DHAVE_CONFIG_H      -I/usr/include/libxml2       -I/usr/include/mysql   -DKRB5_HEIMDAL -I/usr/include -fPIC  -fvisibility=hidden -O2 -fwrapv -pipe -Wformat -Werror=format-security -gdwarf-4 -fno-debug-types-section -fvar-tracking-assignments -g2 -Wp,-D_FORTIFY_SOURCE=2 -fstack-protector-strong --param=ssp-buffer-size=4 -Werror=trampolines -fomit-frame-pointer -march=i686 -fasynchronous-unwind-tables -mtune=pentium4 -gdwarf-4 -fno-debug-types-section -fvar-tracking-assignments -g2  -MT lib/lib_libcyrus_min_la-strarray.lo -MD -MP -MF lib/.deps/lib_libcyrus_min_la-strarray.Tpo -c -o lib/lib_libcyrus_min_la-strarray.lo `test -f 'lib/strarray.c' || echo './'`lib/strarray.c
libtool: compile:  i686-pld-linux-gcc -DHAVE_CONFIG_H -I. -I/usr/include/et -I. -I./lib -I. -I./lib -DLIBEXEC_DIR=\"/usr/libexec/cyrus\" -DSBIN_DIR=\"/usr/sbin\" -DSYSCONF_DIR=\"/etc\" -DHAVE_CONFIG_H -I/usr/include/libxml2 -I/usr/include/mysql -DKRB5_HEIMDAL -I/usr/include -fPIC -fvisibility=hidden -O2 -fwrapv -pipe -Wformat -Werror=format-security -gdwarf-4 -fno-debug-types-section -fvar-tracking-assignments -g2 -Wp,-D_FORTIFY_SOURCE=2 -fstack-protector-strong --param=ssp-buffer-size=4 -Werror=trampolines -fomit-frame-pointer -march=i686 -fasynchronous-unwind-tables -mtune=pentium4 -gdwarf-4 -fno-debug-types-section -fvar-tracking-assignments -g2 -MT lib/lib_libcyrus_min_la-strarray.lo -MD -MP -MF lib/.deps/lib_libcyrus_min_la-strarray.Tpo -c lib/strarray.c  -fPIC -DPIC -o lib/.libs/lib_libcyrus_min_la-strarray.o
libtool: compile:  i686-pld-linux-gcc -DHAVE_CONFIG_H -I. -I/usr/include/et -I. -I./lib -I. -I./lib -DLIBEXEC_DIR=\"/usr/libexec/cyrus\" -DSBIN_DIR=\"/usr/sbin\" -DSYSCONF_DIR=\"/etc\" -DHAVE_CONFIG_H -I/usr/include/libxml2 -I/usr/include/mysql -DKRB5_HEIMDAL -I/usr/include -fPIC -fvisibility=hidden -O2 -fwrapv -pipe -Wformat -Werror=format-security -gdwarf-4 -fno-debug-types-section -fvar-tracking-assignments -g2 -Wp,-D_FORTIFY_SOURCE=2 -fstack-protector-strong --param=ssp-buffer-size=4 -Werror=trampolines -fomit-frame-pointer -march=i686 -fasynchronous-unwind-tables -mtune=pentium4 -gdwarf-4 -fno-debug-types-section -fvar-tracking-assignments -g2 -MT lib/lib_libcyrus_min_la-strarray.lo -MD -MP -MF lib/.deps/lib_libcyrus_min_la-strarray.Tpo -c lib/strarray.c -o lib/lib_libcyrus_min_la-strarray.o >/dev/null 2>&1
mv -f lib/.deps/lib_libcyrus_min_la-strarray.Tpo lib/.deps/lib_libcyrus_min_la-strarray.Plo
/bin/sh ./libtool  --tag=CC   --mode=compile i686-pld-linux-gcc -DHAVE_CONFIG_H -I.  -I/usr/include/et -I. -I./lib -I. -I./lib -DLIBEXEC_DIR=\"/usr/libexec/cyrus\" -DSBIN_DIR=\"/usr/sbin\" -DSYSCONF_DIR=\"/etc\" -DHAVE_CONFIG_H      -I/usr/include/libxml2       -I/usr/include/mysql   -DKRB5_HEIMDAL -I/usr/include -fPIC  -fvisibility=hidden -O2 -fwrapv -pipe -Wformat -Werror=format-security -gdwarf-4 -fno-debug-types-section -fvar-tracking-assignments -g2 -Wp,-D_FORTIFY_SOURCE=2 -fstack-protector-strong --param=ssp-buffer-size=4 -Werror=trampolines -fomit-frame-pointer -march=i686 -fasynchronous-unwind-tables -mtune=pentium4 -gdwarf-4 -fno-debug-types-section -fvar-tracking-assignments -g2  -MT lib/lib_libcyrus_min_la-strhash.lo -MD -MP -MF lib/.deps/lib_libcyrus_min_la-strhash.Tpo -c -o lib/lib_libcyrus_min_la-strhash.lo `test -f 'lib/strhash.c' || echo './'`lib/strhash.c
libtool: compile:  i686-pld-linux-gcc -DHAVE_CONFIG_H -I. -I/usr/include/et -I. -I./lib -I. -I./lib -DLIBEXEC_DIR=\"/usr/libexec/cyrus\" -DSBIN_DIR=\"/usr/sbin\" -DSYSCONF_DIR=\"/etc\" -DHAVE_CONFIG_H -I/usr/include/libxml2 -I/usr/include/mysql -DKRB5_HEIMDAL -I/usr/include -fPIC -fvisibility=hidden -O2 -fwrapv -pipe -Wformat -Werror=format-security -gdwarf-4 -fno-debug-types-section -fvar-tracking-assignments -g2 -Wp,-D_FORTIFY_SOURCE=2 -fstack-protector-strong --param=ssp-buffer-size=4 -Werror=trampolines -fomit-frame-pointer -march=i686 -fasynchronous-unwind-tables -mtune=pentium4 -gdwarf-4 -fno-debug-types-section -fvar-tracking-assignments -g2 -MT lib/lib_libcyrus_min_la-strhash.lo -MD -MP -MF lib/.deps/lib_libcyrus_min_la-strhash.Tpo -c lib/strhash.c  -fPIC -DPIC -o lib/.libs/lib_libcyrus_min_la-strhash.o
libtool: compile:  i686-pld-linux-gcc -DHAVE_CONFIG_H -I. -I/usr/include/et -I. -I./lib -I. -I./lib -DLIBEXEC_DIR=\"/usr/libexec/cyrus\" -DSBIN_DIR=\"/usr/sbin\" -DSYSCONF_DIR=\"/etc\" -DHAVE_CONFIG_H -I/usr/include/libxml2 -I/usr/include/mysql -DKRB5_HEIMDAL -I/usr/include -fPIC -fvisibility=hidden -O2 -fwrapv -pipe -Wformat -Werror=format-security -gdwarf-4 -fno-debug-types-section -fvar-tracking-assignments -g2 -Wp,-D_FORTIFY_SOURCE=2 -fstack-protector-strong --param=ssp-buffer-size=4 -Werror=trampolines -fomit-frame-pointer -march=i686 -fasynchronous-unwind-tables -mtune=pentium4 -gdwarf-4 -fno-debug-types-section -fvar-tracking-assignments -g2 -MT lib/lib_libcyrus_min_la-strhash.lo -MD -MP -MF lib/.deps/lib_libcyrus_min_la-strhash.Tpo -c lib/strhash.c -o lib/lib_libcyrus_min_la-strhash.o >/dev/null 2>&1
mv -f lib/.deps/lib_libcyrus_min_la-strhash.Tpo lib/.deps/lib_libcyrus_min_la-strhash.Plo
/bin/sh ./libtool  --tag=CC   --mode=compile i686-pld-linux-gcc -DHAVE_CONFIG_H -I.  -I/usr/include/et -I. -I./lib -I. -I./lib -DLIBEXEC_DIR=\"/usr/libexec/cyrus\" -DSBIN_DIR=\"/usr/sbin\" -DSYSCONF_DIR=\"/etc\" -DHAVE_CONFIG_H      -I/usr/include/libxml2       -I/usr/include/mysql   -DKRB5_HEIMDAL -I/usr/include -fPIC  -fvisibility=hidden -O2 -fwrapv -pipe -Wformat -Werror=format-security -gdwarf-4 -fno-debug-types-section -fvar-tracking-assignments -g2 -Wp,-D_FORTIFY_SOURCE=2 -fstack-protector-strong --param=ssp-buffer-size=4 -Werror=trampolines -fomit-frame-pointer -march=i686 -fasynchronous-unwind-tables -mtune=pentium4 -gdwarf-4 -fno-debug-types-section -fvar-tracking-assignments -g2  -MT lib/lib_libcyrus_min_la-util.lo -MD -MP -MF lib/.deps/lib_libcyrus_min_la-util.Tpo -c -o lib/lib_libcyrus_min_la-util.lo `test -f 'lib/util.c' || echo './'`lib/util.c
libtool: compile:  i686-pld-linux-gcc -DHAVE_CONFIG_H -I. -I/usr/include/et -I. -I./lib -I. -I./lib -DLIBEXEC_DIR=\"/usr/libexec/cyrus\" -DSBIN_DIR=\"/usr/sbin\" -DSYSCONF_DIR=\"/etc\" -DHAVE_CONFIG_H -I/usr/include/libxml2 -I/usr/include/mysql -DKRB5_HEIMDAL -I/usr/include -fPIC -fvisibility=hidden -O2 -fwrapv -pipe -Wformat -Werror=format-security -gdwarf-4 -fno-debug-types-section -fvar-tracking-assignments -g2 -Wp,-D_FORTIFY_SOURCE=2 -fstack-protector-strong --param=ssp-buffer-size=4 -Werror=trampolines -fomit-frame-pointer -march=i686 -fasynchronous-unwind-tables -mtune=pentium4 -gdwarf-4 -fno-debug-types-section -fvar-tracking-assignments -g2 -MT lib/lib_libcyrus_min_la-util.lo -MD -MP -MF lib/.deps/lib_libcyrus_min_la-util.Tpo -c lib/util.c  -fPIC -DPIC -o lib/.libs/lib_libcyrus_min_la-util.o
libtool: compile:  i686-pld-linux-gcc -DHAVE_CONFIG_H -I. -I/usr/include/et -I. -I./lib -I. -I./lib -DLIBEXEC_DIR=\"/usr/libexec/cyrus\" -DSBIN_DIR=\"/usr/sbin\" -DSYSCONF_DIR=\"/etc\" -DHAVE_CONFIG_H -I/usr/include/libxml2 -I/usr/include/mysql -DKRB5_HEIMDAL -I/usr/include -fPIC -fvisibility=hidden -O2 -fwrapv -pipe -Wformat -Werror=format-security -gdwarf-4 -fno-debug-types-section -fvar-tracking-assignments -g2 -Wp,-D_FORTIFY_SOURCE=2 -fstack-protector-strong --param=ssp-buffer-size=4 -Werror=trampolines -fomit-frame-pointer -march=i686 -fasynchronous-unwind-tables -mtune=pentium4 -gdwarf-4 -fno-debug-types-section -fvar-tracking-assignments -g2 -MT lib/lib_libcyrus_min_la-util.lo -MD -MP -MF lib/.deps/lib_libcyrus_min_la-util.Tpo -c lib/util.c -o lib/lib_libcyrus_min_la-util.o >/dev/null 2>&1
mv -f lib/.deps/lib_libcyrus_min_la-util.Tpo lib/.deps/lib_libcyrus_min_la-util.Plo
/bin/sh ./libtool  --tag=CC   --mode=compile i686-pld-linux-gcc -DHAVE_CONFIG_H -I.  -I/usr/include/et -I. -I./lib -I. -I./lib -DLIBEXEC_DIR=\"/usr/libexec/cyrus\" -DSBIN_DIR=\"/usr/sbin\" -DSYSCONF_DIR=\"/etc\" -DHAVE_CONFIG_H      -I/usr/include/libxml2       -I/usr/include/mysql   -DKRB5_HEIMDAL -I/usr/include -fPIC  -fvisibility=hidden -O2 -fwrapv -pipe -Wformat -Werror=format-security -gdwarf-4 -fno-debug-types-section -fvar-tracking-assignments -g2 -Wp,-D_FORTIFY_SOURCE=2 -fstack-protector-strong --param=ssp-buffer-size=4 -Werror=trampolines -fomit-frame-pointer -march=i686 -fasynchronous-unwind-tables -mtune=pentium4 -gdwarf-4 -fno-debug-types-section -fvar-tracking-assignments -g2  -MT lib/lib_libcyrus_min_la-vparse.lo -MD -MP -MF lib/.deps/lib_libcyrus_min_la-vparse.Tpo -c -o lib/lib_libcyrus_min_la-vparse.lo `test -f 'lib/vparse.c' || echo './'`lib/vparse.c
libtool: compile:  i686-pld-linux-gcc -DHAVE_CONFIG_H -I. -I/usr/include/et -I. -I./lib -I. -I./lib -DLIBEXEC_DIR=\"/usr/libexec/cyrus\" -DSBIN_DIR=\"/usr/sbin\" -DSYSCONF_DIR=\"/etc\" -DHAVE_CONFIG_H -I/usr/include/libxml2 -I/usr/include/mysql -DKRB5_HEIMDAL -I/usr/include -fPIC -fvisibility=hidden -O2 -fwrapv -pipe -Wformat -Werror=format-security -gdwarf-4 -fno-debug-types-section -fvar-tracking-assignments -g2 -Wp,-D_FORTIFY_SOURCE=2 -fstack-protector-strong --param=ssp-buffer-size=4 -Werror=trampolines -fomit-frame-pointer -march=i686 -fasynchronous-unwind-tables -mtune=pentium4 -gdwarf-4 -fno-debug-types-section -fvar-tracking-assignments -g2 -MT lib/lib_libcyrus_min_la-vparse.lo -MD -MP -MF lib/.deps/lib_libcyrus_min_la-vparse.Tpo -c lib/vparse.c  -fPIC -DPIC -o lib/.libs/lib_libcyrus_min_la-vparse.o
libtool: compile:  i686-pld-linux-gcc -DHAVE_CONFIG_H -I. -I/usr/include/et -I. -I./lib -I. -I./lib -DLIBEXEC_DIR=\"/usr/libexec/cyrus\" -DSBIN_DIR=\"/usr/sbin\" -DSYSCONF_DIR=\"/etc\" -DHAVE_CONFIG_H -I/usr/include/libxml2 -I/usr/include/mysql -DKRB5_HEIMDAL -I/usr/include -fPIC -fvisibility=hidden -O2 -fwrapv -pipe -Wformat -Werror=format-security -gdwarf-4 -fno-debug-types-section -fvar-tracking-assignments -g2 -Wp,-D_FORTIFY_SOURCE=2 -fstack-protector-strong --param=ssp-buffer-size=4 -Werror=trampolines -fomit-frame-pointer -march=i686 -fasynchronous-unwind-tables -mtune=pentium4 -gdwarf-4 -fno-debug-types-section -fvar-tracking-assignments -g2 -MT lib/lib_libcyrus_min_la-vparse.lo -MD -MP -MF lib/.deps/lib_libcyrus_min_la-vparse.Tpo -c lib/vparse.c -o lib/lib_libcyrus_min_la-vparse.o >/dev/null 2>&1
mv -f lib/.deps/lib_libcyrus_min_la-vparse.Tpo lib/.deps/lib_libcyrus_min_la-vparse.Plo
/bin/sh ./libtool  --tag=CC   --mode=compile i686-pld-linux-gcc -DHAVE_CONFIG_H -I.  -I/usr/include/et -I. -I./lib -I. -I./lib -DLIBEXEC_DIR=\"/usr/libexec/cyrus\" -DSBIN_DIR=\"/usr/sbin\" -DSYSCONF_DIR=\"/etc\" -DHAVE_CONFIG_H      -I/usr/include/libxml2       -I/usr/include/mysql   -DKRB5_HEIMDAL -I/usr/include -fPIC  -fvisibility=hidden -O2 -fwrapv -pipe -Wformat -Werror=format-security -gdwarf-4 -fno-debug-types-section -fvar-tracking-assignments -g2 -Wp,-D_FORTIFY_SOURCE=2 -fstack-protector-strong --param=ssp-buffer-size=4 -Werror=trampolines -fomit-frame-pointer -march=i686 -fasynchronous-unwind-tables -mtune=pentium4 -gdwarf-4 -fno-debug-types-section -fvar-tracking-assignments -g2  -MT lib/lib_libcyrus_min_la-xmalloc.lo -MD -MP -MF lib/.deps/lib_libcyrus_min_la-xmalloc.Tpo -c -o lib/lib_libcyrus_min_la-xmalloc.lo `test -f 'lib/xmalloc.c' || echo './'`lib/xmalloc.c
libtool: compile:  i686-pld-linux-gcc -DHAVE_CONFIG_H -I. -I/usr/include/et -I. -I./lib -I. -I./lib -DLIBEXEC_DIR=\"/usr/libexec/cyrus\" -DSBIN_DIR=\"/usr/sbin\" -DSYSCONF_DIR=\"/etc\" -DHAVE_CONFIG_H -I/usr/include/libxml2 -I/usr/include/mysql -DKRB5_HEIMDAL -I/usr/include -fPIC -fvisibility=hidden -O2 -fwrapv -pipe -Wformat -Werror=format-security -gdwarf-4 -fno-debug-types-section -fvar-tracking-assignments -g2 -Wp,-D_FORTIFY_SOURCE=2 -fstack-protector-strong --param=ssp-buffer-size=4 -Werror=trampolines -fomit-frame-pointer -march=i686 -fasynchronous-unwind-tables -mtune=pentium4 -gdwarf-4 -fno-debug-types-section -fvar-tracking-assignments -g2 -MT lib/lib_libcyrus_min_la-xmalloc.lo -MD -MP -MF lib/.deps/lib_libcyrus_min_la-xmalloc.Tpo -c lib/xmalloc.c  -fPIC -DPIC -o lib/.libs/lib_libcyrus_min_la-xmalloc.o
libtool: compile:  i686-pld-linux-gcc -DHAVE_CONFIG_H -I. -I/usr/include/et -I. -I./lib -I. -I./lib -DLIBEXEC_DIR=\"/usr/libexec/cyrus\" -DSBIN_DIR=\"/usr/sbin\" -DSYSCONF_DIR=\"/etc\" -DHAVE_CONFIG_H -I/usr/include/libxml2 -I/usr/include/mysql -DKRB5_HEIMDAL -I/usr/include -fPIC -fvisibility=hidden -O2 -fwrapv -pipe -Wformat -Werror=format-security -gdwarf-4 -fno-debug-types-section -fvar-tracking-assignments -g2 -Wp,-D_FORTIFY_SOURCE=2 -fstack-protector-strong --param=ssp-buffer-size=4 -Werror=trampolines -fomit-frame-pointer -march=i686 -fasynchronous-unwind-tables -mtune=pentium4 -gdwarf-4 -fno-debug-types-section -fvar-tracking-assignments -g2 -MT lib/lib_libcyrus_min_la-xmalloc.lo -MD -MP -MF lib/.deps/lib_libcyrus_min_la-xmalloc.Tpo -c lib/xmalloc.c -o lib/lib_libcyrus_min_la-xmalloc.o >/dev/null 2>&1
mv -f lib/.deps/lib_libcyrus_min_la-xmalloc.Tpo lib/.deps/lib_libcyrus_min_la-xmalloc.Plo
/bin/sh ./libtool  --tag=CC   --mode=compile i686-pld-linux-gcc -DHAVE_CONFIG_H -I.  -I/usr/include/et -I. -I./lib -I. -I./lib -DLIBEXEC_DIR=\"/usr/libexec/cyrus\" -DSBIN_DIR=\"/usr/sbin\" -DSYSCONF_DIR=\"/etc\" -DHAVE_CONFIG_H      -I/usr/include/libxml2       -I/usr/include/mysql   -DKRB5_HEIMDAL -I/usr/include -fPIC  -fvisibility=hidden -O2 -fwrapv -pipe -Wformat -Werror=format-security -gdwarf-4 -fno-debug-types-section -fvar-tracking-assignments -g2 -Wp,-D_FORTIFY_SOURCE=2 -fstack-protector-strong --param=ssp-buffer-size=4 -Werror=trampolines -fomit-frame-pointer -march=i686 -fasynchronous-unwind-tables -mtune=pentium4 -gdwarf-4 -fno-debug-types-section -fvar-tracking-assignments -g2  -MT lib/lib_libcyrus_min_la-xstrlcat.lo -MD -MP -MF lib/.deps/lib_libcyrus_min_la-xstrlcat.Tpo -c -o lib/lib_libcyrus_min_la-xstrlcat.lo `test -f 'lib/xstrlcat.c' || echo './'`lib/xstrlcat.c
libtool: compile:  i686-pld-linux-gcc -DHAVE_CONFIG_H -I. -I/usr/include/et -I. -I./lib -I. -I./lib -DLIBEXEC_DIR=\"/usr/libexec/cyrus\" -DSBIN_DIR=\"/usr/sbin\" -DSYSCONF_DIR=\"/etc\" -DHAVE_CONFIG_H -I/usr/include/libxml2 -I/usr/include/mysql -DKRB5_HEIMDAL -I/usr/include -fPIC -fvisibility=hidden -O2 -fwrapv -pipe -Wformat -Werror=format-security -gdwarf-4 -fno-debug-types-section -fvar-tracking-assignments -g2 -Wp,-D_FORTIFY_SOURCE=2 -fstack-protector-strong --param=ssp-buffer-size=4 -Werror=trampolines -fomit-frame-pointer -march=i686 -fasynchronous-unwind-tables -mtune=pentium4 -gdwarf-4 -fno-debug-types-section -fvar-tracking-assignments -g2 -MT lib/lib_libcyrus_min_la-xstrlcat.lo -MD -MP -MF lib/.deps/lib_libcyrus_min_la-xstrlcat.Tpo -c lib/xstrlcat.c  -fPIC -DPIC -o lib/.libs/lib_libcyrus_min_la-xstrlcat.o
libtool: compile:  i686-pld-linux-gcc -DHAVE_CONFIG_H -I. -I/usr/include/et -I. -I./lib -I. -I./lib -DLIBEXEC_DIR=\"/usr/libexec/cyrus\" -DSBIN_DIR=\"/usr/sbin\" -DSYSCONF_DIR=\"/etc\" -DHAVE_CONFIG_H -I/usr/include/libxml2 -I/usr/include/mysql -DKRB5_HEIMDAL -I/usr/include -fPIC -fvisibility=hidden -O2 -fwrapv -pipe -Wformat -Werror=format-security -gdwarf-4 -fno-debug-types-section -fvar-tracking-assignments -g2 -Wp,-D_FORTIFY_SOURCE=2 -fstack-protector-strong --param=ssp-buffer-size=4 -Werror=trampolines -fomit-frame-pointer -march=i686 -fasynchronous-unwind-tables -mtune=pentium4 -gdwarf-4 -fno-debug-types-section -fvar-tracking-assignments -g2 -MT lib/lib_libcyrus_min_la-xstrlcat.lo -MD -MP -MF lib/.deps/lib_libcyrus_min_la-xstrlcat.Tpo -c lib/xstrlcat.c -o lib/lib_libcyrus_min_la-xstrlcat.o >/dev/null 2>&1
mv -f lib/.deps/lib_libcyrus_min_la-xstrlcat.Tpo lib/.deps/lib_libcyrus_min_la-xstrlcat.Plo
/bin/sh ./libtool  --tag=CC   --mode=compile i686-pld-linux-gcc -DHAVE_CONFIG_H -I.  -I/usr/include/et -I. -I./lib -I. -I./lib -DLIBEXEC_DIR=\"/usr/libexec/cyrus\" -DSBIN_DIR=\"/usr/sbin\" -DSYSCONF_DIR=\"/etc\" -DHAVE_CONFIG_H      -I/usr/include/libxml2       -I/usr/include/mysql   -DKRB5_HEIMDAL -I/usr/include -fPIC  -fvisibility=hidden -O2 -fwrapv -pipe -Wformat -Werror=format-security -gdwarf-4 -fno-debug-types-section -fvar-tracking-assignments -g2 -Wp,-D_FORTIFY_SOURCE=2 -fstack-protector-strong --param=ssp-buffer-size=4 -Werror=trampolines -fomit-frame-pointer -march=i686 -fasynchronous-unwind-tables -mtune=pentium4 -gdwarf-4 -fno-debug-types-section -fvar-tracking-assignments -g2  -MT lib/lib_libcyrus_min_la-xstrlcpy.lo -MD -MP -MF lib/.deps/lib_libcyrus_min_la-xstrlcpy.Tpo -c -o lib/lib_libcyrus_min_la-xstrlcpy.lo `test -f 'lib/xstrlcpy.c' || echo './'`lib/xstrlcpy.c
libtool: compile:  i686-pld-linux-gcc -DHAVE_CONFIG_H -I. -I/usr/include/et -I. -I./lib -I. -I./lib -DLIBEXEC_DIR=\"/usr/libexec/cyrus\" -DSBIN_DIR=\"/usr/sbin\" -DSYSCONF_DIR=\"/etc\" -DHAVE_CONFIG_H -I/usr/include/libxml2 -I/usr/include/mysql -DKRB5_HEIMDAL -I/usr/include -fPIC -fvisibility=hidden -O2 -fwrapv -pipe -Wformat -Werror=format-security -gdwarf-4 -fno-debug-types-section -fvar-tracking-assignments -g2 -Wp,-D_FORTIFY_SOURCE=2 -fstack-protector-strong --param=ssp-buffer-size=4 -Werror=trampolines -fomit-frame-pointer -march=i686 -fasynchronous-unwind-tables -mtune=pentium4 -gdwarf-4 -fno-debug-types-section -fvar-tracking-assignments -g2 -MT lib/lib_libcyrus_min_la-xstrlcpy.lo -MD -MP -MF lib/.deps/lib_libcyrus_min_la-xstrlcpy.Tpo -c lib/xstrlcpy.c  -fPIC -DPIC -o lib/.libs/lib_libcyrus_min_la-xstrlcpy.o
libtool: compile:  i686-pld-linux-gcc -DHAVE_CONFIG_H -I. -I/usr/include/et -I. -I./lib -I. -I./lib -DLIBEXEC_DIR=\"/usr/libexec/cyrus\" -DSBIN_DIR=\"/usr/sbin\" -DSYSCONF_DIR=\"/etc\" -DHAVE_CONFIG_H -I/usr/include/libxml2 -I/usr/include/mysql -DKRB5_HEIMDAL -I/usr/include -fPIC -fvisibility=hidden -O2 -fwrapv -pipe -Wformat -Werror=format-security -gdwarf-4 -fno-debug-types-section -fvar-tracking-assignments -g2 -Wp,-D_FORTIFY_SOURCE=2 -fstack-protector-strong --param=ssp-buffer-size=4 -Werror=trampolines -fomit-frame-pointer -march=i686 -fasynchronous-unwind-tables -mtune=pentium4 -gdwarf-4 -fno-debug-types-section -fvar-tracking-assignments -g2 -MT lib/lib_libcyrus_min_la-xstrlcpy.lo -MD -MP -MF lib/.deps/lib_libcyrus_min_la-xstrlcpy.Tpo -c lib/xstrlcpy.c -o lib/lib_libcyrus_min_la-xstrlcpy.o >/dev/null 2>&1
mv -f lib/.deps/lib_libcyrus_min_la-xstrlcpy.Tpo lib/.deps/lib_libcyrus_min_la-xstrlcpy.Plo
/bin/sh ./libtool  --tag=CC   --mode=compile i686-pld-linux-gcc -DHAVE_CONFIG_H -I.  -I/usr/include/et -I. -I./lib -I. -I./lib -DLIBEXEC_DIR=\"/usr/libexec/cyrus\" -DSBIN_DIR=\"/usr/sbin\" -DSYSCONF_DIR=\"/etc\" -DHAVE_CONFIG_H      -I/usr/include/libxml2       -I/usr/include/mysql   -DKRB5_HEIMDAL -I/usr/include -fPIC  -fvisibility=hidden -O2 -fwrapv -pipe -Wformat -Werror=format-security -gdwarf-4 -fno-debug-types-section -fvar-tracking-assignments -g2 -Wp,-D_FORTIFY_SOURCE=2 -fstack-protector-strong --param=ssp-buffer-size=4 -Werror=trampolines -fomit-frame-pointer -march=i686 -fasynchronous-unwind-tables -mtune=pentium4 -gdwarf-4 -fno-debug-types-section -fvar-tracking-assignments -g2  -MT lib/lib_libcyrus_min_la-xstrnchr.lo -MD -MP -MF lib/.deps/lib_libcyrus_min_la-xstrnchr.Tpo -c -o lib/lib_libcyrus_min_la-xstrnchr.lo `test -f 'lib/xstrnchr.c' || echo './'`lib/xstrnchr.c
libtool: compile:  i686-pld-linux-gcc -DHAVE_CONFIG_H -I. -I/usr/include/et -I. -I./lib -I. -I./lib -DLIBEXEC_DIR=\"/usr/libexec/cyrus\" -DSBIN_DIR=\"/usr/sbin\" -DSYSCONF_DIR=\"/etc\" -DHAVE_CONFIG_H -I/usr/include/libxml2 -I/usr/include/mysql -DKRB5_HEIMDAL -I/usr/include -fPIC -fvisibility=hidden -O2 -fwrapv -pipe -Wformat -Werror=format-security -gdwarf-4 -fno-debug-types-section -fvar-tracking-assignments -g2 -Wp,-D_FORTIFY_SOURCE=2 -fstack-protector-strong --param=ssp-buffer-size=4 -Werror=trampolines -fomit-frame-pointer -march=i686 -fasynchronous-unwind-tables -mtune=pentium4 -gdwarf-4 -fno-debug-types-section -fvar-tracking-assignments -g2 -MT lib/lib_libcyrus_min_la-xstrnchr.lo -MD -MP -MF lib/.deps/lib_libcyrus_min_la-xstrnchr.Tpo -c lib/xstrnchr.c  -fPIC -DPIC -o lib/.libs/lib_libcyrus_min_la-xstrnchr.o
libtool: compile:  i686-pld-linux-gcc -DHAVE_CONFIG_H -I. -I/usr/include/et -I. -I./lib -I. -I./lib -DLIBEXEC_DIR=\"/usr/libexec/cyrus\" -DSBIN_DIR=\"/usr/sbin\" -DSYSCONF_DIR=\"/etc\" -DHAVE_CONFIG_H -I/usr/include/libxml2 -I/usr/include/mysql -DKRB5_HEIMDAL -I/usr/include -fPIC -fvisibility=hidden -O2 -fwrapv -pipe -Wformat -Werror=format-security -gdwarf-4 -fno-debug-types-section -fvar-tracking-assignments -g2 -Wp,-D_FORTIFY_SOURCE=2 -fstack-protector-strong --param=ssp-buffer-size=4 -Werror=trampolines -fomit-frame-pointer -march=i686 -fasynchronous-unwind-tables -mtune=pentium4 -gdwarf-4 -fno-debug-types-section -fvar-tracking-assignments -g2 -MT lib/lib_libcyrus_min_la-xstrnchr.lo -MD -MP -MF lib/.deps/lib_libcyrus_min_la-xstrnchr.Tpo -c lib/xstrnchr.c -o lib/lib_libcyrus_min_la-xstrnchr.o >/dev/null 2>&1
mv -f lib/.deps/lib_libcyrus_min_la-xstrnchr.Tpo lib/.deps/lib_libcyrus_min_la-xstrnchr.Plo
/bin/sh ./libtool  --tag=CC   --mode=compile i686-pld-linux-gcc -DHAVE_CONFIG_H -I.  -I/usr/include/et -I. -I./lib -I. -I./lib -DLIBEXEC_DIR=\"/usr/libexec/cyrus\" -DSBIN_DIR=\"/usr/sbin\" -DSYSCONF_DIR=\"/etc\" -DHAVE_CONFIG_H      -I/usr/include/libxml2       -I/usr/include/mysql   -DKRB5_HEIMDAL -I/usr/include -fPIC  -fvisibility=hidden -O2 -fwrapv -pipe -Wformat -Werror=format-security -gdwarf-4 -fno-debug-types-section -fvar-tracking-assignments -g2 -Wp,-D_FORTIFY_SOURCE=2 -fstack-protector-strong --param=ssp-buffer-size=4 -Werror=trampolines -fomit-frame-pointer -march=i686 -fasynchronous-unwind-tables -mtune=pentium4 -gdwarf-4 -fno-debug-types-section -fvar-tracking-assignments -g2  -MT lib/lib_libcyrus_min_la-lock_fcntl.lo -MD -MP -MF lib/.deps/lib_libcyrus_min_la-lock_fcntl.Tpo -c -o lib/lib_libcyrus_min_la-lock_fcntl.lo `test -f 'lib/lock_fcntl.c' || echo './'`lib/lock_fcntl.c
libtool: compile:  i686-pld-linux-gcc -DHAVE_CONFIG_H -I. -I/usr/include/et -I. -I./lib -I. -I./lib -DLIBEXEC_DIR=\"/usr/libexec/cyrus\" -DSBIN_DIR=\"/usr/sbin\" -DSYSCONF_DIR=\"/etc\" -DHAVE_CONFIG_H -I/usr/include/libxml2 -I/usr/include/mysql -DKRB5_HEIMDAL -I/usr/include -fPIC -fvisibility=hidden -O2 -fwrapv -pipe -Wformat -Werror=format-security -gdwarf-4 -fno-debug-types-section -fvar-tracking-assignments -g2 -Wp,-D_FORTIFY_SOURCE=2 -fstack-protector-strong --param=ssp-buffer-size=4 -Werror=trampolines -fomit-frame-pointer -march=i686 -fasynchronous-unwind-tables -mtune=pentium4 -gdwarf-4 -fno-debug-types-section -fvar-tracking-assignments -g2 -MT lib/lib_libcyrus_min_la-lock_fcntl.lo -MD -MP -MF lib/.deps/lib_libcyrus_min_la-lock_fcntl.Tpo -c lib/lock_fcntl.c  -fPIC -DPIC -o lib/.libs/lib_libcyrus_min_la-lock_fcntl.o
libtool: compile:  i686-pld-linux-gcc -DHAVE_CONFIG_H -I. -I/usr/include/et -I. -I./lib -I. -I./lib -DLIBEXEC_DIR=\"/usr/libexec/cyrus\" -DSBIN_DIR=\"/usr/sbin\" -DSYSCONF_DIR=\"/etc\" -DHAVE_CONFIG_H -I/usr/include/libxml2 -I/usr/include/mysql -DKRB5_HEIMDAL -I/usr/include -fPIC -fvisibility=hidden -O2 -fwrapv -pipe -Wformat -Werror=format-security -gdwarf-4 -fno-debug-types-section -fvar-tracking-assignments -g2 -Wp,-D_FORTIFY_SOURCE=2 -fstack-protector-strong --param=ssp-buffer-size=4 -Werror=trampolines -fomit-frame-pointer -march=i686 -fasynchronous-unwind-tables -mtune=pentium4 -gdwarf-4 -fno-debug-types-section -fvar-tracking-assignments -g2 -MT lib/lib_libcyrus_min_la-lock_fcntl.lo -MD -MP -MF lib/.deps/lib_libcyrus_min_la-lock_fcntl.Tpo -c lib/lock_fcntl.c -o lib/lib_libcyrus_min_la-lock_fcntl.o >/dev/null 2>&1
mv -f lib/.deps/lib_libcyrus_min_la-lock_fcntl.Tpo lib/.deps/lib_libcyrus_min_la-lock_fcntl.Plo
/bin/sh ./libtool  --tag=CC   --mode=compile i686-pld-linux-gcc -DHAVE_CONFIG_H -I.  -I/usr/include/et -I. -I./lib -I. -I./lib -DLIBEXEC_DIR=\"/usr/libexec/cyrus\" -DSBIN_DIR=\"/usr/sbin\" -DSYSCONF_DIR=\"/etc\" -DHAVE_CONFIG_H      -I/usr/include/libxml2       -I/usr/include/mysql   -DKRB5_HEIMDAL -I/usr/include -fPIC  -fvisibility=hidden -O2 -fwrapv -pipe -Wformat -Werror=format-security -gdwarf-4 -fno-debug-types-section -fvar-tracking-assignments -g2 -Wp,-D_FORTIFY_SOURCE=2 -fstack-protector-strong --param=ssp-buffer-size=4 -Werror=trampolines -fomit-frame-pointer -march=i686 -fasynchronous-unwind-tables -mtune=pentium4 -gdwarf-4 -fno-debug-types-section -fvar-tracking-assignments -g2  -MT lib/lib_libcyrus_min_la-map_shared.lo -MD -MP -MF lib/.deps/lib_libcyrus_min_la-map_shared.Tpo -c -o lib/lib_libcyrus_min_la-map_shared.lo `test -f 'lib/map_shared.c' || echo './'`lib/map_shared.c
libtool: compile:  i686-pld-linux-gcc -DHAVE_CONFIG_H -I. -I/usr/include/et -I. -I./lib -I. -I./lib -DLIBEXEC_DIR=\"/usr/libexec/cyrus\" -DSBIN_DIR=\"/usr/sbin\" -DSYSCONF_DIR=\"/etc\" -DHAVE_CONFIG_H -I/usr/include/libxml2 -I/usr/include/mysql -DKRB5_HEIMDAL -I/usr/include -fPIC -fvisibility=hidden -O2 -fwrapv -pipe -Wformat -Werror=format-security -gdwarf-4 -fno-debug-types-section -fvar-tracking-assignments -g2 -Wp,-D_FORTIFY_SOURCE=2 -fstack-protector-strong --param=ssp-buffer-size=4 -Werror=trampolines -fomit-frame-pointer -march=i686 -fasynchronous-unwind-tables -mtune=pentium4 -gdwarf-4 -fno-debug-types-section -fvar-tracking-assignments -g2 -MT lib/lib_libcyrus_min_la-map_shared.lo -MD -MP -MF lib/.deps/lib_libcyrus_min_la-map_shared.Tpo -c lib/map_shared.c  -fPIC -DPIC -o lib/.libs/lib_libcyrus_min_la-map_shared.o
libtool: compile:  i686-pld-linux-gcc -DHAVE_CONFIG_H -I. -I/usr/include/et -I. -I./lib -I. -I./lib -DLIBEXEC_DIR=\"/usr/libexec/cyrus\" -DSBIN_DIR=\"/usr/sbin\" -DSYSCONF_DIR=\"/etc\" -DHAVE_CONFIG_H -I/usr/include/libxml2 -I/usr/include/mysql -DKRB5_HEIMDAL -I/usr/include -fPIC -fvisibility=hidden -O2 -fwrapv -pipe -Wformat -Werror=format-security -gdwarf-4 -fno-debug-types-section -fvar-tracking-assignments -g2 -Wp,-D_FORTIFY_SOURCE=2 -fstack-protector-strong --param=ssp-buffer-size=4 -Werror=trampolines -fomit-frame-pointer -march=i686 -fasynchronous-unwind-tables -mtune=pentium4 -gdwarf-4 -fno-debug-types-section -fvar-tracking-assignments -g2 -MT lib/lib_libcyrus_min_la-map_shared.lo -MD -MP -MF lib/.deps/lib_libcyrus_min_la-map_shared.Tpo -c lib/map_shared.c -o lib/lib_libcyrus_min_la-map_shared.o >/dev/null 2>&1
mv -f lib/.deps/lib_libcyrus_min_la-map_shared.Tpo lib/.deps/lib_libcyrus_min_la-map_shared.Plo
/bin/sh ./libtool  --tag=CC   --mode=compile i686-pld-linux-gcc -DHAVE_CONFIG_H -I.  -I/usr/include/et -I. -I./lib -I. -I./lib -DLIBEXEC_DIR=\"/usr/libexec/cyrus\" -DSBIN_DIR=\"/usr/sbin\" -DSYSCONF_DIR=\"/etc\" -DHAVE_CONFIG_H      -I/usr/include/libxml2       -I/usr/include/mysql   -DKRB5_HEIMDAL -I/usr/include -fPIC  -fvisibility=hidden -O2 -fwrapv -pipe -Wformat -Werror=format-security -gdwarf-4 -fno-debug-types-section -fvar-tracking-assignments -g2 -Wp,-D_FORTIFY_SOURCE=2 -fstack-protector-strong --param=ssp-buffer-size=4 -Werror=trampolines -fomit-frame-pointer -march=i686 -fasynchronous-unwind-tables -mtune=pentium4 -gdwarf-4 -fno-debug-types-section -fvar-tracking-assignments -g2  -MT lib/lib_libcyrus_min_la-imapopts.lo -MD -MP -MF lib/.deps/lib_libcyrus_min_la-imapopts.Tpo -c -o lib/lib_libcyrus_min_la-imapopts.lo `test -f 'lib/imapopts.c' || echo './'`lib/imapopts.c
libtool: compile:  i686-pld-linux-gcc -DHAVE_CONFIG_H -I. -I/usr/include/et -I. -I./lib -I. -I./lib -DLIBEXEC_DIR=\"/usr/libexec/cyrus\" -DSBIN_DIR=\"/usr/sbin\" -DSYSCONF_DIR=\"/etc\" -DHAVE_CONFIG_H -I/usr/include/libxml2 -I/usr/include/mysql -DKRB5_HEIMDAL -I/usr/include -fPIC -fvisibility=hidden -O2 -fwrapv -pipe -Wformat -Werror=format-security -gdwarf-4 -fno-debug-types-section -fvar-tracking-assignments -g2 -Wp,-D_FORTIFY_SOURCE=2 -fstack-protector-strong --param=ssp-buffer-size=4 -Werror=trampolines -fomit-frame-pointer -march=i686 -fasynchronous-unwind-tables -mtune=pentium4 -gdwarf-4 -fno-debug-types-section -fvar-tracking-assignments -g2 -MT lib/lib_libcyrus_min_la-imapopts.lo -MD -MP -MF lib/.deps/lib_libcyrus_min_la-imapopts.Tpo -c lib/imapopts.c  -fPIC -DPIC -o lib/.libs/lib_libcyrus_min_la-imapopts.o
libtool: compile:  i686-pld-linux-gcc -DHAVE_CONFIG_H -I. -I/usr/include/et -I. -I./lib -I. -I./lib -DLIBEXEC_DIR=\"/usr/libexec/cyrus\" -DSBIN_DIR=\"/usr/sbin\" -DSYSCONF_DIR=\"/etc\" -DHAVE_CONFIG_H -I/usr/include/libxml2 -I/usr/include/mysql -DKRB5_HEIMDAL -I/usr/include -fPIC -fvisibility=hidden -O2 -fwrapv -pipe -Wformat -Werror=format-security -gdwarf-4 -fno-debug-types-section -fvar-tracking-assignments -g2 -Wp,-D_FORTIFY_SOURCE=2 -fstack-protector-strong --param=ssp-buffer-size=4 -Werror=trampolines -fomit-frame-pointer -march=i686 -fasynchronous-unwind-tables -mtune=pentium4 -gdwarf-4 -fno-debug-types-section -fvar-tracking-assignments -g2 -MT lib/lib_libcyrus_min_la-imapopts.lo -MD -MP -MF lib/.deps/lib_libcyrus_min_la-imapopts.Tpo -c lib/imapopts.c -o lib/lib_libcyrus_min_la-imapopts.o >/dev/null 2>&1
mv -f lib/.deps/lib_libcyrus_min_la-imapopts.Tpo lib/.deps/lib_libcyrus_min_la-imapopts.Plo
/bin/sh ./libtool  --tag=CC   --mode=link i686-pld-linux-gcc -fPIC  -fvisibility=hidden -O2 -fwrapv -pipe -Wformat -Werror=format-security -gdwarf-4 -fno-debug-types-section -fvar-tracking-assignments -g2 -Wp,-D_FORTIFY_SOURCE=2 -fstack-protector-strong --param=ssp-buffer-size=4 -Werror=trampolines -fomit-frame-pointer -march=i686 -fasynchronous-unwind-tables -mtune=pentium4 -gdwarf-4 -fno-debug-types-section -fvar-tracking-assignments -g2   -licuuc -licudata -lxml2  -lical -licalss -licalvcal -ljansson -lnghttp2 -lbrotlienc -lshp -lm -Wl,--as-needed -Wl,--no-copy-dt-needed-entries -Wl,-z,relro -Wl,-z,combreloc  -o lib/libcyrus_min.la -rpath /usr/lib lib/lib_libcyrus_min_la-arrayu64.lo lib/lib_libcyrus_min_la-assert.lo lib/lib_libcyrus_min_la-bufarray.lo lib/lib_libcyrus_min_la-byteorder64.lo lib/lib_libcyrus_min_la-hash.lo lib/lib_libcyrus_min_la-hashu64.lo lib/lib_libcyrus_min_la-libconfig.lo lib/lib_libcyrus_min_la-mpool.lo lib/lib_libcyrus_min_la-retry.lo lib/lib_libcyrus_min_la-strarray.lo lib/lib_libcyrus_min_la-strhash.lo lib/lib_libcyrus_min_la-util.lo lib/lib_libcyrus_min_la-vparse.lo lib/lib_libcyrus_min_la-xmalloc.lo lib/lib_libcyrus_min_la-xstrlcat.lo lib/lib_libcyrus_min_la-xstrlcpy.lo lib/lib_libcyrus_min_la-xstrnchr.lo    lib/lib_libcyrus_min_la-lock_fcntl.lo  lib/lib_libcyrus_min_la-map_shared.lo   lib/lib_libcyrus_min_la-imapopts.lo  -luuid  -lgssapi -lkrb5 -lasn1 -lroken -lcrypt  -lcom_err -lresolv -lresolv  -lresolv   -L/usr/lib -lmysqlclient -lz -lm -latomic -lssl -lcrypto  -lpq -lpcre -lpcreposix -lz -lcap -lxml2 -lical -licalss -licalvcal -licui18n -licuuc -licudata  -lsqlite3
libtool: link: i686-pld-linux-gcc -shared  -fPIC -DPIC  -O2 -gdwarf-4 -g2 -fstack-protector-strong -march=i686 -mtune=pentium4 -gdwarf-4 -g2 -Wl,--as-needed -Wl,--no-copy-dt-needed-entries -Wl,-z -Wl,relro -Wl,-z -Wl,combreloc   -pthread  lib/.libs/lib_libcyrus_min_la-arrayu64.o lib/.libs/lib_libcyrus_min_la-assert.o lib/.libs/lib_libcyrus_min_la-bufarray.o lib/.libs/lib_libcyrus_min_la-byteorder64.o lib/.libs/lib_libcyrus_min_la-hash.o lib/.libs/lib_libcyrus_min_la-hashu64.o lib/.libs/lib_libcyrus_min_la-libconfig.o lib/.libs/lib_libcyrus_min_la-mpool.o lib/.libs/lib_libcyrus_min_la-retry.o lib/.libs/lib_libcyrus_min_la-strarray.o lib/.libs/lib_libcyrus_min_la-strhash.o lib/.libs/lib_libcyrus_min_la-util.o lib/.libs/lib_libcyrus_min_la-vparse.o lib/.libs/lib_libcyrus_min_la-xmalloc.o lib/.libs/lib_libcyrus_min_la-xstrlcat.o lib/.libs/lib_libcyrus_min_la-xstrlcpy.o lib/.libs/lib_libcyrus_min_la-xstrnchr.o lib/.libs/lib_libcyrus_min_la-lock_fcntl.o lib/.libs/lib_libcyrus_min_la-map_shared.o lib/.libs/lib_libcyrus_min_la-imapopts.o   -ljansson -lnghttp2 -lbrotlienc /usr/lib/libshp.so /usr/lib/libuuid.so /usr/lib/libgssapi.so -L/usr/lib /usr/lib/libheimntlm.so /usr/lib/libkrb5.so /usr/lib/libhx509.so /usr/lib/libwind.so /usr/lib/libhcrypto.so /usr/lib/libheimbase.so /usr/lib/libasn1.so /usr/lib/libroken.so -lcrypt -lcom_err -lresolv -lmysqlclient /usr/lib/libatomic.so -lssl -lcrypto -lpq /usr/lib/libpcreposix.so /usr/lib/libpcre.so -lcap /usr/lib/libxml2.so /usr/lib/liblzma.so -lpthread -lical -licalss -licalvcal -licui18n -licuuc -licudata /usr/lib/libsqlite3.so -lm -lz -ldl -Wl,-soname -Wl,libcyrus_min.so.0 -o lib/.libs/libcyrus_min.so.0.0.0
libtool: link: (cd "lib/.libs" && rm -f "libcyrus_min.so.0" && ln -s "libcyrus_min.so.0.0.0" "libcyrus_min.so.0")
libtool: link: (cd "lib/.libs" && rm -f "libcyrus_min.so" && ln -s "libcyrus_min.so.0.0.0" "libcyrus_min.so")
libtool: link: ar cr lib/.libs/libcyrus_min.a  lib/lib_libcyrus_min_la-arrayu64.o lib/lib_libcyrus_min_la-assert.o lib/lib_libcyrus_min_la-bufarray.o lib/lib_libcyrus_min_la-byteorder64.o lib/lib_libcyrus_min_la-hash.o lib/lib_libcyrus_min_la-hashu64.o lib/lib_libcyrus_min_la-libconfig.o lib/lib_libcyrus_min_la-mpool.o lib/lib_libcyrus_min_la-retry.o lib/lib_libcyrus_min_la-strarray.o lib/lib_libcyrus_min_la-strhash.o lib/lib_libcyrus_min_la-util.o lib/lib_libcyrus_min_la-vparse.o lib/lib_libcyrus_min_la-xmalloc.o lib/lib_libcyrus_min_la-xstrlcat.o lib/lib_libcyrus_min_la-xstrlcpy.o lib/lib_libcyrus_min_la-xstrnchr.o lib/lib_libcyrus_min_la-lock_fcntl.o lib/lib_libcyrus_min_la-map_shared.o lib/lib_libcyrus_min_la-imapopts.o
libtool: link: ranlib lib/.libs/libcyrus_min.a
libtool: link: ( cd "lib/.libs" && rm -f "libcyrus_min.la" && ln -s "../libcyrus_min.la" "libcyrus_min.la" )
/bin/sh ./libtool  --tag=CC   --mode=compile i686-pld-linux-gcc -DHAVE_CONFIG_H -I.  -I/usr/include/et -I. -I./lib -I. -I./lib -DLIBEXEC_DIR=\"/usr/libexec/cyrus\" -DSBIN_DIR=\"/usr/sbin\" -DSYSCONF_DIR=\"/etc\" -DHAVE_CONFIG_H      -I/usr/include/libxml2       -I/usr/include/mysql   -DKRB5_HEIMDAL -I/usr/include -O3 -fPIC  -fvisibility=hidden -O2 -fwrapv -pipe -Wformat -Werror=format-security -gdwarf-4 -fno-debug-types-section -fvar-tracking-assignments -g2 -Wp,-D_FORTIFY_SOURCE=2 -fstack-protector-strong --param=ssp-buffer-size=4 -Werror=trampolines -fomit-frame-pointer -march=i686 -fasynchronous-unwind-tables -mtune=pentium4 -gdwarf-4 -fno-debug-types-section -fvar-tracking-assignments -g2  -MT lib/libcrc32_la-crc32.lo -MD -MP -MF lib/.deps/libcrc32_la-crc32.Tpo -c -o lib/libcrc32_la-crc32.lo `test -f 'lib/crc32.c' || echo './'`lib/crc32.c
libtool: compile:  i686-pld-linux-gcc -DHAVE_CONFIG_H -I. -I/usr/include/et -I. -I./lib -I. -I./lib -DLIBEXEC_DIR=\"/usr/libexec/cyrus\" -DSBIN_DIR=\"/usr/sbin\" -DSYSCONF_DIR=\"/etc\" -DHAVE_CONFIG_H -I/usr/include/libxml2 -I/usr/include/mysql -DKRB5_HEIMDAL -I/usr/include -O3 -fPIC -fvisibility=hidden -O2 -fwrapv -pipe -Wformat -Werror=format-security -gdwarf-4 -fno-debug-types-section -fvar-tracking-assignments -g2 -Wp,-D_FORTIFY_SOURCE=2 -fstack-protector-strong --param=ssp-buffer-size=4 -Werror=trampolines -fomit-frame-pointer -march=i686 -fasynchronous-unwind-tables -mtune=pentium4 -gdwarf-4 -fno-debug-types-section -fvar-tracking-assignments -g2 -MT lib/libcrc32_la-crc32.lo -MD -MP -MF lib/.deps/libcrc32_la-crc32.Tpo -c lib/crc32.c  -fPIC -DPIC -o lib/.libs/libcrc32_la-crc32.o
libtool: compile:  i686-pld-linux-gcc -DHAVE_CONFIG_H -I. -I/usr/include/et -I. -I./lib -I. -I./lib -DLIBEXEC_DIR=\"/usr/libexec/cyrus\" -DSBIN_DIR=\"/usr/sbin\" -DSYSCONF_DIR=\"/etc\" -DHAVE_CONFIG_H -I/usr/include/libxml2 -I/usr/include/mysql -DKRB5_HEIMDAL -I/usr/include -O3 -fPIC -fvisibility=hidden -O2 -fwrapv -pipe -Wformat -Werror=format-security -gdwarf-4 -fno-debug-types-section -fvar-tracking-assignments -g2 -Wp,-D_FORTIFY_SOURCE=2 -fstack-protector-strong --param=ssp-buffer-size=4 -Werror=trampolines -fomit-frame-pointer -march=i686 -fasynchronous-unwind-tables -mtune=pentium4 -gdwarf-4 -fno-debug-types-section -fvar-tracking-assignments -g2 -MT lib/libcrc32_la-crc32.lo -MD -MP -MF lib/.deps/libcrc32_la-crc32.Tpo -c lib/crc32.c -o lib/libcrc32_la-crc32.o >/dev/null 2>&1
mv -f lib/.deps/libcrc32_la-crc32.Tpo lib/.deps/libcrc32_la-crc32.Plo
/bin/sh ./libtool  --tag=CC   --mode=compile i686-pld-linux-gcc -DHAVE_CONFIG_H -I.  -I/usr/include/et -I. -I./lib -I. -I./lib -DLIBEXEC_DIR=\"/usr/libexec/cyrus\" -DSBIN_DIR=\"/usr/sbin\" -DSYSCONF_DIR=\"/etc\" -DHAVE_CONFIG_H      -I/usr/include/libxml2       -I/usr/include/mysql   -DKRB5_HEIMDAL -I/usr/include -O3 -fPIC  -fvisibility=hidden -O2 -fwrapv -pipe -Wformat -Werror=format-security -gdwarf-4 -fno-debug-types-section -fvar-tracking-assignments -g2 -Wp,-D_FORTIFY_SOURCE=2 -fstack-protector-strong --param=ssp-buffer-size=4 -Werror=trampolines -fomit-frame-pointer -march=i686 -fasynchronous-unwind-tables -mtune=pentium4 -gdwarf-4 -fno-debug-types-section -fvar-tracking-assignments -g2  -MT lib/libcrc32_la-crc32c.lo -MD -MP -MF lib/.deps/libcrc32_la-crc32c.Tpo -c -o lib/libcrc32_la-crc32c.lo `test -f 'lib/crc32c.c' || echo './'`lib/crc32c.c
libtool: compile:  i686-pld-linux-gcc -DHAVE_CONFIG_H -I. -I/usr/include/et -I. -I./lib -I. -I./lib -DLIBEXEC_DIR=\"/usr/libexec/cyrus\" -DSBIN_DIR=\"/usr/sbin\" -DSYSCONF_DIR=\"/etc\" -DHAVE_CONFIG_H -I/usr/include/libxml2 -I/usr/include/mysql -DKRB5_HEIMDAL -I/usr/include -O3 -fPIC -fvisibility=hidden -O2 -fwrapv -pipe -Wformat -Werror=format-security -gdwarf-4 -fno-debug-types-section -fvar-tracking-assignments -g2 -Wp,-D_FORTIFY_SOURCE=2 -fstack-protector-strong --param=ssp-buffer-size=4 -Werror=trampolines -fomit-frame-pointer -march=i686 -fasynchronous-unwind-tables -mtune=pentium4 -gdwarf-4 -fno-debug-types-section -fvar-tracking-assignments -g2 -MT lib/libcrc32_la-crc32c.lo -MD -MP -MF lib/.deps/libcrc32_la-crc32c.Tpo -c lib/crc32c.c  -fPIC -DPIC -o lib/.libs/libcrc32_la-crc32c.o
libtool: compile:  i686-pld-linux-gcc -DHAVE_CONFIG_H -I. -I/usr/include/et -I. -I./lib -I. -I./lib -DLIBEXEC_DIR=\"/usr/libexec/cyrus\" -DSBIN_DIR=\"/usr/sbin\" -DSYSCONF_DIR=\"/etc\" -DHAVE_CONFIG_H -I/usr/include/libxml2 -I/usr/include/mysql -DKRB5_HEIMDAL -I/usr/include -O3 -fPIC -fvisibility=hidden -O2 -fwrapv -pipe -Wformat -Werror=format-security -gdwarf-4 -fno-debug-types-section -fvar-tracking-assignments -g2 -Wp,-D_FORTIFY_SOURCE=2 -fstack-protector-strong --param=ssp-buffer-size=4 -Werror=trampolines -fomit-frame-pointer -march=i686 -fasynchronous-unwind-tables -mtune=pentium4 -gdwarf-4 -fno-debug-types-section -fvar-tracking-assignments -g2 -MT lib/libcrc32_la-crc32c.lo -MD -MP -MF lib/.deps/libcrc32_la-crc32c.Tpo -c lib/crc32c.c -o lib/libcrc32_la-crc32c.o >/dev/null 2>&1
mv -f lib/.deps/libcrc32_la-crc32c.Tpo lib/.deps/libcrc32_la-crc32c.Plo
/bin/sh ./libtool  --tag=CC   --mode=link i686-pld-linux-gcc -O3 -fPIC  -fvisibility=hidden -O2 -fwrapv -pipe -Wformat -Werror=format-security -gdwarf-4 -fno-debug-types-section -fvar-tracking-assignments -g2 -Wp,-D_FORTIFY_SOURCE=2 -fstack-protector-strong --param=ssp-buffer-size=4 -Werror=trampolines -fomit-frame-pointer -march=i686 -fasynchronous-unwind-tables -mtune=pentium4 -gdwarf-4 -fno-debug-types-section -fvar-tracking-assignments -g2   -licuuc -licudata -lxml2  -lical -licalss -licalvcal -ljansson -lnghttp2 -lbrotlienc -lshp -lm -Wl,--as-needed -Wl,--no-copy-dt-needed-entries -Wl,-z,relro -Wl,-z,combreloc  -o libcrc32.la  lib/libcrc32_la-crc32.lo lib/libcrc32_la-crc32c.lo  -lgssapi -lkrb5 -lasn1 -lroken -lcrypt  -lcom_err -lresolv -lresolv  -lresolv   -L/usr/lib -lmysqlclient -lz -lm -latomic -lssl -lcrypto  -lpq -lpcre -lpcreposix -lz -lcap -lxml2 -lical -licalss -licalvcal -licui18n -licuuc -licudata  -lsqlite3
libtool: link: ar cr .libs/libcrc32.a lib/.libs/libcrc32_la-crc32.o lib/.libs/libcrc32_la-crc32c.o 
libtool: link: ranlib .libs/libcrc32.a
libtool: link: ( cd ".libs" && rm -f "libcrc32.la" && ln -s "../libcrc32.la" "libcrc32.la" )
/bin/sh ./libtool  --tag=CC   --mode=link i686-pld-linux-gcc -fPIC  -fvisibility=hidden -O2 -fwrapv -pipe -Wformat -Werror=format-security -gdwarf-4 -fno-debug-types-section -fvar-tracking-assignments -g2 -Wp,-D_FORTIFY_SOURCE=2 -fstack-protector-strong --param=ssp-buffer-size=4 -Werror=trampolines -fomit-frame-pointer -march=i686 -fasynchronous-unwind-tables -mtune=pentium4 -gdwarf-4 -fno-debug-types-section -fvar-tracking-assignments -g2   -licuuc -licudata -lxml2  -lical -licalss -licalvcal -ljansson -lnghttp2 -lbrotlienc -lshp -lm -Wl,--as-needed -Wl,--no-copy-dt-needed-entries -Wl,-z,relro -Wl,-z,combreloc  -o lib/libcyrus.la -rpath /usr/lib lib/lib_libcyrus_la-acl.lo lib/lib_libcyrus_la-acl_afs.lo lib/lib_libcyrus_la-auth.lo lib/lib_libcyrus_la-auth_krb.lo lib/lib_libcyrus_la-auth_krb5.lo lib/lib_libcyrus_la-auth_pts.lo lib/lib_libcyrus_la-auth_unix.lo lib/lib_libcyrus_la-bitvector.lo lib/lib_libcyrus_la-bloom.lo lib/lib_libcyrus_la-bsearch.lo lib/lib_libcyrus_la-charset.lo lib/lib_libcyrus_la-command.lo lib/lib_libcyrus_la-cyrusdb.lo lib/lib_libcyrus_la-cyrusdb_flat.lo lib/lib_libcyrus_la-cyrusdb_quotalegacy.lo lib/lib_libcyrus_la-cyrusdb_skiplist.lo lib/lib_libcyrus_la-cyrusdb_twoskip.lo lib/lib_libcyrus_la-glob.lo lib/lib_libcyrus_la-htmlchar.lo lib/lib_libcyrus_la-imapurl.lo lib/lib_libcyrus_la-imclient.lo lib/lib_libcyrus_la-imparse.lo lib/lib_libcyrus_la-iostat.lo lib/lib_libcyrus_la-iptostring.lo lib/lib_libcyrus_la-libcyr_cfg.lo lib/lib_libcyrus_la-lsort.lo lib/lib_libcyrus_la-mappedfile.lo lib/lib_libcyrus_la-murmurhash.lo lib/lib_libcyrus_la-mkgmtime.lo lib/lib_libcyrus_la-parseaddr.lo lib/lib_libcyrus_la-prot.lo lib/lib_libcyrus_la-ptrarray.lo lib/lib_libcyrus_la-rfc822tok.lo lib/lib_libcyrus_la-signals.lo lib/lib_libcyrus_la-stristr.lo lib/lib_libcyrus_la-times.lo lib/lib_libcyrus_la-tok.lo lib/lib_libcyrus_la-wildmat.lo lib/lib_libcyrus_la-cyrusdb_sql.lo lib/lib_libcyrus_la-cyrusdb_lmdb.lo lib/lib_libcyrus_la-sqldb.lo lib/lib_libcyrus_la-gmtoff_tm.lo  lib/lib_libcyrus_la-nonblock_fcntl.lo  lib/lib_libcyrus_la-chartable.lo lib/libcyrus_min.la libcrc32.la -lsasl2 -lssl -lcrypto -lssl -lcrypto   -llmdb -lgssapi -lkrb5 -lasn1 -lroken -lcrypt  -lcom_err -lresolv -lresolv  -lresolv   -L/usr/lib -lmysqlclient -lz -lm -latomic -lssl -lcrypto  -lpq -lpcre -lpcreposix -lz -lcap -lxml2 -lical -licalss -licalvcal -licui18n -licuuc -licudata  -lsqlite3
libtool: link: i686-pld-linux-gcc -shared  -fPIC -DPIC  -O2 -gdwarf-4 -g2 -fstack-protector-strong -march=i686 -mtune=pentium4 -gdwarf-4 -g2 -Wl,--as-needed -Wl,--no-copy-dt-needed-entries -Wl,-z -Wl,relro -Wl,-z -Wl,combreloc   -pthread  lib/.libs/lib_libcyrus_la-acl.o lib/.libs/lib_libcyrus_la-acl_afs.o lib/.libs/lib_libcyrus_la-auth.o lib/.libs/lib_libcyrus_la-auth_krb.o lib/.libs/lib_libcyrus_la-auth_krb5.o lib/.libs/lib_libcyrus_la-auth_pts.o lib/.libs/lib_libcyrus_la-auth_unix.o lib/.libs/lib_libcyrus_la-bitvector.o lib/.libs/lib_libcyrus_la-bloom.o lib/.libs/lib_libcyrus_la-bsearch.o lib/.libs/lib_libcyrus_la-charset.o lib/.libs/lib_libcyrus_la-command.o lib/.libs/lib_libcyrus_la-cyrusdb.o lib/.libs/lib_libcyrus_la-cyrusdb_flat.o lib/.libs/lib_libcyrus_la-cyrusdb_quotalegacy.o lib/.libs/lib_libcyrus_la-cyrusdb_skiplist.o lib/.libs/lib_libcyrus_la-cyrusdb_twoskip.o lib/.libs/lib_libcyrus_la-glob.o lib/.libs/lib_libcyrus_la-htmlchar.o lib/.libs/lib_libcyrus_la-imapurl.o lib/.libs/lib_libcyrus_la-imclient.o lib/.libs/lib_libcyrus_la-imparse.o lib/.libs/lib_libcyrus_la-iostat.o lib/.libs/lib_libcyrus_la-iptostring.o lib/.libs/lib_libcyrus_la-libcyr_cfg.o lib/.libs/lib_libcyrus_la-lsort.o lib/.libs/lib_libcyrus_la-mappedfile.o lib/.libs/lib_libcyrus_la-murmurhash.o lib/.libs/lib_libcyrus_la-mkgmtime.o lib/.libs/lib_libcyrus_la-parseaddr.o lib/.libs/lib_libcyrus_la-prot.o lib/.libs/lib_libcyrus_la-ptrarray.o lib/.libs/lib_libcyrus_la-rfc822tok.o lib/.libs/lib_libcyrus_la-signals.o lib/.libs/lib_libcyrus_la-stristr.o lib/.libs/lib_libcyrus_la-times.o lib/.libs/lib_libcyrus_la-tok.o lib/.libs/lib_libcyrus_la-wildmat.o lib/.libs/lib_libcyrus_la-cyrusdb_sql.o lib/.libs/lib_libcyrus_la-cyrusdb_lmdb.o lib/.libs/lib_libcyrus_la-sqldb.o lib/.libs/lib_libcyrus_la-gmtoff_tm.o lib/.libs/lib_libcyrus_la-nonblock_fcntl.o lib/.libs/lib_libcyrus_la-chartable.o  -Wl,--whole-archive ./.libs/libcrc32.a -Wl,--no-whole-archive  -Wl,-rpath -Wl,/tmp/B.vw7b_hov/BUILD/cyrus-imapd-3.0.16/lib/.libs lib/.libs/libcyrus_min.so -L/usr/lib /usr/lib/libuuid.so -ljansson -lnghttp2 -lbrotlienc /usr/lib/libshp.so /usr/lib/libsasl2.so -llmdb /usr/lib/libgssapi.so /usr/lib/libheimntlm.so /usr/lib/libkrb5.so /usr/lib/libhx509.so /usr/lib/libwind.so /usr/lib/libhcrypto.so /usr/lib/libheimbase.so /usr/lib/libasn1.so /usr/lib/libroken.so -lcrypt -lcom_err -lresolv -lmysqlclient /usr/lib/libatomic.so -lssl -lcrypto -lpq /usr/lib/libpcreposix.so /usr/lib/libpcre.so -lcap /usr/lib/libxml2.so /usr/lib/liblzma.so -lpthread -lical -licalss -licalvcal -licui18n -licuuc -licudata /usr/lib/libsqlite3.so -lm -lz -ldl -Wl,-soname -Wl,libcyrus.so.0 -o lib/.libs/libcyrus.so.0.0.0
libtool: link: (cd "lib/.libs" && rm -f "libcyrus.so.0" && ln -s "libcyrus.so.0.0.0" "libcyrus.so.0")
libtool: link: (cd "lib/.libs" && rm -f "libcyrus.so" && ln -s "libcyrus.so.0.0.0" "libcyrus.so")
libtool: link: (cd lib/.libs/libcyrus.lax/libcrc32.a && ar x "/tmp/B.vw7b_hov/BUILD/cyrus-imapd-3.0.16/./.libs/libcrc32.a")
libtool: link: ar cr lib/.libs/libcyrus.a  lib/lib_libcyrus_la-acl.o lib/lib_libcyrus_la-acl_afs.o lib/lib_libcyrus_la-auth.o lib/lib_libcyrus_la-auth_krb.o lib/lib_libcyrus_la-auth_krb5.o lib/lib_libcyrus_la-auth_pts.o lib/lib_libcyrus_la-auth_unix.o lib/lib_libcyrus_la-bitvector.o lib/lib_libcyrus_la-bloom.o lib/lib_libcyrus_la-bsearch.o lib/lib_libcyrus_la-charset.o lib/lib_libcyrus_la-command.o lib/lib_libcyrus_la-cyrusdb.o lib/lib_libcyrus_la-cyrusdb_flat.o lib/lib_libcyrus_la-cyrusdb_quotalegacy.o lib/lib_libcyrus_la-cyrusdb_skiplist.o lib/lib_libcyrus_la-cyrusdb_twoskip.o lib/lib_libcyrus_la-glob.o lib/lib_libcyrus_la-htmlchar.o lib/lib_libcyrus_la-imapurl.o lib/lib_libcyrus_la-imclient.o lib/lib_libcyrus_la-imparse.o lib/lib_libcyrus_la-iostat.o lib/lib_libcyrus_la-iptostring.o lib/lib_libcyrus_la-libcyr_cfg.o lib/lib_libcyrus_la-lsort.o lib/lib_libcyrus_la-mappedfile.o lib/lib_libcyrus_la-murmurhash.o lib/lib_libcyrus_la-mkgmtime.o lib/lib_libcyrus_la-parseaddr.o lib/lib_libcyrus_la-prot.o lib/lib_libcyrus_la-ptrarray.o lib/lib_libcyrus_la-rfc822tok.o lib/lib_libcyrus_la-signals.o lib/lib_libcyrus_la-stristr.o lib/lib_libcyrus_la-times.o lib/lib_libcyrus_la-tok.o lib/lib_libcyrus_la-wildmat.o lib/lib_libcyrus_la-cyrusdb_sql.o lib/lib_libcyrus_la-cyrusdb_lmdb.o lib/lib_libcyrus_la-sqldb.o lib/lib_libcyrus_la-gmtoff_tm.o lib/lib_libcyrus_la-nonblock_fcntl.o lib/lib_libcyrus_la-chartable.o  lib/.libs/libcyrus.lax/libcrc32.a/libcrc32_la-crc32.o lib/.libs/libcyrus.lax/libcrc32.a/libcrc32_la-crc32c.o 
libtool: link: ranlib lib/.libs/libcyrus.a
libtool: link: rm -fr lib/.libs/libcyrus.lax
libtool: link: ( cd "lib/.libs" && rm -f "libcyrus.la" && ln -s "../libcyrus.la" "libcyrus.la" )
/bin/sh ./libtool  --tag=CC   --mode=link i686-pld-linux-gcc -fPIC  -fvisibility=hidden -O2 -fwrapv -pipe -Wformat -Werror=format-security -gdwarf-4 -fno-debug-types-section -fvar-tracking-assignments -g2 -Wp,-D_FORTIFY_SOURCE=2 -fstack-protector-strong --param=ssp-buffer-size=4 -Werror=trampolines -fomit-frame-pointer -march=i686 -fasynchronous-unwind-tables -mtune=pentium4 -gdwarf-4 -fno-debug-types-section -fvar-tracking-assignments -g2   -licuuc -licudata -lxml2  -lical -licalss -licalvcal -ljansson -lnghttp2 -lbrotlienc -lshp -lm -Wl,--as-needed -Wl,--no-copy-dt-needed-entries -Wl,-z,relro -Wl,-z,combreloc  -o imtest/imtest imtest/imtest-imtest.o lib/libcyrus.la lib/libcyrus_min.la -lgssapi -lkrb5 -lasn1 -lroken -lcrypt  -lcom_err -lresolv -lresolv  -lresolv   -L/usr/lib -lmysqlclient -lz -lm -latomic -lssl -lcrypto  -lpq -lpcre -lpcreposix -lz -lcap -lxml2 -lical -licalss -licalvcal -licui18n -licuuc -licudata  -lsqlite3 -lsasl2 -lssl -lcrypto -lssl -lcrypto   -lgssapi -lkrb5 -lasn1 -lroken -lcrypt  -lcom_err -lresolv -lresolv  -lresolv   -L/usr/lib -lmysqlclient -lz -lm -latomic -lssl -lcrypto  -lpq -lpcre -lpcreposix -lz -lcap -lxml2 -lical -licalss -licalvcal -licui18n -licuuc -licudata  -lsqlite3
libtool: link: i686-pld-linux-gcc -fPIC -fvisibility=hidden -O2 -fwrapv -pipe -Wformat -Werror=format-security -gdwarf-4 -fno-debug-types-section -fvar-tracking-assignments -g2 -Wp,-D_FORTIFY_SOURCE=2 -fstack-protector-strong --param=ssp-buffer-size=4 -Werror=trampolines -fomit-frame-pointer -march=i686 -fasynchronous-unwind-tables -mtune=pentium4 -gdwarf-4 -fno-debug-types-section -fvar-tracking-assignments -g2 -Wl,--as-needed -Wl,--no-copy-dt-needed-entries -Wl,-z -Wl,relro -Wl,-z -Wl,combreloc -o imtest/.libs/imtest imtest/imtest-imtest.o  lib/.libs/libcyrus.so -L/usr/lib /tmp/B.vw7b_hov/BUILD/cyrus-imapd-3.0.16/lib/.libs/libcyrus_min.so -llmdb lib/.libs/libcyrus_min.so -ljansson -lnghttp2 -lbrotlienc /usr/lib/libshp.so /usr/lib/libuuid.so /usr/lib/libsasl2.so /usr/lib/libgssapi.so /usr/lib/libheimntlm.so /usr/lib/libkrb5.so /usr/lib/libhx509.so /usr/lib/libwind.so /usr/lib/libhcrypto.so /usr/lib/libheimbase.so /usr/lib/libasn1.so /usr/lib/libroken.so -lcrypt -lcom_err -lresolv -lmysqlclient /usr/lib/libatomic.so -lssl -lcrypto -lpq /usr/lib/libpcreposix.so /usr/lib/libpcre.so -lcap /usr/lib/libxml2.so /usr/lib/liblzma.so -lpthread -lical -licalss -licalvcal -licui18n -licuuc -licudata /usr/lib/libsqlite3.so -lm -lz -ldl -pthread
depbase=`echo master/cyrusMasterMIB.o | sed 's|[^/]*$|.deps/&|;s|\.o$||'`;\
i686-pld-linux-gcc -DHAVE_CONFIG_H -I.  -I/usr/include/et -I. -I./lib -I. -I./lib -DLIBEXEC_DIR=\"/usr/libexec/cyrus\" -DSBIN_DIR=\"/usr/sbin\" -DSYSCONF_DIR=\"/etc\" -DHAVE_CONFIG_H      -I/usr/include/libxml2       -I/usr/include/mysql   -DKRB5_HEIMDAL -I/usr/include -fPIC  -O2 -fwrapv -pipe -Wformat -Werror=format-security -gdwarf-4 -fno-debug-types-section -fvar-tracking-assignments -g2 -Wp,-D_FORTIFY_SOURCE=2 -fstack-protector-strong --param=ssp-buffer-size=4 -Werror=trampolines -fomit-frame-pointer -march=i686 -fasynchronous-unwind-tables -mtune=pentium4 -gdwarf-4 -fno-debug-types-section -fvar-tracking-assignments -g2  -MT master/cyrusMasterMIB.o -MD -MP -MF $depbase.Tpo -c -o master/cyrusMasterMIB.o master/cyrusMasterMIB.c &&\
mv -f $depbase.Tpo $depbase.Po
In file included from /usr/include/sys/resource.h:24,
                 from master/master.h:5,
                 from master/cyrusMasterMIB.c:53:
/usr/include/bits/resource.h: In function 'netsnmp_unused_function':
/usr/include/bits/resource.h:131:18: error: storage class specified for parameter 'rlim_t'
  131 | typedef __rlim_t rlim_t;
      |                  ^~~~~~
/usr/include/bits/resource.h:136:20: error: storage class specified for parameter 'rlim64_t'
  136 | typedef __rlim64_t rlim64_t;
      |                    ^~~~~~~~
/usr/include/bits/resource.h:142:5: error: expected specifier-qualifier-list before 'rlim_t'
  142 |     rlim_t rlim_cur;
      |     ^~~~~~
/usr/include/bits/resource.h:151:5: error: expected specifier-qualifier-list before 'rlim64_t'
  151 |     rlim64_t rlim_cur;
      |     ^~~~~~~~
/usr/include/bits/resource.h:203:12: error: storage class specified for parameter 'prlimit'
  203 | extern int prlimit (__pid_t __pid, enum __rlimit_resource __resource,
      |            ^~~~~~~
/usr/include/bits/resource.h:217:12: error: storage class specified for parameter 'prlimit64'
  217 | extern int prlimit64 (__pid_t __pid, enum __rlimit_resource __resource,
      |            ^~~~~~~~~
/usr/include/sys/resource.h:38:32: error: storage class specified for parameter '__rlimit_resource_t'
   38 | typedef enum __rlimit_resource __rlimit_resource_t;
      |                                ^~~~~~~~~~~~~~~~~~~
/usr/include/sys/resource.h:39:27: error: storage class specified for parameter '__rusage_who_t'
   39 | typedef enum __rusage_who __rusage_who_t;
      |                           ^~~~~~~~~~~~~~
/usr/include/sys/resource.h:40:31: error: storage class specified for parameter '__priority_which_t'
   40 | typedef enum __priority_which __priority_which_t;
      |                               ^~~~~~~~~~~~~~~~~~
/usr/include/sys/resource.h:50:23: error: expected declaration specifiers or '...' before '__rlimit_resource_t'
   50 | extern int getrlimit (__rlimit_resource_t __resource,
      |                       ^~~~~~~~~~~~~~~~~~~
/usr/include/sys/resource.h:62:25: error: expected declaration specifiers or '...' before '__rlimit_resource_t'
   62 | extern int getrlimit64 (__rlimit_resource_t __resource,
      |                         ^~~~~~~~~~~~~~~~~~~
/usr/include/sys/resource.h:70:23: error: expected declaration specifiers or '...' before '__rlimit_resource_t'
   70 | extern int setrlimit (__rlimit_resource_t __resource,
      |                       ^~~~~~~~~~~~~~~~~~~
/usr/include/sys/resource.h:82:25: error: expected declaration specifiers or '...' before '__rlimit_resource_t'
   82 | extern int setrlimit64 (__rlimit_resource_t __resource,
      |                         ^~~~~~~~~~~~~~~~~~~
/usr/include/sys/resource.h:89:23: error: expected declaration specifiers or '...' before '__rusage_who_t'
   89 | extern int getrusage (__rusage_who_t __who, struct rusage *__usage) __THROW;
      |                       ^~~~~~~~~~~~~~
/usr/include/sys/resource.h:105:25: error: expected declaration specifiers or '...' before '__priority_which_t'
  105 | extern int getpriority (__priority_which_t __which, id_t __who) __THROW;
      |                         ^~~~~~~~~~~~~~~~~~
/usr/include/sys/resource.h:109:25: error: expected declaration specifiers or '...' before '__priority_which_t'
  109 | extern int setpriority (__priority_which_t __which, id_t __who, int __prio)
      |                         ^~~~~~~~~~~~~~~~~~
In file included from ./lib/libconfig.h:46,
                 from master/master.h:7:
./lib/imapopts.h:5:1: warning: empty declaration
    5 | enum opttype {
      | ^~~~
./lib/imapopts.h:16:1: warning: empty declaration
   16 | enum imapopt {
      | ^~~~
./lib/imapopts.h:452:1: warning: empty declaration
  452 | enum enum_value {
      | ^~~~
./lib/imapopts.h:593:1: warning: empty declaration
  593 | union config_value {
      | ^~~~~
./lib/imapopts.h:611:1: warning: empty declaration
  611 | struct enum_option_s {
      | ^~~~~~
./lib/imapopts.h:623:1: warning: empty declaration
  623 | struct imapopt_s {
      | ^~~~~~
./lib/imapopts.h:647:25: error: storage class specified for parameter 'imapopts'
  647 | extern struct imapopt_s imapopts[];
      |                         ^~~~~~~~
./lib/libconfig.h:50:13: error: storage class specified for parameter 'config_reset'
   50 | extern void config_reset(void);
      |             ^~~~~~~~~~~~
./lib/libconfig.h:51:13: error: storage class specified for parameter 'config_read'
   51 | extern void config_read(const char *alt_config, const int config_need_data);
      |             ^~~~~~~~~~~
./lib/libconfig.h:52:20: error: storage class specified for parameter 'config_getstring'
   52 | extern const char *config_getstring(enum imapopt opt);
      |                    ^~~~~~~~~~~~~~~~
./lib/libconfig.h:53:12: error: storage class specified for parameter 'config_getint'
   53 | extern int config_getint(enum imapopt opt);
      |            ^~~~~~~~~~~~~
./lib/libconfig.h:54:12: error: storage class specified for parameter 'config_getswitch'
   54 | extern int config_getswitch(enum imapopt opt);
      |            ^~~~~~~~~~~~~~~~
./lib/libconfig.h:55:24: error: storage class specified for parameter 'config_getenum'
   55 | extern enum enum_value config_getenum(enum imapopt opt);
      |                        ^~~~~~~~~~~~~~
./lib/libconfig.h:56:22: error: storage class specified for parameter 'config_getbitfield'
   56 | extern unsigned long config_getbitfield(enum imapopt opt);
      |                      ^~~~~~~~~~~~~~~~~~
./lib/libconfig.h:60:20: error: storage class specified for parameter 'config_getoverflowstring'
   60 | extern const char *config_getoverflowstring(const char *key, const char *def);
      |                    ^~~~~~~~~~~~~~~~~~~~~~~~
./lib/libconfig.h:61:13: error: storage class specified for parameter 'config_foreachoverflowstring'
   61 | extern void config_foreachoverflowstring(
      |             ^~~~~~~~~~~~~~~~~~~~~~~~~~~~
./lib/libconfig.h:63:20: error: storage class specified for parameter 'config_partitiondir'
   63 | extern const char *config_partitiondir(const char *partition);
      |                    ^~~~~~~~~~~~~~~~~~~
./lib/libconfig.h:64:20: error: storage class specified for parameter 'config_metapartitiondir'
   64 | extern const char *config_metapartitiondir(const char *partition);
      |                    ^~~~~~~~~~~~~~~~~~~~~~~
./lib/libconfig.h:65:20: error: storage class specified for parameter 'config_archivepartitiondir'
   65 | extern const char *config_archivepartitiondir(const char *partition);
      |                    ^~~~~~~~~~~~~~~~~~~~~~~~~~
./lib/libconfig.h:67:20: error: storage class specified for parameter 'config_backupstagingpath'
   67 | extern const char *config_backupstagingpath(void);
      |                    ^~~~~~~~~~~~~~~~~~~~~~~~
./lib/libconfig.h:70:20: error: storage class specified for parameter 'config_filename'
   70 | extern const char *config_filename;
      |                    ^~~~~~~~~~~~~~~
./lib/libconfig.h:71:20: error: storage class specified for parameter 'config_dir'
   71 | extern const char *config_dir;
      |                    ^~~~~~~~~~
./lib/libconfig.h:72:20: error: storage class specified for parameter 'config_defpartition'
   72 | extern const char *config_defpartition;
      |                    ^~~~~~~~~~~~~~~~~~~
./lib/libconfig.h:73:20: error: storage class specified for parameter 'config_servername'
   73 | extern const char *config_servername;
      |                    ^~~~~~~~~~~~~~~~~
./lib/libconfig.h:74:24: error: storage class specified for parameter 'config_serverinfo'
   74 | extern enum enum_value config_serverinfo;
      |                        ^~~~~~~~~~~~~~~~~
./lib/libconfig.h:75:20: error: storage class specified for parameter 'config_mupdate_server'
   75 | extern const char *config_mupdate_server;
      |                    ^~~~~~~~~~~~~~~~~~~~~
./lib/libconfig.h:76:20: error: storage class specified for parameter 'config_defdomain'
   76 | extern const char *config_defdomain;
      |                    ^~~~~~~~~~~~~~~~
./lib/libconfig.h:77:20: error: storage class specified for parameter 'config_ident'
   77 | extern const char *config_ident;
      |                    ^~~~~~~~~~~~
./lib/libconfig.h:78:12: error: storage class specified for parameter 'config_hashimapspool'
   78 | extern int config_hashimapspool;
      |            ^~~~~~~~~~~~~~~~~~~~
./lib/libconfig.h:79:12: error: storage class specified for parameter 'config_implicitrights'
   79 | extern int config_implicitrights;
      |            ^~~~~~~~~~~~~~~~~~~~~
./lib/libconfig.h:80:24: error: storage class specified for parameter 'config_virtdomains'
   80 | extern enum enum_value config_virtdomains;
      |                        ^~~~~~~~~~~~~~~~~~
./lib/libconfig.h:81:24: error: storage class specified for parameter 'config_mupdate_config'
   81 | extern enum enum_value config_mupdate_config;
      |                        ^~~~~~~~~~~~~~~~~~~~~
./lib/libconfig.h:82:12: error: storage class specified for parameter 'config_auditlog'
   82 | extern int config_auditlog;
      |            ^~~~~~~~~~~~~~~
./lib/libconfig.h:83:12: error: storage class specified for parameter 'config_iolog'
   83 | extern int config_iolog;
      |            ^~~~~~~~~~~~
./lib/libconfig.h:84:17: error: storage class specified for parameter 'config_maxquoted'
   84 | extern unsigned config_maxquoted;
      |                 ^~~~~~~~~~~~~~~~
./lib/libconfig.h:85:17: error: storage class specified for parameter 'config_maxword'
   85 | extern unsigned config_maxword;
      |                 ^~~~~~~~~~~~~~
./lib/libconfig.h:86:12: error: storage class specified for parameter 'config_qosmarking'
   86 | extern int config_qosmarking;
      |            ^~~~~~~~~~~~~~~~~
./lib/libconfig.h:87:12: error: storage class specified for parameter 'config_debug'
   87 | extern int config_debug;
      |            ^~~~~~~~~~~~
In file included from master/master.h:8:
./lib/strarray.h:57:3: error: storage class specified for parameter 'strarray_t'
   57 | } strarray_t;
      |   ^~~~~~~~~~
./lib/strarray.h:61:20: error: expected declaration specifiers or '...' before 'strarray_t'
   61 | void strarray_fini(strarray_t *);
      |                    ^~~~~~~~~~
./lib/strarray.h:63:1: error: expected declaration specifiers before 'strarray_t'
   63 | strarray_t *strarray_new(void);
      | ^~~~~~~~~~
./lib/strarray.h:64:20: error: expected declaration specifiers or '...' before 'strarray_t'
   64 | void strarray_free(strarray_t *);
      |                    ^~~~~~~~~~
./lib/strarray.h:66:21: error: expected declaration specifiers or '...' before 'strarray_t'
   66 | int strarray_append(strarray_t *, const char *);
      |                     ^~~~~~~~~~
./lib/strarray.h:67:18: error: expected declaration specifiers or '...' before 'strarray_t'
   67 | int strarray_add(strarray_t *, const char *);
      |                  ^~~~~~~~~~
./lib/strarray.h:68:23: error: expected declaration specifiers or '...' before 'strarray_t'
   68 | int strarray_add_case(strarray_t *, const char *);
      |                       ^~~~~~~~~~
./lib/strarray.h:69:22: error: expected declaration specifiers or '...' before 'strarray_t'
   69 | int strarray_appendm(strarray_t *, char *);
      |                      ^~~~~~~~~~
./lib/strarray.h:70:19: error: expected declaration specifiers or '...' before 'strarray_t'
   70 | void strarray_set(strarray_t *, int idx, const char *);
      |                   ^~~~~~~~~~
./lib/strarray.h:71:20: error: expected declaration specifiers or '...' before 'strarray_t'
   71 | void strarray_setm(strarray_t *, int idx, char *);
      |                    ^~~~~~~~~~
./lib/strarray.h:72:22: error: expected declaration specifiers or '...' before 'strarray_t'
   72 | void strarray_insert(strarray_t *, int idx, const char *);
      |                      ^~~~~~~~~~
./lib/strarray.h:73:23: error: expected declaration specifiers or '...' before 'strarray_t'
   73 | void strarray_insertm(strarray_t *, int idx, char *);
      |                       ^~~~~~~~~~
./lib/strarray.h:74:23: error: expected declaration specifiers or '...' before 'strarray_t'
   74 | char *strarray_remove(strarray_t *, int idx);
      |                       ^~~~~~~~~~
./lib/strarray.h:75:26: error: expected declaration specifiers or '...' before 'strarray_t'
   75 | void strarray_remove_all(strarray_t *sa, const char *s);
      |                          ^~~~~~~~~~
./lib/strarray.h:76:31: error: expected declaration specifiers or '...' before 'strarray_t'
   76 | void strarray_remove_all_case(strarray_t *sa, const char *s);
      |                               ^~~~~~~~~~
./lib/strarray.h:77:32: warning: type defaults to 'int' in declaration of 'strarray_t' [-Wimplicit-int]
   77 | const char *strarray_nth(const strarray_t *sa, int idx);
      |                                ^~~~~~~~~~
./lib/strarray.h:77:43: error: expected ';', ',' or ')' before '*' token
   77 | const char *strarray_nth(const strarray_t *sa, int idx);
      |                                           ^
./lib/strarray.h:78:36: warning: type defaults to 'int' in declaration of 'strarray_t' [-Wimplicit-int]
   78 | const char *strarray_safenth(const strarray_t *sa, int idx);
      |                                    ^~~~~~~~~~
./lib/strarray.h:78:47: error: expected ';', ',' or ')' before '*' token
   78 | const char *strarray_safenth(const strarray_t *sa, int idx);
      |                                               ^
./lib/strarray.h:79:24: error: expected declaration specifiers or '...' before 'strarray_t'
   79 | void strarray_truncate(strarray_t *sa, int newlen);
      |                        ^~~~~~~~~~
./lib/strarray.h:80:1: error: expected declaration specifiers before 'strarray_t'
   80 | strarray_t *strarray_dup(const strarray_t *);
      | ^~~~~~~~~~
./lib/strarray.h:81:19: error: expected declaration specifiers or '...' before 'strarray_t'
   81 | void strarray_cat(strarray_t *dest, const strarray_t *src);
      |                   ^~~~~~~~~~
./lib/strarray.h:81:43: warning: type defaults to 'int' in declaration of 'strarray_t' [-Wimplicit-int]
   81 | void strarray_cat(strarray_t *dest, const strarray_t *src);
      |                                           ^~~~~~~~~~
./lib/strarray.h:81:54: error: expected ';', ',' or ')' before '*' token
   81 | void strarray_cat(strarray_t *dest, const strarray_t *src);
      |                                                      ^
./lib/strarray.h:91:27: warning: type defaults to 'int' in declaration of 'strarray_t' [-Wimplicit-int]
   91 | char *strarray_join(const strarray_t *, const char *sep);
      |                           ^~~~~~~~~~
./lib/strarray.h:91:38: error: expected ';', ',' or ')' before '*' token
   91 | char *strarray_join(const strarray_t *, const char *sep);
      |                                      ^
./lib/strarray.h:93:1: error: expected declaration specifiers before 'strarray_t'
   93 | strarray_t *strarray_splitm(char *buf, const char *sep, int flags);
      | ^~~~~~~~~~
./lib/strarray.h:94:1: error: expected declaration specifiers before 'strarray_t'
   94 | strarray_t *strarray_split(const char *buf, const char *sep, int flags);
      | ^~~~~~~~~~
./lib/strarray.h:95:1: error: expected declaration specifiers before 'strarray_t'
   95 | strarray_t *strarray_nsplit(const char *buf, size_t len, const char *sep, int flags);
      | ^~~~~~~~~~
./lib/strarray.h:98:13: error: storage class specified for parameter 'strarray_cmp_fn_t'
   98 | typedef int strarray_cmp_fn_t(const void *, const void *);
      |             ^~~~~~~~~~~~~~~~~
./lib/strarray.h:99:20: error: expected declaration specifiers or '...' before 'strarray_t'
   99 | void strarray_sort(strarray_t *, strarray_cmp_fn_t *);
      |                    ^~~~~~~~~~
./lib/strarray.h:99:34: error: expected declaration specifiers or '...' before 'strarray_cmp_fn_t'
   99 | void strarray_sort(strarray_t *, strarray_cmp_fn_t *);
      |                                  ^~~~~~~~~~~~~~~~~
./lib/strarray.h:101:20: error: expected declaration specifiers or '...' before 'strarray_t'
  101 | void strarray_uniq(strarray_t *);
      |                    ^~~~~~~~~~
./lib/strarray.h:103:24: error: expected declaration specifiers or '...' before 'strarray_t'
  103 | char **strarray_takevf(strarray_t *sa);
      |                        ^~~~~~~~~~
./lib/strarray.h:105:25: warning: type defaults to 'int' in declaration of 'strarray_t' [-Wimplicit-int]
  105 | int strarray_find(const strarray_t *sa, const char *match,
      |                         ^~~~~~~~~~
./lib/strarray.h:105:36: error: expected ';', ',' or ')' before '*' token
  105 | int strarray_find(const strarray_t *sa, const char *match,
      |                                    ^
./lib/strarray.h:107:30: warning: type defaults to 'int' in declaration of 'strarray_t' [-Wimplicit-int]
  107 | int strarray_find_case(const strarray_t *sa, const char *match,
      |                              ^~~~~~~~~~
./lib/strarray.h:107:41: error: expected ';', ',' or ')' before '*' token
  107 | int strarray_find_case(const strarray_t *sa, const char *match,
      |                                         ^
./lib/strarray.h:110:25: warning: type defaults to 'int' in declaration of 'strarray_t' [-Wimplicit-int]
  110 | int strarray_size(const strarray_t *sa);
      |                         ^~~~~~~~~~
./lib/strarray.h:110:36: error: expected ';', ',' or ')' before '*' token
  110 | int strarray_size(const strarray_t *sa);
      |                                    ^
./lib/strarray.h:112:24: warning: type defaults to 'int' in declaration of 'strarray_t' [-Wimplicit-int]
  112 | int strarray_cmp(const strarray_t *a, const strarray_t *b);
      |                        ^~~~~~~~~~
./lib/strarray.h:112:35: error: expected ';', ',' or ')' before '*' token
  112 | int strarray_cmp(const strarray_t *a, const strarray_t *b);
      |                                   ^
master/master.h:15:5: error: expected specifier-qualifier-list before 'strarray_t'
   15 |     strarray_t *exec;           /* command (with args) to execute */
      |     ^~~~~~~~~~
master/master.h:11:1: warning: empty declaration
   11 | struct service {
      | ^~~~~~
master/master.h:47:24: error: storage class specified for parameter 'Services'
   47 | extern struct service *Services;
      |                        ^~~~~~~~
master/master.h:48:12: error: storage class specified for parameter 'nservices'
   48 | extern int nservices;
      |            ^~~~~~~~~
master/cyrusMasterMIB.c:62:1: error: parameter 'cyrusMasterMIB_variables_oid' is initialized
   62 | oid cyrusMasterMIB_variables_oid[] = { 1,3,6,1,4,1,3,6,1 };
      | ^~~
master/cyrusMasterMIB.c:62:38: error: variable-sized object may not be initialized except with an empty initializer
   62 | oid cyrusMasterMIB_variables_oid[] = { 1,3,6,1,4,1,3,6,1 };
      |                                      ^
master/cyrusMasterMIB.c:62:40: warning: initialization of 'oid *' {aka 'long unsigned int *'} from 'int' makes pointer from integer without a cast [-Wint-conversion]
   62 | oid cyrusMasterMIB_variables_oid[] = { 1,3,6,1,4,1,3,6,1 };
      |                                        ^
master/cyrusMasterMIB.c:62:40: note: (near initialization for 'cyrusMasterMIB_variables_oid')
master/cyrusMasterMIB.c:62:42: warning: excess elements in scalar initializer
   62 | oid cyrusMasterMIB_variables_oid[] = { 1,3,6,1,4,1,3,6,1 };
      |                                          ^
master/cyrusMasterMIB.c:62:42: note: (near initialization for 'cyrusMasterMIB_variables_oid')
master/cyrusMasterMIB.c:62:44: warning: excess elements in scalar initializer
   62 | oid cyrusMasterMIB_variables_oid[] = { 1,3,6,1,4,1,3,6,1 };
      |                                            ^
master/cyrusMasterMIB.c:62:44: note: (near initialization for 'cyrusMasterMIB_variables_oid')
master/cyrusMasterMIB.c:62:46: warning: excess elements in scalar initializer
   62 | oid cyrusMasterMIB_variables_oid[] = { 1,3,6,1,4,1,3,6,1 };
      |                                              ^
master/cyrusMasterMIB.c:62:46: note: (near initialization for 'cyrusMasterMIB_variables_oid')
master/cyrusMasterMIB.c:62:48: warning: excess elements in scalar initializer
   62 | oid cyrusMasterMIB_variables_oid[] = { 1,3,6,1,4,1,3,6,1 };
      |                                                ^
master/cyrusMasterMIB.c:62:48: note: (near initialization for 'cyrusMasterMIB_variables_oid')
master/cyrusMasterMIB.c:62:50: warning: excess elements in scalar initializer
   62 | oid cyrusMasterMIB_variables_oid[] = { 1,3,6,1,4,1,3,6,1 };
      |                                                  ^
master/cyrusMasterMIB.c:62:50: note: (near initialization for 'cyrusMasterMIB_variables_oid')
master/cyrusMasterMIB.c:62:52: warning: excess elements in scalar initializer
   62 | oid cyrusMasterMIB_variables_oid[] = { 1,3,6,1,4,1,3,6,1 };
      |                                                    ^
master/cyrusMasterMIB.c:62:52: note: (near initialization for 'cyrusMasterMIB_variables_oid')
master/cyrusMasterMIB.c:62:54: warning: excess elements in scalar initializer
   62 | oid cyrusMasterMIB_variables_oid[] = { 1,3,6,1,4,1,3,6,1 };
      |                                                      ^
master/cyrusMasterMIB.c:62:54: note: (near initialization for 'cyrusMasterMIB_variables_oid')
master/cyrusMasterMIB.c:62:56: warning: excess elements in scalar initializer
   62 | oid cyrusMasterMIB_variables_oid[] = { 1,3,6,1,4,1,3,6,1 };
      |                                                        ^
master/cyrusMasterMIB.c:62:56: note: (near initialization for 'cyrusMasterMIB_variables_oid')
master/cyrusMasterMIB.c:72:8: error: parameter 'cyrusMasterMIB_variables' is initialized
   72 | struct variable4 cyrusMasterMIB_variables[] = {
      |        ^~~~~~~~~
master/cyrusMasterMIB.c:72:47: error: variable-sized object may not be initialized except with an empty initializer
   72 | struct variable4 cyrusMasterMIB_variables[] = {
      |                                               ^
master/cyrusMasterMIB.c:75:3: warning: braces around scalar initializer
   75 |   { CYRUSMASTERINFODESCR, ASN_OCTET_STR , RONLY , var_cyrusMasterMIB, 2, { 1,1 } },
      |   ^
master/cyrusMasterMIB.c:75:3: note: (near initialization for 'cyrusMasterMIB_variables')
master/cyrusMasterMIB.c:74:33: warning: initialization of 'struct variable4 *' from 'int' makes pointer from integer without a cast [-Wint-conversion]
   74 | #define   CYRUSMASTERINFODESCR  1
      |                                 ^
master/cyrusMasterMIB.c:75:5: note: in expansion of macro 'CYRUSMASTERINFODESCR'
   75 |   { CYRUSMASTERINFODESCR, ASN_OCTET_STR , RONLY , var_cyrusMasterMIB, 2, { 1,1 } },
      |     ^~~~~~~~~~~~~~~~~~~~
master/cyrusMasterMIB.c:74:33: note: (near initialization for 'cyrusMasterMIB_variables')
   74 | #define   CYRUSMASTERINFODESCR  1
      |                                 ^
master/cyrusMasterMIB.c:75:5: note: in expansion of macro 'CYRUSMASTERINFODESCR'
   75 |   { CYRUSMASTERINFODESCR, ASN_OCTET_STR , RONLY , var_cyrusMasterMIB, 2, { 1,1 } },
      |     ^~~~~~~~~~~~~~~~~~~~
master/cyrusMasterMIB.c:75:27: warning: excess elements in scalar initializer
   75 |   { CYRUSMASTERINFODESCR, ASN_OCTET_STR , RONLY , var_cyrusMasterMIB, 2, { 1,1 } },
      |                           ^~~~~~~~~~~~~
master/cyrusMasterMIB.c:75:27: note: (near initialization for 'cyrusMasterMIB_variables')
master/cyrusMasterMIB.c:75:43: warning: excess elements in scalar initializer
   75 |   { CYRUSMASTERINFODESCR, ASN_OCTET_STR , RONLY , var_cyrusMasterMIB, 2, { 1,1 } },
      |                                           ^~~~~
master/cyrusMasterMIB.c:75:43: note: (near initialization for 'cyrusMasterMIB_variables')
master/cyrusMasterMIB.c:75:51: warning: excess elements in scalar initializer
   75 |   { CYRUSMASTERINFODESCR, ASN_OCTET_STR , RONLY , var_cyrusMasterMIB, 2, { 1,1 } },
      |                                                   ^~~~~~~~~~~~~~~~~~
master/cyrusMasterMIB.c:75:51: note: (near initialization for 'cyrusMasterMIB_variables')
master/cyrusMasterMIB.c:75:71: warning: excess elements in scalar initializer
   75 |   { CYRUSMASTERINFODESCR, ASN_OCTET_STR , RONLY , var_cyrusMasterMIB, 2, { 1,1 } },
      |                                                                       ^
master/cyrusMasterMIB.c:75:71: note: (near initialization for 'cyrusMasterMIB_variables')
master/cyrusMasterMIB.c:75:3: warning: braces around scalar initializer
   75 |   { CYRUSMASTERINFODESCR, ASN_OCTET_STR , RONLY , var_cyrusMasterMIB, 2, { 1,1 } },
      |   ^
master/cyrusMasterMIB.c:75:3: note: (near initialization for 'cyrusMasterMIB_variables')
master/cyrusMasterMIB.c:75:76: warning: initialization of 'struct variable4 *' from 'int' makes pointer from integer without a cast [-Wint-conversion]
   75 |   { CYRUSMASTERINFODESCR, ASN_OCTET_STR , RONLY , var_cyrusMasterMIB, 2, { 1,1 } },
      |                                                                            ^
master/cyrusMasterMIB.c:75:76: note: (near initialization for 'cyrusMasterMIB_variables')
master/cyrusMasterMIB.c:75:78: warning: excess elements in scalar initializer
   75 |   { CYRUSMASTERINFODESCR, ASN_OCTET_STR , RONLY , var_cyrusMasterMIB, 2, { 1,1 } },
      |                                                                              ^
master/cyrusMasterMIB.c:75:78: note: (near initialization for 'cyrusMasterMIB_variables')
master/cyrusMasterMIB.c:75:74: warning: excess elements in scalar initializer
   75 |   { CYRUSMASTERINFODESCR, ASN_OCTET_STR , RONLY , var_cyrusMasterMIB, 2, { 1,1 } },
      |                                                                          ^
master/cyrusMasterMIB.c:75:74: note: (near initialization for 'cyrusMasterMIB_variables')
master/cyrusMasterMIB.c:77:3: warning: braces around scalar initializer
   77 |   { CYRUSMASTERINFOVERS , ASN_OCTET_STR , RONLY , var_cyrusMasterMIB, 2, { 1,2 } },
      |   ^
master/cyrusMasterMIB.c:77:3: note: (near initialization for 'cyrusMasterMIB_variables')
master/cyrusMasterMIB.c:76:33: warning: initialization of 'struct variable4 *' from 'int' makes pointer from integer without a cast [-Wint-conversion]
   76 | #define   CYRUSMASTERINFOVERS   2
      |                                 ^
master/cyrusMasterMIB.c:77:5: note: in expansion of macro 'CYRUSMASTERINFOVERS'
   77 |   { CYRUSMASTERINFOVERS , ASN_OCTET_STR , RONLY , var_cyrusMasterMIB, 2, { 1,2 } },
      |     ^~~~~~~~~~~~~~~~~~~
master/cyrusMasterMIB.c:76:33: note: (near initialization for 'cyrusMasterMIB_variables')
   76 | #define   CYRUSMASTERINFOVERS   2
      |                                 ^
master/cyrusMasterMIB.c:77:5: note: in expansion of macro 'CYRUSMASTERINFOVERS'
   77 |   { CYRUSMASTERINFOVERS , ASN_OCTET_STR , RONLY , var_cyrusMasterMIB, 2, { 1,2 } },
      |     ^~~~~~~~~~~~~~~~~~~
master/cyrusMasterMIB.c:77:27: warning: excess elements in scalar initializer
   77 |   { CYRUSMASTERINFOVERS , ASN_OCTET_STR , RONLY , var_cyrusMasterMIB, 2, { 1,2 } },
      |                           ^~~~~~~~~~~~~
master/cyrusMasterMIB.c:77:27: note: (near initialization for 'cyrusMasterMIB_variables')
master/cyrusMasterMIB.c:77:43: warning: excess elements in scalar initializer
   77 |   { CYRUSMASTERINFOVERS , ASN_OCTET_STR , RONLY , var_cyrusMasterMIB, 2, { 1,2 } },
      |                                           ^~~~~
master/cyrusMasterMIB.c:77:43: note: (near initialization for 'cyrusMasterMIB_variables')
master/cyrusMasterMIB.c:77:51: warning: excess elements in scalar initializer
   77 |   { CYRUSMASTERINFOVERS , ASN_OCTET_STR , RONLY , var_cyrusMasterMIB, 2, { 1,2 } },
      |                                                   ^~~~~~~~~~~~~~~~~~
master/cyrusMasterMIB.c:77:51: note: (near initialization for 'cyrusMasterMIB_variables')
master/cyrusMasterMIB.c:77:71: warning: excess elements in scalar initializer
   77 |   { CYRUSMASTERINFOVERS , ASN_OCTET_STR , RONLY , var_cyrusMasterMIB, 2, { 1,2 } },
      |                                                                       ^
master/cyrusMasterMIB.c:77:71: note: (near initialization for 'cyrusMasterMIB_variables')
master/cyrusMasterMIB.c:77:3: warning: braces around scalar initializer
   77 |   { CYRUSMASTERINFOVERS , ASN_OCTET_STR , RONLY , var_cyrusMasterMIB, 2, { 1,2 } },
      |   ^
master/cyrusMasterMIB.c:77:3: note: (near initialization for 'cyrusMasterMIB_variables')
master/cyrusMasterMIB.c:77:76: warning: initialization of 'struct variable4 *' from 'int' makes pointer from integer without a cast [-Wint-conversion]
   77 |   { CYRUSMASTERINFOVERS , ASN_OCTET_STR , RONLY , var_cyrusMasterMIB, 2, { 1,2 } },
      |                                                                            ^
master/cyrusMasterMIB.c:77:76: note: (near initialization for 'cyrusMasterMIB_variables')
master/cyrusMasterMIB.c:77:78: warning: excess elements in scalar initializer
   77 |   { CYRUSMASTERINFOVERS , ASN_OCTET_STR , RONLY , var_cyrusMasterMIB, 2, { 1,2 } },
      |                                                                              ^
master/cyrusMasterMIB.c:77:78: note: (near initialization for 'cyrusMasterMIB_variables')
master/cyrusMasterMIB.c:77:74: warning: excess elements in scalar initializer
   77 |   { CYRUSMASTERINFOVERS , ASN_OCTET_STR , RONLY , var_cyrusMasterMIB, 2, { 1,2 } },
      |                                                                          ^
master/cyrusMasterMIB.c:77:74: note: (near initialization for 'cyrusMasterMIB_variables')
master/cyrusMasterMIB.c:77:3: warning: excess elements in scalar initializer
   77 |   { CYRUSMASTERINFOVERS , ASN_OCTET_STR , RONLY , var_cyrusMasterMIB, 2, { 1,2 } },
      |   ^
master/cyrusMasterMIB.c:77:3: note: (near initialization for 'cyrusMasterMIB_variables')
master/cyrusMasterMIB.c:79:3: warning: braces around scalar initializer
   79 |   { CYRUSMASTERINFOUPTIME , ASN_TIMETICKS , RONLY , var_cyrusMasterMIB, 2, { 1,3 } },
      |   ^
master/cyrusMasterMIB.c:79:3: note: (near initialization for 'cyrusMasterMIB_variables')
master/cyrusMasterMIB.c:78:33: warning: initialization of 'struct variable4 *' from 'int' makes pointer from integer without a cast [-Wint-conversion]
   78 | #define   CYRUSMASTERINFOUPTIME 3
      |                                 ^
master/cyrusMasterMIB.c:79:5: note: in expansion of macro 'CYRUSMASTERINFOUPTIME'
   79 |   { CYRUSMASTERINFOUPTIME , ASN_TIMETICKS , RONLY , var_cyrusMasterMIB, 2, { 1,3 } },
      |     ^~~~~~~~~~~~~~~~~~~~~
master/cyrusMasterMIB.c:78:33: note: (near initialization for 'cyrusMasterMIB_variables')
   78 | #define   CYRUSMASTERINFOUPTIME 3
      |                                 ^
master/cyrusMasterMIB.c:79:5: note: in expansion of macro 'CYRUSMASTERINFOUPTIME'
   79 |   { CYRUSMASTERINFOUPTIME , ASN_TIMETICKS , RONLY , var_cyrusMasterMIB, 2, { 1,3 } },
      |     ^~~~~~~~~~~~~~~~~~~~~
master/cyrusMasterMIB.c:79:29: warning: excess elements in scalar initializer
   79 |   { CYRUSMASTERINFOUPTIME , ASN_TIMETICKS , RONLY , var_cyrusMasterMIB, 2, { 1,3 } },
      |                             ^~~~~~~~~~~~~
master/cyrusMasterMIB.c:79:29: note: (near initialization for 'cyrusMasterMIB_variables')
master/cyrusMasterMIB.c:79:45: warning: excess elements in scalar initializer
   79 |   { CYRUSMASTERINFOUPTIME , ASN_TIMETICKS , RONLY , var_cyrusMasterMIB, 2, { 1,3 } },
      |                                             ^~~~~
master/cyrusMasterMIB.c:79:45: note: (near initialization for 'cyrusMasterMIB_variables')
master/cyrusMasterMIB.c:79:53: warning: excess elements in scalar initializer
   79 |   { CYRUSMASTERINFOUPTIME , ASN_TIMETICKS , RONLY , var_cyrusMasterMIB, 2, { 1,3 } },
      |                                                     ^~~~~~~~~~~~~~~~~~
master/cyrusMasterMIB.c:79:53: note: (near initialization for 'cyrusMasterMIB_variables')
master/cyrusMasterMIB.c:79:73: warning: excess elements in scalar initializer
   79 |   { CYRUSMASTERINFOUPTIME , ASN_TIMETICKS , RONLY , var_cyrusMasterMIB, 2, { 1,3 } },
      |                                                                         ^
master/cyrusMasterMIB.c:79:73: note: (near initialization for 'cyrusMasterMIB_variables')
master/cyrusMasterMIB.c:79:3: warning: braces around scalar initializer
   79 |   { CYRUSMASTERINFOUPTIME , ASN_TIMETICKS , RONLY , var_cyrusMasterMIB, 2, { 1,3 } },
      |   ^
master/cyrusMasterMIB.c:79:3: note: (near initialization for 'cyrusMasterMIB_variables')
master/cyrusMasterMIB.c:79:78: warning: initialization of 'struct variable4 *' from 'int' makes pointer from integer without a cast [-Wint-conversion]
   79 |   { CYRUSMASTERINFOUPTIME , ASN_TIMETICKS , RONLY , var_cyrusMasterMIB, 2, { 1,3 } },
      |                                                                              ^
master/cyrusMasterMIB.c:79:78: note: (near initialization for 'cyrusMasterMIB_variables')
master/cyrusMasterMIB.c:79:80: warning: excess elements in scalar initializer
   79 |   { CYRUSMASTERINFOUPTIME , ASN_TIMETICKS , RONLY , var_cyrusMasterMIB, 2, { 1,3 } },
      |                                                                                ^
master/cyrusMasterMIB.c:79:80: note: (near initialization for 'cyrusMasterMIB_variables')
master/cyrusMasterMIB.c:79:76: warning: excess elements in scalar initializer
   79 |   { CYRUSMASTERINFOUPTIME , ASN_TIMETICKS , RONLY , var_cyrusMasterMIB, 2, { 1,3 } },
      |                                                                            ^
master/cyrusMasterMIB.c:79:76: note: (near initialization for 'cyrusMasterMIB_variables')
master/cyrusMasterMIB.c:79:3: warning: excess elements in scalar initializer
   79 |   { CYRUSMASTERINFOUPTIME , ASN_TIMETICKS , RONLY , var_cyrusMasterMIB, 2, { 1,3 } },
      |   ^
master/cyrusMasterMIB.c:79:3: note: (near initialization for 'cyrusMasterMIB_variables')
master/cyrusMasterMIB.c:81:3: warning: braces around scalar initializer
   81 |   { SERVICEFORKS        , ASN_COUNTER   , RONLY , var_serviceTable, 3, { 2,1,1 } },
      |   ^
master/cyrusMasterMIB.c:81:3: note: (near initialization for 'cyrusMasterMIB_variables')
master/cyrusMasterMIB.c:80:33: warning: initialization of 'struct variable4 *' from 'int' makes pointer from integer without a cast [-Wint-conversion]
   80 | #define   SERVICEFORKS          5
      |                                 ^
master/cyrusMasterMIB.c:81:5: note: in expansion of macro 'SERVICEFORKS'
   81 |   { SERVICEFORKS        , ASN_COUNTER   , RONLY , var_serviceTable, 3, { 2,1,1 } },
      |     ^~~~~~~~~~~~
master/cyrusMasterMIB.c:80:33: note: (near initialization for 'cyrusMasterMIB_variables')
   80 | #define   SERVICEFORKS          5
      |                                 ^
master/cyrusMasterMIB.c:81:5: note: in expansion of macro 'SERVICEFORKS'
   81 |   { SERVICEFORKS        , ASN_COUNTER   , RONLY , var_serviceTable, 3, { 2,1,1 } },
      |     ^~~~~~~~~~~~
master/cyrusMasterMIB.c:81:27: warning: excess elements in scalar initializer
   81 |   { SERVICEFORKS        , ASN_COUNTER   , RONLY , var_serviceTable, 3, { 2,1,1 } },
      |                           ^~~~~~~~~~~
master/cyrusMasterMIB.c:81:27: note: (near initialization for 'cyrusMasterMIB_variables')
master/cyrusMasterMIB.c:81:43: warning: excess elements in scalar initializer
   81 |   { SERVICEFORKS        , ASN_COUNTER   , RONLY , var_serviceTable, 3, { 2,1,1 } },
      |                                           ^~~~~
master/cyrusMasterMIB.c:81:43: note: (near initialization for 'cyrusMasterMIB_variables')
master/cyrusMasterMIB.c:81:51: warning: excess elements in scalar initializer
   81 |   { SERVICEFORKS        , ASN_COUNTER   , RONLY , var_serviceTable, 3, { 2,1,1 } },
      |                                                   ^~~~~~~~~~~~~~~~
master/cyrusMasterMIB.c:81:51: note: (near initialization for 'cyrusMasterMIB_variables')
master/cyrusMasterMIB.c:81:69: warning: excess elements in scalar initializer
   81 |   { SERVICEFORKS        , ASN_COUNTER   , RONLY , var_serviceTable, 3, { 2,1,1 } },
      |                                                                     ^
master/cyrusMasterMIB.c:81:69: note: (near initialization for 'cyrusMasterMIB_variables')
master/cyrusMasterMIB.c:81:3: warning: braces around scalar initializer
   81 |   { SERVICEFORKS        , ASN_COUNTER   , RONLY , var_serviceTable, 3, { 2,1,1 } },
      |   ^
master/cyrusMasterMIB.c:81:3: note: (near initialization for 'cyrusMasterMIB_variables')
master/cyrusMasterMIB.c:81:74: warning: initialization of 'struct variable4 *' from 'int' makes pointer from integer without a cast [-Wint-conversion]
   81 |   { SERVICEFORKS        , ASN_COUNTER   , RONLY , var_serviceTable, 3, { 2,1,1 } },
      |                                                                          ^
master/cyrusMasterMIB.c:81:74: note: (near initialization for 'cyrusMasterMIB_variables')
master/cyrusMasterMIB.c:81:76: warning: excess elements in scalar initializer
   81 |   { SERVICEFORKS        , ASN_COUNTER   , RONLY , var_serviceTable, 3, { 2,1,1 } },
      |                                                                            ^
master/cyrusMasterMIB.c:81:76: note: (near initialization for 'cyrusMasterMIB_variables')
master/cyrusMasterMIB.c:81:78: warning: excess elements in scalar initializer
   81 |   { SERVICEFORKS        , ASN_COUNTER   , RONLY , var_serviceTable, 3, { 2,1,1 } },
      |                                                                              ^
master/cyrusMasterMIB.c:81:78: note: (near initialization for 'cyrusMasterMIB_variables')
master/cyrusMasterMIB.c:81:72: warning: excess elements in scalar initializer
   81 |   { SERVICEFORKS        , ASN_COUNTER   , RONLY , var_serviceTable, 3, { 2,1,1 } },
      |                                                                        ^
master/cyrusMasterMIB.c:81:72: note: (near initialization for 'cyrusMasterMIB_variables')
master/cyrusMasterMIB.c:81:3: warning: excess elements in scalar initializer
   81 |   { SERVICEFORKS        , ASN_COUNTER   , RONLY , var_serviceTable, 3, { 2,1,1 } },
      |   ^
master/cyrusMasterMIB.c:81:3: note: (near initialization for 'cyrusMasterMIB_variables')
master/cyrusMasterMIB.c:83:3: warning: braces around scalar initializer
   83 |   { SERVICEACTIVE       , ASN_GAUGE     , RONLY , var_serviceTable, 3, { 2,1,2 } },
      |   ^
master/cyrusMasterMIB.c:83:3: note: (near initialization for 'cyrusMasterMIB_variables')
master/cyrusMasterMIB.c:82:33: warning: initialization of 'struct variable4 *' from 'int' makes pointer from integer without a cast [-Wint-conversion]
   82 | #define   SERVICEACTIVE         6
      |                                 ^
master/cyrusMasterMIB.c:83:5: note: in expansion of macro 'SERVICEACTIVE'
   83 |   { SERVICEACTIVE       , ASN_GAUGE     , RONLY , var_serviceTable, 3, { 2,1,2 } },
      |     ^~~~~~~~~~~~~
master/cyrusMasterMIB.c:82:33: note: (near initialization for 'cyrusMasterMIB_variables')
   82 | #define   SERVICEACTIVE         6
      |                                 ^
master/cyrusMasterMIB.c:83:5: note: in expansion of macro 'SERVICEACTIVE'
   83 |   { SERVICEACTIVE       , ASN_GAUGE     , RONLY , var_serviceTable, 3, { 2,1,2 } },
      |     ^~~~~~~~~~~~~
master/cyrusMasterMIB.c:83:27: warning: excess elements in scalar initializer
   83 |   { SERVICEACTIVE       , ASN_GAUGE     , RONLY , var_serviceTable, 3, { 2,1,2 } },
      |                           ^~~~~~~~~
master/cyrusMasterMIB.c:83:27: note: (near initialization for 'cyrusMasterMIB_variables')
master/cyrusMasterMIB.c:83:43: warning: excess elements in scalar initializer
   83 |   { SERVICEACTIVE       , ASN_GAUGE     , RONLY , var_serviceTable, 3, { 2,1,2 } },
      |                                           ^~~~~
master/cyrusMasterMIB.c:83:43: note: (near initialization for 'cyrusMasterMIB_variables')
master/cyrusMasterMIB.c:83:51: warning: excess elements in scalar initializer
   83 |   { SERVICEACTIVE       , ASN_GAUGE     , RONLY , var_serviceTable, 3, { 2,1,2 } },
      |                                                   ^~~~~~~~~~~~~~~~
master/cyrusMasterMIB.c:83:51: note: (near initialization for 'cyrusMasterMIB_variables')
master/cyrusMasterMIB.c:83:69: warning: excess elements in scalar initializer
   83 |   { SERVICEACTIVE       , ASN_GAUGE     , RONLY , var_serviceTable, 3, { 2,1,2 } },
      |                                                                     ^
master/cyrusMasterMIB.c:83:69: note: (near initialization for 'cyrusMasterMIB_variables')
master/cyrusMasterMIB.c:83:3: warning: braces around scalar initializer
   83 |   { SERVICEACTIVE       , ASN_GAUGE     , RONLY , var_serviceTable, 3, { 2,1,2 } },
      |   ^
master/cyrusMasterMIB.c:83:3: note: (near initialization for 'cyrusMasterMIB_variables')
master/cyrusMasterMIB.c:83:74: warning: initialization of 'struct variable4 *' from 'int' makes pointer from integer without a cast [-Wint-conversion]
   83 |   { SERVICEACTIVE       , ASN_GAUGE     , RONLY , var_serviceTable, 3, { 2,1,2 } },
      |                                                                          ^
master/cyrusMasterMIB.c:83:74: note: (near initialization for 'cyrusMasterMIB_variables')
master/cyrusMasterMIB.c:83:76: warning: excess elements in scalar initializer
   83 |   { SERVICEACTIVE       , ASN_GAUGE     , RONLY , var_serviceTable, 3, { 2,1,2 } },
      |                                                                            ^
master/cyrusMasterMIB.c:83:76: note: (near initialization for 'cyrusMasterMIB_variables')
master/cyrusMasterMIB.c:83:78: warning: excess elements in scalar initializer
   83 |   { SERVICEACTIVE       , ASN_GAUGE     , RONLY , var_serviceTable, 3, { 2,1,2 } },
      |                                                                              ^
master/cyrusMasterMIB.c:83:78: note: (near initialization for 'cyrusMasterMIB_variables')
master/cyrusMasterMIB.c:83:72: warning: excess elements in scalar initializer
   83 |   { SERVICEACTIVE       , ASN_GAUGE     , RONLY , var_serviceTable, 3, { 2,1,2 } },
      |                                                                        ^
master/cyrusMasterMIB.c:83:72: note: (near initialization for 'cyrusMasterMIB_variables')
master/cyrusMasterMIB.c:83:3: warning: excess elements in scalar initializer
   83 |   { SERVICEACTIVE       , ASN_GAUGE     , RONLY , var_serviceTable, 3, { 2,1,2 } },
      |   ^
master/cyrusMasterMIB.c:83:3: note: (near initialization for 'cyrusMasterMIB_variables')
master/cyrusMasterMIB.c:85:3: warning: braces around scalar initializer
   85 |   { SERVICENAME         , ASN_OCTET_STR , RONLY , var_serviceTable, 3, { 2,1,3 } },
      |   ^
master/cyrusMasterMIB.c:85:3: note: (near initialization for 'cyrusMasterMIB_variables')
master/cyrusMasterMIB.c:84:33: warning: initialization of 'struct variable4 *' from 'int' makes pointer from integer without a cast [-Wint-conversion]
   84 | #define   SERVICENAME           7
      |                                 ^
master/cyrusMasterMIB.c:85:5: note: in expansion of macro 'SERVICENAME'
   85 |   { SERVICENAME         , ASN_OCTET_STR , RONLY , var_serviceTable, 3, { 2,1,3 } },
      |     ^~~~~~~~~~~
master/cyrusMasterMIB.c:84:33: note: (near initialization for 'cyrusMasterMIB_variables')
   84 | #define   SERVICENAME           7
      |                                 ^
master/cyrusMasterMIB.c:85:5: note: in expansion of macro 'SERVICENAME'
   85 |   { SERVICENAME         , ASN_OCTET_STR , RONLY , var_serviceTable, 3, { 2,1,3 } },
      |     ^~~~~~~~~~~
master/cyrusMasterMIB.c:85:27: warning: excess elements in scalar initializer
   85 |   { SERVICENAME         , ASN_OCTET_STR , RONLY , var_serviceTable, 3, { 2,1,3 } },
      |                           ^~~~~~~~~~~~~
master/cyrusMasterMIB.c:85:27: note: (near initialization for 'cyrusMasterMIB_variables')
master/cyrusMasterMIB.c:85:43: warning: excess elements in scalar initializer
   85 |   { SERVICENAME         , ASN_OCTET_STR , RONLY , var_serviceTable, 3, { 2,1,3 } },
      |                                           ^~~~~
master/cyrusMasterMIB.c:85:43: note: (near initialization for 'cyrusMasterMIB_variables')
master/cyrusMasterMIB.c:85:51: warning: excess elements in scalar initializer
   85 |   { SERVICENAME         , ASN_OCTET_STR , RONLY , var_serviceTable, 3, { 2,1,3 } },
      |                                                   ^~~~~~~~~~~~~~~~
master/cyrusMasterMIB.c:85:51: note: (near initialization for 'cyrusMasterMIB_variables')
master/cyrusMasterMIB.c:85:69: warning: excess elements in scalar initializer
   85 |   { SERVICENAME         , ASN_OCTET_STR , RONLY , var_serviceTable, 3, { 2,1,3 } },
      |                                                                     ^
master/cyrusMasterMIB.c:85:69: note: (near initialization for 'cyrusMasterMIB_variables')
master/cyrusMasterMIB.c:85:3: warning: braces around scalar initializer
   85 |   { SERVICENAME         , ASN_OCTET_STR , RONLY , var_serviceTable, 3, { 2,1,3 } },
      |   ^
master/cyrusMasterMIB.c:85:3: note: (near initialization for 'cyrusMasterMIB_variables')
master/cyrusMasterMIB.c:85:74: warning: initialization of 'struct variable4 *' from 'int' makes pointer from integer without a cast [-Wint-conversion]
   85 |   { SERVICENAME         , ASN_OCTET_STR , RONLY , var_serviceTable, 3, { 2,1,3 } },
      |                                                                          ^
master/cyrusMasterMIB.c:85:74: note: (near initialization for 'cyrusMasterMIB_variables')
master/cyrusMasterMIB.c:85:76: warning: excess elements in scalar initializer
   85 |   { SERVICENAME         , ASN_OCTET_STR , RONLY , var_serviceTable, 3, { 2,1,3 } },
      |                                                                            ^
master/cyrusMasterMIB.c:85:76: note: (near initialization for 'cyrusMasterMIB_variables')
master/cyrusMasterMIB.c:85:78: warning: excess elements in scalar initializer
   85 |   { SERVICENAME         , ASN_OCTET_STR , RONLY , var_serviceTable, 3, { 2,1,3 } },
      |                                                                              ^
master/cyrusMasterMIB.c:85:78: note: (near initialization for 'cyrusMasterMIB_variables')
master/cyrusMasterMIB.c:85:72: warning: excess elements in scalar initializer
   85 |   { SERVICENAME         , ASN_OCTET_STR , RONLY , var_serviceTable, 3, { 2,1,3 } },
      |                                                                        ^
master/cyrusMasterMIB.c:85:72: note: (near initialization for 'cyrusMasterMIB_variables')
master/cyrusMasterMIB.c:85:3: warning: excess elements in scalar initializer
   85 |   { SERVICENAME         , ASN_OCTET_STR , RONLY , var_serviceTable, 3, { 2,1,3 } },
      |   ^
master/cyrusMasterMIB.c:85:3: note: (near initialization for 'cyrusMasterMIB_variables')
master/cyrusMasterMIB.c:87:3: warning: braces around scalar initializer
   87 |   { SERVICEID           , ASN_INTEGER   , NOACCESS , var_serviceTable, 3, { 2,1,4 } },
      |   ^
master/cyrusMasterMIB.c:87:3: note: (near initialization for 'cyrusMasterMIB_variables')
master/cyrusMasterMIB.c:86:33: warning: initialization of 'struct variable4 *' from 'int' makes pointer from integer without a cast [-Wint-conversion]
   86 | #define   SERVICEID             8
      |                                 ^
master/cyrusMasterMIB.c:87:5: note: in expansion of macro 'SERVICEID'
   87 |   { SERVICEID           , ASN_INTEGER   , NOACCESS , var_serviceTable, 3, { 2,1,4 } },
      |     ^~~~~~~~~
master/cyrusMasterMIB.c:86:33: note: (near initialization for 'cyrusMasterMIB_variables')
   86 | #define   SERVICEID             8
      |                                 ^
master/cyrusMasterMIB.c:87:5: note: in expansion of macro 'SERVICEID'
   87 |   { SERVICEID           , ASN_INTEGER   , NOACCESS , var_serviceTable, 3, { 2,1,4 } },
      |     ^~~~~~~~~
master/cyrusMasterMIB.c:87:27: warning: excess elements in scalar initializer
   87 |   { SERVICEID           , ASN_INTEGER   , NOACCESS , var_serviceTable, 3, { 2,1,4 } },
      |                           ^~~~~~~~~~~
master/cyrusMasterMIB.c:87:27: note: (near initialization for 'cyrusMasterMIB_variables')
master/cyrusMasterMIB.c:87:43: warning: excess elements in scalar initializer
   87 |   { SERVICEID           , ASN_INTEGER   , NOACCESS , var_serviceTable, 3, { 2,1,4 } },
      |                                           ^~~~~~~~
master/cyrusMasterMIB.c:87:43: note: (near initialization for 'cyrusMasterMIB_variables')
master/cyrusMasterMIB.c:87:54: warning: excess elements in scalar initializer
   87 |   { SERVICEID           , ASN_INTEGER   , NOACCESS , var_serviceTable, 3, { 2,1,4 } },
      |                                                      ^~~~~~~~~~~~~~~~
master/cyrusMasterMIB.c:87:54: note: (near initialization for 'cyrusMasterMIB_variables')
master/cyrusMasterMIB.c:87:72: warning: excess elements in scalar initializer
   87 |   { SERVICEID           , ASN_INTEGER   , NOACCESS , var_serviceTable, 3, { 2,1,4 } },
      |                                                                        ^
master/cyrusMasterMIB.c:87:72: note: (near initialization for 'cyrusMasterMIB_variables')
master/cyrusMasterMIB.c:87:3: warning: braces around scalar initializer
   87 |   { SERVICEID           , ASN_INTEGER   , NOACCESS , var_serviceTable, 3, { 2,1,4 } },
      |   ^
master/cyrusMasterMIB.c:87:3: note: (near initialization for 'cyrusMasterMIB_variables')
master/cyrusMasterMIB.c:87:77: warning: initialization of 'struct variable4 *' from 'int' makes pointer from integer without a cast [-Wint-conversion]
   87 |   { SERVICEID           , ASN_INTEGER   , NOACCESS , var_serviceTable, 3, { 2,1,4 } },
      |                                                                             ^
master/cyrusMasterMIB.c:87:77: note: (near initialization for 'cyrusMasterMIB_variables')
master/cyrusMasterMIB.c:87:79: warning: excess elements in scalar initializer
   87 |   { SERVICEID           , ASN_INTEGER   , NOACCESS , var_serviceTable, 3, { 2,1,4 } },
      |                                                                               ^
master/cyrusMasterMIB.c:87:79: note: (near initialization for 'cyrusMasterMIB_variables')
master/cyrusMasterMIB.c:87:81: warning: excess elements in scalar initializer
   87 |   { SERVICEID           , ASN_INTEGER   , NOACCESS , var_serviceTable, 3, { 2,1,4 } },
      |                                                                                 ^
master/cyrusMasterMIB.c:87:81: note: (near initialization for 'cyrusMasterMIB_variables')
master/cyrusMasterMIB.c:87:75: warning: excess elements in scalar initializer
   87 |   { SERVICEID           , ASN_INTEGER   , NOACCESS , var_serviceTable, 3, { 2,1,4 } },
      |                                                                           ^
master/cyrusMasterMIB.c:87:75: note: (near initialization for 'cyrusMasterMIB_variables')
master/cyrusMasterMIB.c:87:3: warning: excess elements in scalar initializer
   87 |   { SERVICEID           , ASN_INTEGER   , NOACCESS , var_serviceTable, 3, { 2,1,4 } },
      |   ^
master/cyrusMasterMIB.c:87:3: note: (near initialization for 'cyrusMasterMIB_variables')
master/cyrusMasterMIB.c:89:3: warning: braces around scalar initializer
   89 |   { SERVICECONNS        , ASN_COUNTER   , NOACCESS , var_serviceTable, 3, { 2,1,5 } },
      |   ^
master/cyrusMasterMIB.c:89:3: note: (near initialization for 'cyrusMasterMIB_variables')
master/cyrusMasterMIB.c:88:33: warning: initialization of 'struct variable4 *' from 'int' makes pointer from integer without a cast [-Wint-conversion]
   88 | #define   SERVICECONNS          9
      |                                 ^
master/cyrusMasterMIB.c:89:5: note: in expansion of macro 'SERVICECONNS'
   89 |   { SERVICECONNS        , ASN_COUNTER   , NOACCESS , var_serviceTable, 3, { 2,1,5 } },
      |     ^~~~~~~~~~~~
master/cyrusMasterMIB.c:88:33: note: (near initialization for 'cyrusMasterMIB_variables')
   88 | #define   SERVICECONNS          9
      |                                 ^
master/cyrusMasterMIB.c:89:5: note: in expansion of macro 'SERVICECONNS'
   89 |   { SERVICECONNS        , ASN_COUNTER   , NOACCESS , var_serviceTable, 3, { 2,1,5 } },
      |     ^~~~~~~~~~~~
master/cyrusMasterMIB.c:89:27: warning: excess elements in scalar initializer
   89 |   { SERVICECONNS        , ASN_COUNTER   , NOACCESS , var_serviceTable, 3, { 2,1,5 } },
      |                           ^~~~~~~~~~~
master/cyrusMasterMIB.c:89:27: note: (near initialization for 'cyrusMasterMIB_variables')
master/cyrusMasterMIB.c:89:43: warning: excess elements in scalar initializer
   89 |   { SERVICECONNS        , ASN_COUNTER   , NOACCESS , var_serviceTable, 3, { 2,1,5 } },
      |                                           ^~~~~~~~
master/cyrusMasterMIB.c:89:43: note: (near initialization for 'cyrusMasterMIB_variables')
master/cyrusMasterMIB.c:89:54: warning: excess elements in scalar initializer
   89 |   { SERVICECONNS        , ASN_COUNTER   , NOACCESS , var_serviceTable, 3, { 2,1,5 } },
      |                                                      ^~~~~~~~~~~~~~~~
master/cyrusMasterMIB.c:89:54: note: (near initialization for 'cyrusMasterMIB_variables')
master/cyrusMasterMIB.c:89:72: warning: excess elements in scalar initializer
   89 |   { SERVICECONNS        , ASN_COUNTER   , NOACCESS , var_serviceTable, 3, { 2,1,5 } },
      |                                                                        ^
master/cyrusMasterMIB.c:89:72: note: (near initialization for 'cyrusMasterMIB_variables')
master/cyrusMasterMIB.c:89:3: warning: braces around scalar initializer
   89 |   { SERVICECONNS        , ASN_COUNTER   , NOACCESS , var_serviceTable, 3, { 2,1,5 } },
      |   ^
master/cyrusMasterMIB.c:89:3: note: (near initialization for 'cyrusMasterMIB_variables')
master/cyrusMasterMIB.c:89:77: warning: initialization of 'struct variable4 *' from 'int' makes pointer from integer without a cast [-Wint-conversion]
   89 |   { SERVICECONNS        , ASN_COUNTER   , NOACCESS , var_serviceTable, 3, { 2,1,5 } },
      |                                                                             ^
master/cyrusMasterMIB.c:89:77: note: (near initialization for 'cyrusMasterMIB_variables')
master/cyrusMasterMIB.c:89:79: warning: excess elements in scalar initializer
   89 |   { SERVICECONNS        , ASN_COUNTER   , NOACCESS , var_serviceTable, 3, { 2,1,5 } },
      |                                                                               ^
master/cyrusMasterMIB.c:89:79: note: (near initialization for 'cyrusMasterMIB_variables')
master/cyrusMasterMIB.c:89:81: warning: excess elements in scalar initializer
   89 |   { SERVICECONNS        , ASN_COUNTER   , NOACCESS , var_serviceTable, 3, { 2,1,5 } },
      |                                                                                 ^
master/cyrusMasterMIB.c:89:81: note: (near initialization for 'cyrusMasterMIB_variables')
master/cyrusMasterMIB.c:89:75: warning: excess elements in scalar initializer
   89 |   { SERVICECONNS        , ASN_COUNTER   , NOACCESS , var_serviceTable, 3, { 2,1,5 } },
      |                                                                           ^
master/cyrusMasterMIB.c:89:75: note: (near initialization for 'cyrusMasterMIB_variables')
master/cyrusMasterMIB.c:89:3: warning: excess elements in scalar initializer
   89 |   { SERVICECONNS        , ASN_COUNTER   , NOACCESS , var_serviceTable, 3, { 2,1,5 } },
      |   ^
master/cyrusMasterMIB.c:89:3: note: (near initialization for 'cyrusMasterMIB_variables')
master/cyrusMasterMIB.c:94:15: error: storage class specified for parameter 'startTime'
   94 | static time_t startTime = 0;
      |               ^~~~~~~~~
master/cyrusMasterMIB.c:94:1: error: parameter 'startTime' is initialized
   94 | static time_t startTime = 0;
      | ^~~~~~
master/cyrusMasterMIB.c:102:1: error: expected '=', ',', ';', 'asm' or '__attribute__' before '{' token
  102 | {
      | ^
master/cyrusMasterMIB.c:134:1: error: expected '=', ',', ';', 'asm' or '__attribute__' before '{' token
  134 | {
      | ^
master/cyrusMasterMIB.c:182:1: error: expected '=', ',', ';', 'asm' or '__attribute__' before '{' token
  182 | {
      | ^
In file included from master/cyrusMasterMIB.c:14:
master/cyrusMasterMIB.h:12:1: error: old-style parameter declarations in prototyped function definition
   12 | config_require(util_funcs)
      | ^~~~~~~~~~~~~~
master/cyrusMasterMIB.c:250: error: expected '{' at end of input
make[2]: *** [Makefile:4856: master/cyrusMasterMIB.o] Error 1
make[2]: Leaving directory '/tmp/B.vw7b_hov/BUILD/cyrus-imapd-3.0.16'
make[1]: *** [Makefile:6488: all-recursive] Error 1
make[1]: Leaving directory '/tmp/B.vw7b_hov/BUILD/cyrus-imapd-3.0.16'
make: *** [Makefile:3001: all] Error 2
error: Bad exit status from /tmp/B.vw7b_hov/BUILD/tmp/rpm-tmp.tlfjel (%build)

RPM build warnings:
    Macro expanded in comment on line 82: %{_bindir}

    line 89: It's not recommended to have unversioned Obsoletes: Obsoletes:	imap
    line 90: It's not recommended to have unversioned Obsoletes: Obsoletes:	imapd
    line 91: It's not recommended to have unversioned Obsoletes: Obsoletes:	imapdaemon
    line 92: It's not recommended to have unversioned Obsoletes: Obsoletes:	pop3daemon
    Could not canonicalize hostname: nereid

RPM build errors:
    Bad exit status from /tmp/B.vw7b_hov/BUILD/tmp/rpm-tmp.tlfjel (%build)
ended at: Sun Nov 26 10:28:17 2023, done in 0:01:17.614863
error: No files produced.
+ chmod -R u+rwX /tmp/B.vw7b_hov/BUILD
+ rm -rf /tmp/B.vw7b_hov/tmp /tmp/B.vw7b_hov/BUILD
+ rm -rf /tmp/B.vw7b_hov
Begin-PLD-Builder-Info
Build-Time: user:64.53s sys:23.25s real:81.20s (faults io:12 non-io:3346459)

End-PLD-Builder-Info
[Back to list of logs] [View rpm -qa of builder]