FailedOk

th/SRPMS[OK]
th/x32[OK]
th/i686[OK]
th/x86_64[OK]

ac/SRPMS[OK]
ac/i386[OK]
ac/i586[OK]
ac/i686[OK]
ac/alpha[OK]
ac/amd64[OK]
ac/athlon[OK]
ac/ppc[OK]
ac/sparc[OK]
ac/sparc64[OK]

Advanced Search
main()
Powered by PLD Linux
(c) 2002-2021 PLD Team
$Revision: 1.37 $
Powered by Paranoid Android.
Your IP: 35.175.107.77

exim 93FDFB30-7FF1-47BA-B388-661FA0C33421

Status:Failed
Source URL:https://buildlogs.pld-linux.org/pld/th/i686/FAIL/exim,93FDFB30-7FF1-47BA-B388-661FA0C33421.bz2
text/plain URL:View!
full text:View!
rpm -qa of builder:View!
Date:2021/10/06 08:22:41
Runtime:0:00:03.017668

Toc:

  • error 1
  • tls-openssl.c:235:50: error: missing binary operator before token "1"
  • error 2
  • make[1]: *** [Makefile:338: macro-tls.o] Error 1
  • error 3
  • error: Bad exit status from /tmp/B.c3bn9_0t/BUILD/tmp/rpm-tmp.OCOlqa (%build)
  • error 4
  • RPM build errors:
  • error 5
  • error: No files produced.

Content:

LDAP_LIB_TYPE=OPENLDAP2
# for dynamic
LOOKUP_LDAP_LIBS=-lldap -llber
# for static
LOOKUP_LIBS+=-lldap -llber
EXPERIMENTAL_LMDB=yes
LOOKUP_LIBS+=-llmdb
DLOPEN_LOCAL_SCAN=yes
EOF

+ >>Local/Makefile-Linux 
+ cat
+ cp -f src/EDITME Local/Makefile
+ cp -f exim_monitor/EDITME Local/eximon.conf
+ RPM_EC=0 
+ jobs -p
+ exit 0
Executing(%build): /bin/sh -e /tmp/B.c3bn9_0t/BUILD/tmp/rpm-tmp.OCOlqa
TMP=/home/users/builder/tmp
HOME=/home/users/builder
PATH=/home/users/builder/GNUstep/Tools:/bin:/usr/bin:/usr/local/bin:/home/users/builder/bin
TMPDIR=/tmp/B.c3bn9_0t/BUILD/tmp
+ umask 022
+ cd /tmp/B.c3bn9_0t/BUILD
+ cd exim-4.95
+ /usr/bin/make -Otarget -j9 -e 'FULLECHO='
/bin/sh scripts/source_checks

>>> Creating links to source files...
>>> Creating lookups/Makefile for building dynamic modules
>>> New Makefile & lookups/Makefile installed
>>> Use "make makefile" if you need to force rebuilding of the makefile
 
make[1]: Entering directory '/tmp/B.c3bn9_0t/BUILD/exim-4.95/build-Linux-IntelR_XeonR_CPU___________X5470___3.33GHz'
make[1]: warning: -j9 forced in submake: resetting jobserver mode.
make[1]: Leaving directory '/tmp/B.c3bn9_0t/BUILD/exim-4.95/build-Linux-IntelR_XeonR_CPU___________X5470___3.33GHz'
make[1]: Entering directory '/tmp/B.c3bn9_0t/BUILD/exim-4.95/build-Linux-IntelR_XeonR_CPU___________X5470___3.33GHz'
/bin/sh ../scripts/Configure-os.c
make[1]: Leaving directory '/tmp/B.c3bn9_0t/BUILD/exim-4.95/build-Linux-IntelR_XeonR_CPU___________X5470___3.33GHz'
make[1]: Entering directory '/tmp/B.c3bn9_0t/BUILD/exim-4.95/build-Linux-IntelR_XeonR_CPU___________X5470___3.33GHz'
/bin/sh ../scripts/Configure-os.h
make[1]: Leaving directory '/tmp/B.c3bn9_0t/BUILD/exim-4.95/build-Linux-IntelR_XeonR_CPU___________X5470___3.33GHz'
make[1]: Entering directory '/tmp/B.c3bn9_0t/BUILD/exim-4.95/build-Linux-IntelR_XeonR_CPU___________X5470___3.33GHz'
i686-pld-linux-gcc exim_lock.c
i686-pld-linux-gcc -c -D_FILE_OFFSET_BITS=64 -D_LARGEFILE_SOURCE -O2 -fwrapv -pipe -Wformat -Werror=format-security -gdwarf-4 -fno-debug-types-section -fvar-tracking-assignments -g2 -Wp,-D_FORTIFY_SOURCE=2 -fstack-protector-strong --param=ssp-buffer-size=4 -Werror=trampolines -fomit-frame-pointer -march=i686 -fasynchronous-unwind-tables -mtune=pentium4 -gdwarf-4 -fno-debug-types-section -fvar-tracking-assignments -g2 -fvisibility=hidden  exim_lock.c
i686-pld-linux-gcc -o exim_lock
i686-pld-linux-gcc -o exim_lock  exim_lock.o  \
  -lcrypt -lm -lpam -ldl
>>> exim_lock utility built
 
make[1]: Leaving directory '/tmp/B.c3bn9_0t/BUILD/exim-4.95/build-Linux-IntelR_XeonR_CPU___________X5470___3.33GHz'
make[1]: Entering directory '/tmp/B.c3bn9_0t/BUILD/exim-4.95/build-Linux-IntelR_XeonR_CPU___________X5470___3.33GHz'
i686-pld-linux-gcc buildconfig.c
i686-pld-linux-gcc -D_FILE_OFFSET_BITS=64 -D_LARGEFILE_SOURCE -O2 -fwrapv -pipe -Wformat -Werror=format-security -gdwarf-4 -fno-debug-types-section -fvar-tracking-assignments -g2 -Wp,-D_FORTIFY_SOURCE=2 -fstack-protector-strong --param=ssp-buffer-size=4 -Werror=trampolines -fomit-frame-pointer -march=i686 -fasynchronous-unwind-tables -mtune=pentium4 -gdwarf-4 -fno-debug-types-section -fvar-tracking-assignments -g2 -fvisibility=hidden  -o buildconfig buildconfig.c -lcrypt -lm
make[1]: Leaving directory '/tmp/B.c3bn9_0t/BUILD/exim-4.95/build-Linux-IntelR_XeonR_CPU___________X5470___3.33GHz'
/bin/sh ../scripts/Configure-config.h "/usr/bin/make"
make[2]: 'buildconfig' is up to date.
Building configuration file config.h
>>> config.h built

make[1]: Entering directory '/tmp/B.c3bn9_0t/BUILD/exim-4.95/build-Linux-IntelR_XeonR_CPU___________X5470___3.33GHz'
i686-pld-linux-gcc -DMACRO_PREDEF transport.c
i686-pld-linux-gcc -c -D_FILE_OFFSET_BITS=64 -D_LARGEFILE_SOURCE -O2 -fwrapv -pipe -Wformat -Werror=format-security -gdwarf-4 -fno-debug-types-section -fvar-tracking-assignments -g2 -Wp,-D_FORTIFY_SOURCE=2 -fstack-protector-strong --param=ssp-buffer-size=4 -Werror=trampolines -fomit-frame-pointer -march=i686 -fasynchronous-unwind-tables -mtune=pentium4 -gdwarf-4 -fno-debug-types-section -fvar-tracking-assignments -g2 -fvisibility=hidden -DMACRO_PREDEF  -o macro-transport.o transport.c
make[1]: Leaving directory '/tmp/B.c3bn9_0t/BUILD/exim-4.95/build-Linux-IntelR_XeonR_CPU___________X5470___3.33GHz'
make[1]: Entering directory '/tmp/B.c3bn9_0t/BUILD/exim-4.95/build-Linux-IntelR_XeonR_CPU___________X5470___3.33GHz'
i686-pld-linux-gcc -DMACRO_PREDEF acl.c
i686-pld-linux-gcc -c -D_FILE_OFFSET_BITS=64 -D_LARGEFILE_SOURCE -O2 -fwrapv -pipe -Wformat -Werror=format-security -gdwarf-4 -fno-debug-types-section -fvar-tracking-assignments -g2 -Wp,-D_FORTIFY_SOURCE=2 -fstack-protector-strong --param=ssp-buffer-size=4 -Werror=trampolines -fomit-frame-pointer -march=i686 -fasynchronous-unwind-tables -mtune=pentium4 -gdwarf-4 -fno-debug-types-section -fvar-tracking-assignments -g2 -fvisibility=hidden -DMACRO_PREDEF  -o macro-acl.o acl.c
make[1]: Leaving directory '/tmp/B.c3bn9_0t/BUILD/exim-4.95/build-Linux-IntelR_XeonR_CPU___________X5470___3.33GHz'
make[1]: Entering directory '/tmp/B.c3bn9_0t/BUILD/exim-4.95/build-Linux-IntelR_XeonR_CPU___________X5470___3.33GHz'
i686-pld-linux-gcc -DMACRO_PREDEF globals.c
i686-pld-linux-gcc -c -D_FILE_OFFSET_BITS=64 -D_LARGEFILE_SOURCE -O2 -fwrapv -pipe -Wformat -Werror=format-security -gdwarf-4 -fno-debug-types-section -fvar-tracking-assignments -g2 -Wp,-D_FORTIFY_SOURCE=2 -fstack-protector-strong --param=ssp-buffer-size=4 -Werror=trampolines -fomit-frame-pointer -march=i686 -fasynchronous-unwind-tables -mtune=pentium4 -gdwarf-4 -fno-debug-types-section -fvar-tracking-assignments -g2 -fvisibility=hidden -DMACRO_PREDEF  -o macro-globals.o globals.c
make[1]: Leaving directory '/tmp/B.c3bn9_0t/BUILD/exim-4.95/build-Linux-IntelR_XeonR_CPU___________X5470___3.33GHz'
make[1]: Entering directory '/tmp/B.c3bn9_0t/BUILD/exim-4.95/build-Linux-IntelR_XeonR_CPU___________X5470___3.33GHz'
i686-pld-linux-gcc -DMACRO_PREDEF readconf.c
i686-pld-linux-gcc -c -D_FILE_OFFSET_BITS=64 -D_LARGEFILE_SOURCE -O2 -fwrapv -pipe -Wformat -Werror=format-security -gdwarf-4 -fno-debug-types-section -fvar-tracking-assignments -g2 -Wp,-D_FORTIFY_SOURCE=2 -fstack-protector-strong --param=ssp-buffer-size=4 -Werror=trampolines -fomit-frame-pointer -march=i686 -fasynchronous-unwind-tables -mtune=pentium4 -gdwarf-4 -fno-debug-types-section -fvar-tracking-assignments -g2 -fvisibility=hidden -DMACRO_PREDEF  -o macro-readconf.o readconf.c
make[1]: Leaving directory '/tmp/B.c3bn9_0t/BUILD/exim-4.95/build-Linux-IntelR_XeonR_CPU___________X5470___3.33GHz'
make[1]: Entering directory '/tmp/B.c3bn9_0t/BUILD/exim-4.95/build-Linux-IntelR_XeonR_CPU___________X5470___3.33GHz'
i686-pld-linux-gcc -DMACRO_PREDEF drtables.c
i686-pld-linux-gcc -c -D_FILE_OFFSET_BITS=64 -D_LARGEFILE_SOURCE -O2 -fwrapv -pipe -Wformat -Werror=format-security -gdwarf-4 -fno-debug-types-section -fvar-tracking-assignments -g2 -Wp,-D_FORTIFY_SOURCE=2 -fstack-protector-strong --param=ssp-buffer-size=4 -Werror=trampolines -fomit-frame-pointer -march=i686 -fasynchronous-unwind-tables -mtune=pentium4 -gdwarf-4 -fno-debug-types-section -fvar-tracking-assignments -g2 -fvisibility=hidden -DMACRO_PREDEF  -o macro-drtables.o drtables.c
make[1]: Leaving directory '/tmp/B.c3bn9_0t/BUILD/exim-4.95/build-Linux-IntelR_XeonR_CPU___________X5470___3.33GHz'
make[1]: Entering directory '/tmp/B.c3bn9_0t/BUILD/exim-4.95/build-Linux-IntelR_XeonR_CPU___________X5470___3.33GHz'
i686-pld-linux-gcc -DMACRO_PREDEF transports/appendfile.c
i686-pld-linux-gcc -c -D_FILE_OFFSET_BITS=64 -D_LARGEFILE_SOURCE -O2 -fwrapv -pipe -Wformat -Werror=format-security -gdwarf-4 -fno-debug-types-section -fvar-tracking-assignments -g2 -Wp,-D_FORTIFY_SOURCE=2 -fstack-protector-strong --param=ssp-buffer-size=4 -Werror=trampolines -fomit-frame-pointer -march=i686 -fasynchronous-unwind-tables -mtune=pentium4 -gdwarf-4 -fno-debug-types-section -fvar-tracking-assignments -g2 -fvisibility=hidden -DMACRO_PREDEF  -o macro-appendfile.o transports/appendfile.c
make[1]: Leaving directory '/tmp/B.c3bn9_0t/BUILD/exim-4.95/build-Linux-IntelR_XeonR_CPU___________X5470___3.33GHz'
make[1]: Entering directory '/tmp/B.c3bn9_0t/BUILD/exim-4.95/build-Linux-IntelR_XeonR_CPU___________X5470___3.33GHz'
i686-pld-linux-gcc -DMACRO_PREDEF macro_predef.c
i686-pld-linux-gcc -c -D_FILE_OFFSET_BITS=64 -D_LARGEFILE_SOURCE -O2 -fwrapv -pipe -Wformat -Werror=format-security -gdwarf-4 -fno-debug-types-section -fvar-tracking-assignments -g2 -Wp,-D_FORTIFY_SOURCE=2 -fstack-protector-strong --param=ssp-buffer-size=4 -Werror=trampolines -fomit-frame-pointer -march=i686 -fasynchronous-unwind-tables -mtune=pentium4 -gdwarf-4 -fno-debug-types-section -fvar-tracking-assignments -g2 -fvisibility=hidden -DMACRO_PREDEF  -o macro_predef.o macro_predef.c
make[1]: Leaving directory '/tmp/B.c3bn9_0t/BUILD/exim-4.95/build-Linux-IntelR_XeonR_CPU___________X5470___3.33GHz'
make[1]: Entering directory '/tmp/B.c3bn9_0t/BUILD/exim-4.95/build-Linux-IntelR_XeonR_CPU___________X5470___3.33GHz'
i686-pld-linux-gcc -DMACRO_PREDEF route.c
i686-pld-linux-gcc -c -D_FILE_OFFSET_BITS=64 -D_LARGEFILE_SOURCE -O2 -fwrapv -pipe -Wformat -Werror=format-security -gdwarf-4 -fno-debug-types-section -fvar-tracking-assignments -g2 -Wp,-D_FORTIFY_SOURCE=2 -fstack-protector-strong --param=ssp-buffer-size=4 -Werror=trampolines -fomit-frame-pointer -march=i686 -fasynchronous-unwind-tables -mtune=pentium4 -gdwarf-4 -fno-debug-types-section -fvar-tracking-assignments -g2 -fvisibility=hidden -DMACRO_PREDEF  -o macro-route.o route.c
make[1]: Leaving directory '/tmp/B.c3bn9_0t/BUILD/exim-4.95/build-Linux-IntelR_XeonR_CPU___________X5470___3.33GHz'
make[1]: Entering directory '/tmp/B.c3bn9_0t/BUILD/exim-4.95/build-Linux-IntelR_XeonR_CPU___________X5470___3.33GHz'
i686-pld-linux-gcc -DMACRO_PREDEF tls.c
i686-pld-linux-gcc -c -D_FILE_OFFSET_BITS=64 -D_LARGEFILE_SOURCE -O2 -fwrapv -pipe -Wformat -Werror=format-security -gdwarf-4 -fno-debug-types-section -fvar-tracking-assignments -g2 -Wp,-D_FORTIFY_SOURCE=2 -fstack-protector-strong --param=ssp-buffer-size=4 -Werror=trampolines -fomit-frame-pointer -march=i686 -fasynchronous-unwind-tables -mtune=pentium4 -gdwarf-4 -fno-debug-types-section -fvar-tracking-assignments -g2 -fvisibility=hidden -DMACRO_PREDEF  -o macro-tls.o tls.c
In file included from sha_ver.h:38,
                 from hash.h:14,
                 from exim.h:537,
                 from tls.c:20:
tls-openssl.c:235:50: error: missing binary operator before token "1"
  235 | # if (OPENSSL_VERSION_NUMBER < 0x30000000fL) && (SSL_OP_NO_TLSv1_1 == 0x00000400L)
      |                                                  ^~~~~~~~~~~~~~~~~
make[1]: *** [Makefile:338: macro-tls.o] Error 1
make[1]: Leaving directory '/tmp/B.c3bn9_0t/BUILD/exim-4.95/build-Linux-IntelR_XeonR_CPU___________X5470___3.33GHz'
make[1]: *** Waiting for unfinished jobs....
make[1]: Entering directory '/tmp/B.c3bn9_0t/BUILD/exim-4.95/build-Linux-IntelR_XeonR_CPU___________X5470___3.33GHz'
i686-pld-linux-gcc -DMACRO_PREDEF transports/autoreply.c
i686-pld-linux-gcc -c -D_FILE_OFFSET_BITS=64 -D_LARGEFILE_SOURCE -O2 -fwrapv -pipe -Wformat -Werror=format-security -gdwarf-4 -fno-debug-types-section -fvar-tracking-assignments -g2 -Wp,-D_FORTIFY_SOURCE=2 -fstack-protector-strong --param=ssp-buffer-size=4 -Werror=trampolines -fomit-frame-pointer -march=i686 -fasynchronous-unwind-tables -mtune=pentium4 -gdwarf-4 -fno-debug-types-section -fvar-tracking-assignments -g2 -fvisibility=hidden -DMACRO_PREDEF  -o macro-autoreply.o transports/autoreply.c
make[1]: Leaving directory '/tmp/B.c3bn9_0t/BUILD/exim-4.95/build-Linux-IntelR_XeonR_CPU___________X5470___3.33GHz'
make[1]: Entering directory '/tmp/B.c3bn9_0t/BUILD/exim-4.95/build-Linux-IntelR_XeonR_CPU___________X5470___3.33GHz'
i686-pld-linux-gcc -DMACRO_PREDEF transports/lmtp.c
i686-pld-linux-gcc -c -D_FILE_OFFSET_BITS=64 -D_LARGEFILE_SOURCE -O2 -fwrapv -pipe -Wformat -Werror=format-security -gdwarf-4 -fno-debug-types-section -fvar-tracking-assignments -g2 -Wp,-D_FORTIFY_SOURCE=2 -fstack-protector-strong --param=ssp-buffer-size=4 -Werror=trampolines -fomit-frame-pointer -march=i686 -fasynchronous-unwind-tables -mtune=pentium4 -gdwarf-4 -fno-debug-types-section -fvar-tracking-assignments -g2 -fvisibility=hidden -DMACRO_PREDEF  -o macro-lmtp.o transports/lmtp.c
make[1]: Leaving directory '/tmp/B.c3bn9_0t/BUILD/exim-4.95/build-Linux-IntelR_XeonR_CPU___________X5470___3.33GHz'
make[1]: Entering directory '/tmp/B.c3bn9_0t/BUILD/exim-4.95/build-Linux-IntelR_XeonR_CPU___________X5470___3.33GHz'
i686-pld-linux-gcc -DMACRO_PREDEF transports/queuefile.c
i686-pld-linux-gcc -c -D_FILE_OFFSET_BITS=64 -D_LARGEFILE_SOURCE -O2 -fwrapv -pipe -Wformat -Werror=format-security -gdwarf-4 -fno-debug-types-section -fvar-tracking-assignments -g2 -Wp,-D_FORTIFY_SOURCE=2 -fstack-protector-strong --param=ssp-buffer-size=4 -Werror=trampolines -fomit-frame-pointer -march=i686 -fasynchronous-unwind-tables -mtune=pentium4 -gdwarf-4 -fno-debug-types-section -fvar-tracking-assignments -g2 -fvisibility=hidden -DMACRO_PREDEF  -o macro-queuefile.o transports/queuefile.c
make[1]: Leaving directory '/tmp/B.c3bn9_0t/BUILD/exim-4.95/build-Linux-IntelR_XeonR_CPU___________X5470___3.33GHz'
make[1]: Entering directory '/tmp/B.c3bn9_0t/BUILD/exim-4.95/build-Linux-IntelR_XeonR_CPU___________X5470___3.33GHz'
i686-pld-linux-gcc -DMACRO_PREDEF transports/pipe.c
i686-pld-linux-gcc -c -D_FILE_OFFSET_BITS=64 -D_LARGEFILE_SOURCE -O2 -fwrapv -pipe -Wformat -Werror=format-security -gdwarf-4 -fno-debug-types-section -fvar-tracking-assignments -g2 -Wp,-D_FORTIFY_SOURCE=2 -fstack-protector-strong --param=ssp-buffer-size=4 -Werror=trampolines -fomit-frame-pointer -march=i686 -fasynchronous-unwind-tables -mtune=pentium4 -gdwarf-4 -fno-debug-types-section -fvar-tracking-assignments -g2 -fvisibility=hidden -DMACRO_PREDEF  -o macro-pipe.o transports/pipe.c
make[1]: Leaving directory '/tmp/B.c3bn9_0t/BUILD/exim-4.95/build-Linux-IntelR_XeonR_CPU___________X5470___3.33GHz'
make[1]: Entering directory '/tmp/B.c3bn9_0t/BUILD/exim-4.95/build-Linux-IntelR_XeonR_CPU___________X5470___3.33GHz'
i686-pld-linux-gcc -DMACRO_PREDEF transports/smtp.c
i686-pld-linux-gcc -c -D_FILE_OFFSET_BITS=64 -D_LARGEFILE_SOURCE -O2 -fwrapv -pipe -Wformat -Werror=format-security -gdwarf-4 -fno-debug-types-section -fvar-tracking-assignments -g2 -Wp,-D_FORTIFY_SOURCE=2 -fstack-protector-strong --param=ssp-buffer-size=4 -Werror=trampolines -fomit-frame-pointer -march=i686 -fasynchronous-unwind-tables -mtune=pentium4 -gdwarf-4 -fno-debug-types-section -fvar-tracking-assignments -g2 -fvisibility=hidden -DMACRO_PREDEF  -o macro-smtp.o transports/smtp.c
make[1]: Leaving directory '/tmp/B.c3bn9_0t/BUILD/exim-4.95/build-Linux-IntelR_XeonR_CPU___________X5470___3.33GHz'
make[1]: Entering directory '/tmp/B.c3bn9_0t/BUILD/exim-4.95/build-Linux-IntelR_XeonR_CPU___________X5470___3.33GHz'
i686-pld-linux-gcc -DMACRO_PREDEF routers/accept.c
i686-pld-linux-gcc -c -D_FILE_OFFSET_BITS=64 -D_LARGEFILE_SOURCE -O2 -fwrapv -pipe -Wformat -Werror=format-security -gdwarf-4 -fno-debug-types-section -fvar-tracking-assignments -g2 -Wp,-D_FORTIFY_SOURCE=2 -fstack-protector-strong --param=ssp-buffer-size=4 -Werror=trampolines -fomit-frame-pointer -march=i686 -fasynchronous-unwind-tables -mtune=pentium4 -gdwarf-4 -fno-debug-types-section -fvar-tracking-assignments -g2 -fvisibility=hidden -DMACRO_PREDEF  -o macro-accept.o routers/accept.c
make[1]: Leaving directory '/tmp/B.c3bn9_0t/BUILD/exim-4.95/build-Linux-IntelR_XeonR_CPU___________X5470___3.33GHz'
make[1]: Entering directory '/tmp/B.c3bn9_0t/BUILD/exim-4.95/build-Linux-IntelR_XeonR_CPU___________X5470___3.33GHz'
i686-pld-linux-gcc -DMACRO_PREDEF routers/dnslookup.c
i686-pld-linux-gcc -c -D_FILE_OFFSET_BITS=64 -D_LARGEFILE_SOURCE -O2 -fwrapv -pipe -Wformat -Werror=format-security -gdwarf-4 -fno-debug-types-section -fvar-tracking-assignments -g2 -Wp,-D_FORTIFY_SOURCE=2 -fstack-protector-strong --param=ssp-buffer-size=4 -Werror=trampolines -fomit-frame-pointer -march=i686 -fasynchronous-unwind-tables -mtune=pentium4 -gdwarf-4 -fno-debug-types-section -fvar-tracking-assignments -g2 -fvisibility=hidden -DMACRO_PREDEF  -o macro-dnslookup.o routers/dnslookup.c
make[1]: Leaving directory '/tmp/B.c3bn9_0t/BUILD/exim-4.95/build-Linux-IntelR_XeonR_CPU___________X5470___3.33GHz'
make[1]: Entering directory '/tmp/B.c3bn9_0t/BUILD/exim-4.95/build-Linux-IntelR_XeonR_CPU___________X5470___3.33GHz'
i686-pld-linux-gcc -DMACRO_PREDEF routers/ipliteral.c
i686-pld-linux-gcc -c -D_FILE_OFFSET_BITS=64 -D_LARGEFILE_SOURCE -O2 -fwrapv -pipe -Wformat -Werror=format-security -gdwarf-4 -fno-debug-types-section -fvar-tracking-assignments -g2 -Wp,-D_FORTIFY_SOURCE=2 -fstack-protector-strong --param=ssp-buffer-size=4 -Werror=trampolines -fomit-frame-pointer -march=i686 -fasynchronous-unwind-tables -mtune=pentium4 -gdwarf-4 -fno-debug-types-section -fvar-tracking-assignments -g2 -fvisibility=hidden -DMACRO_PREDEF  -o macro-ipliteral.o routers/ipliteral.c
make[1]: Leaving directory '/tmp/B.c3bn9_0t/BUILD/exim-4.95/build-Linux-IntelR_XeonR_CPU___________X5470___3.33GHz'
make: *** [Makefile:35: all] Error 2
error: Bad exit status from /tmp/B.c3bn9_0t/BUILD/tmp/rpm-tmp.OCOlqa (%build)


RPM build errors:
    line 111: It's not recommended to have unversioned Obsoletes: Obsoletes:	exipick
    line 112: It's not recommended to have unversioned Obsoletes: Obsoletes:	smtpdaemon
    Could not canonicalize hostname: nereid
    Bad exit status from /tmp/B.c3bn9_0t/BUILD/tmp/rpm-tmp.OCOlqa (%build)
ended at: Wed Oct  6 08:22:41 2021, done in 0:00:03.017668
error: No files produced.
+ chmod -R u+rwX /tmp/B.c3bn9_0t/BUILD
+ rm -rf /tmp/B.c3bn9_0t/tmp /tmp/B.c3bn9_0t/BUILD
+ rm -rf /tmp/B.c3bn9_0t
Begin-PLD-Builder-Info
Build-Time: user:7.22s sys:1.65s real:5.02s (faults io:2 non-io:327332)

End-PLD-Builder-Info
[Back to list of logs] [View rpm -qa of builder]