FailedOk

th/SRPMS[OK]
th/x32[OK]
th/i686[OK]
th/x86_64[OK]

ac/SRPMS[OK]
ac/i386[OK]
ac/i586[OK]
ac/i686[OK]
ac/alpha[OK]
ac/amd64[OK]
ac/athlon[OK]
ac/ppc[OK]
ac/sparc[OK]
ac/sparc64[OK]

Advanced Search
main()
Powered by PLD Linux
(c) 2002-2022 PLD Team
$Revision: 1.37 $
Powered by Real Programmer.
Your IP: 3.237.27.159

firefox a4fad8ff-bb48-4fe7-b0af-8b3c490df604

Status:Failed
Source URL:https://buildlogs.pld-linux.org/pld/th/i686/FAIL/firefox,a4fad8ff-bb48-4fe7-b0af-8b3c490df604.bz2
text/plain URL:View!
rpm -qa of builder:View!
Date:2022/09/21 00:31:38
Runtime:0:47:44.630208

Toc:

  • prep
  • Executing(%prep): /bin/sh -e /tmp/B.qx2tm3hd/BUILD/tmp/rpm-tmp.2P03em
  • build
  • Executing(%build): /bin/sh -e /tmp/B.qx2tm3hd/BUILD/tmp/rpm-tmp.vD8ieZ
  • error 1
  • 30:54.00 /tmp/B.qx2tm3hd/BUILD/firefox-105.0/modules/fdlibm/src/math_private.h:34:21: error: typedef redefinition with different types ('__double_t' (aka 'double') vs 'long double')
  • error 2
  • 30:54.00 /tmp/B.qx2tm3hd/BUILD/firefox-105.0/modules/fdlibm/src/math_private.h:36:21: error: typedef redefinition with different types ('__float_t' (aka 'float') vs 'long double')
  • error 3
  • 30:54.10 gmake[4]: *** [/tmp/B.qx2tm3hd/BUILD/firefox-105.0/config/rules.mk:667: e_acos.o] Error 1
  • error 4
  • 30:54.10 gmake[3]: *** [/tmp/B.qx2tm3hd/BUILD/firefox-105.0/config/recurse.mk:72: modules/fdlibm/src/target-objects] Error 2
  • error 5
  • 46:23.25 gmake[2]: *** [/tmp/B.qx2tm3hd/BUILD/firefox-105.0/config/recurse.mk:34: compile] Error 2
  • error 6
  • 46:23.25 gmake[1]: *** [/tmp/B.qx2tm3hd/BUILD/firefox-105.0/config/rules.mk:361: default] Error 2
  • error 7
  • error: Bad exit status from /tmp/B.qx2tm3hd/BUILD/tmp/rpm-tmp.vD8ieZ (%build)
  • error 8
  • RPM build errors:
  • error 9
  • error: No files produced.

Content:

request from: atler
checking if we should skip the build
started at: Tue Sep 20 23:42:46 2022
killing old processes on a builder
sending signal 9 to pid -1
cleaning up /tmp
fetching https://srcbuilder.pld-linux.org/th//srpms/a4fad8ff-bb48-4fe7-b0af-8b3c490df604/firefox-105.0-1.src.rpm
fetched 535803789 bytes, 15859.1 K/s
installing srpm: firefox-105.0-1.src.rpm
+ install -d /tmp/B.qx2tm3hd/BUILD /tmp/B.qx2tm3hd/RPMS
+ LC_ALL=en_US.UTF-8
+ rpm -qp --changelog firefox-105.0-1.src.rpm
* Tue Sep 20 2022 PLD Linux Team <feedback@pld-linux.org>
- For complete changelog see: http://git.pld-linux.org/?p=packages/firefox.git;a=log;h=master
* Tue Sep 20 2022 Jan Palus <atler@pld-linux.org> 0d6efbd
- up to 105.0 * Thu Sep 08 2022 Jan Palus <atler@pld-linux.org> dde4da9
- up to 104.0.2 * Fri Sep 02 2022 Jan Palus <atler@pld-linux.org> c1763d9
- up to 104.0.1 * Wed Aug 24 2022 Jan Palus <atler@pld-linux.org> 969963f
- Release 2 (by relup.sh) * Wed Aug 24 2022 Jan Palus <atler@pld-linux.org> d1c14d5
- upstream (protobuf) fix for build failure on x86 32-bit * Tue Aug 23 2022 Jan Palus <jpalus@fastmail.com> 3e12498
- up to 104.0 * Tue Aug 09 2022 Jan Palus <atler@pld-linux.org> 7bb2a3e
- up to 103.0.2 * Thu Aug 04 2022 Jan Palus <atler@pld-linux.org> bf0a29b
- drop glibc 2.34 workaround (bring back orig sandbox level) * Tue Aug 02 2022 Jan Palus <atler@pld-linux.org> b9ccb94
- up to 103.0.1 * Wed Jul 27 2022 Jakub Bogusz <qboosh@pld-linux.org> a57c3ad
- versioned Obsoletes for bn_IN locale * Wed Jul 27 2022 Jakub Bogusz <qboosh@pld-linux.org> bed44e9
- changed deprecated MACH_USE_SYSTEM_PYTHON=1 to MACH_BUILD_PYTHON_NATIVE_PACKAGE_SOURCE=none * Tue Jul 26 2022 Jan Palus <atler@pld-linux.org> 141d865
- up to 103.0 * Wed Jul 13 2022 Jan Palus <atler@pld-linux.org> c32b70c
- up to 102.0.1 * Thu Jun 30 2022 Jan Palus <jpalus@fastmail.com> 3cbf37b
- up to 102.0 * Tue May 31 2022 Jan Palus <atler@pld-linux.org> a38905d
- update required rust version * Tue May 31 2022 Jan Palus <atler@pld-linux.org> d71b01b
- up to 101.0 * Sat May 21 2022 Jan Palus <atler@pld-linux.org> 88d7418
- up to 100.0.2 (critical security fixes) * Wed May 04 2022 Jan Palus <atler@pld-linux.org> ea987d3
- up to 100.0 * Tue Apr 12 2022 Jan Palus <atler@pld-linux.org> 98d502c
- up to 99.0.1 * Wed Apr 06 2022 Jan Palus <atler@pld-linux.org> 71b323e
- up to 99.0 + rpm -Uhv --nodeps --define '_topdir /tmp/B.qx2tm3hd' --define '_specdir %{_topdir}' --define '_sourcedir %{_specdir}' --define '_rpmdir %{_topdir}/RPMS' --define '_builddir %{_topdir}/BUILD' firefox-105.0-1.src.rpm Updating / installing... firefox-105.0-1 ######################################## + rm -f firefox-105.0-1.src.rpm + install -m 700 -d /tmp/B.qx2tm3hd/BUILD/tmp + TMPDIR=/tmp/B.qx2tm3hd/BUILD/tmp + exec nice -n 0 rpmbuild -bp --short-circuit --nodeps --define '_topdir /tmp/B.qx2tm3hd' --define '_specdir %{_topdir}' --define '_sourcedir %{_specdir}' --define '_rpmdir %{_topdir}/RPMS' --define '_builddir %{_topdir}/BUILD' --target i686-pld-linux --define 'prep exit 0' /tmp/B.qx2tm3hd/firefox.spec warning: Macro expanded in comment on line 2468: %{_datadir}/%{name}/browser/extensions/langpack-csb@firefox.mozilla.org.xpi warning: Macro expanded in comment on line 2640: %{_datadir}/%{name}/browser/extensions/langpack-ku@firefox.mozilla.org.xpi warning: Macro expanded in comment on line 2808: %{_datadir}/%{name}/browser/extensions/langpack-zu@firefox.mozilla.org.xpi warning: Could not canonicalize hostname: nereid Building target platforms: i686-pld-linux Building for target i686-pld-linux RPM build warnings: Macro expanded in comment on line 2468: %{_datadir}/%{name}/browser/extensions/langpack-csb@firefox.mozilla.org.xpi Macro expanded in comment on line 2640: %{_datadir}/%{name}/browser/extensions/langpack-ku@firefox.mozilla.org.xpi Macro expanded in comment on line 2808: %{_datadir}/%{name}/browser/extensions/langpack-zu@firefox.mozilla.org.xpi Could not canonicalize hostname: nereid checking BuildConflict-ing packages rpm: warning: Macro expanded in comment on line 2468: %{_datadir}/%{name}/browser/extensions/langpack-csb@firefox.mozilla.org.xpi rpm: rpm: warning: Macro expanded in comment on line 2640: %{_datadir}/%{name}/browser/extensions/langpack-ku@firefox.mozilla.org.xpi rpm: rpm: warning: Macro expanded in comment on line 2808: %{_datadir}/%{name}/browser/extensions/langpack-zu@firefox.mozilla.org.xpi rpm: rpm: warning: Could not canonicalize hostname: nereid rpm: Building target platforms: i686-pld-linux rpm: Building for target i686-pld-linux rpm: rpm: RPM build warnings: rpm: Macro expanded in comment on line 2468: %{_datadir}/%{name}/browser/extensions/langpack-csb@firefox.mozilla.org.xpi rpm: rpm: Macro expanded in comment on line 2640: %{_datadir}/%{name}/browser/extensions/langpack-ku@firefox.mozilla.org.xpi rpm: rpm: Macro expanded in comment on line 2808: %{_datadir}/%{name}/browser/extensions/langpack-zu@firefox.mozilla.org.xpi rpm: rpm: Could not canonicalize hostname: nereid no BuildConflicts found checking BR rpm: warning: Macro expanded in comment on line 2468: %{_datadir}/%{name}/browser/extensions/langpack-csb@firefox.mozilla.org.xpi rpm: rpm: warning: Macro expanded in comment on line 2640: %{_datadir}/%{name}/browser/extensions/langpack-ku@firefox.mozilla.org.xpi rpm: rpm: warning: Macro expanded in comment on line 2808: %{_datadir}/%{name}/browser/extensions/langpack-zu@firefox.mozilla.org.xpi rpm: rpm: warning: Could not canonicalize hostname: nereid rpm: Building target platforms: i686-pld-linux rpm: Building for target i686-pld-linux rpm: rpm: RPM build warnings: rpm: Macro expanded in comment on line 2468: %{_datadir}/%{name}/browser/extensions/langpack-csb@firefox.mozilla.org.xpi rpm: rpm: Macro expanded in comment on line 2640: %{_datadir}/%{name}/browser/extensions/langpack-ku@firefox.mozilla.org.xpi rpm: rpm: Macro expanded in comment on line 2808: %{_datadir}/%{name}/browser/extensions/langpack-zu@firefox.mozilla.org.xpi rpm: rpm: Could not canonicalize hostname: nereid no BR needed building RPM using: set -ex; : build-id: a4fad8ff-bb48-4fe7-b0af-8b3c490df604; TMPDIR=/tmp/B.qx2tm3hd/BUILD/tmp exec nice -n 0 rpmbuild -bb --define '__jobs 9' --define '_smp_mflags -j9' --define '_make_opts -Otarget' --define '_pld_builder 1' --define '_topdir /tmp/B.qx2tm3hd' --define '_specdir %{_topdir}' --define '_sourcedir %{_specdir}' --define '_rpmdir %{_topdir}/RPMS' --define '_builddir %{_topdir}/BUILD' --target i686-pld-linux /tmp/B.qx2tm3hd/firefox.spec + : build-id: a4fad8ff-bb48-4fe7-b0af-8b3c490df604 + TMPDIR=/tmp/B.qx2tm3hd/BUILD/tmp + exec nice -n 0 rpmbuild -bb --define '__jobs 9' --define '_smp_mflags -j9' --define '_make_opts -Otarget' --define '_pld_builder 1' --define '_topdir /tmp/B.qx2tm3hd' --define '_specdir %{_topdir}' --define '_sourcedir %{_specdir}' --define '_rpmdir %{_topdir}/RPMS' --define '_builddir %{_topdir}/BUILD' --target i686-pld-linux /tmp/B.qx2tm3hd/firefox.spec warning: Macro expanded in comment on line 2468: %{_datadir}/%{name}/browser/extensions/langpack-csb@firefox.mozilla.org.xpi warning: Macro expanded in comment on line 2640: %{_datadir}/%{name}/browser/extensions/langpack-ku@firefox.mozilla.org.xpi warning: Macro expanded in comment on line 2808: %{_datadir}/%{name}/browser/extensions/langpack-zu@firefox.mozilla.org.xpi warning: Could not canonicalize hostname: nereid Building target platforms: i686-pld-linux Building for target i686-pld-linux Executing(%prep): /bin/sh -e /tmp/B.qx2tm3hd/BUILD/tmp/rpm-tmp.2P03em + umask 022 + cd /tmp/B.qx2tm3hd/BUILD + cd /tmp/B.qx2tm3hd/BUILD + rm -rf firefox-105.0 + /usr/bin/xz -dc /tmp/B.qx2tm3hd/firefox-105.0.source.tar.xz + /bin/tar -xof - + STATUS=0 + '[' 0 -ne 0 ']' + cd firefox-105.0 + unpack -qq /tmp/B.qx2tm3hd/ach.xpi + typeset 'args=-qq' 'file=/tmp/B.qx2tm3hd/ach.xpi' + cp -p /tmp/B.qx2tm3hd/ach.xpi . + STATUS=0 + '[' 0 -ne 0 ']' + unpack -qq /tmp/B.qx2tm3hd/af.xpi + typeset 'args=-qq' 'file=/tmp/B.qx2tm3hd/af.xpi' + cp -p /tmp/B.qx2tm3hd/af.xpi . + STATUS=0 + '[' 0 -ne 0 ']' + unpack -qq /tmp/B.qx2tm3hd/an.xpi + typeset 'args=-qq' 'file=/tmp/B.qx2tm3hd/an.xpi' + cp -p /tmp/B.qx2tm3hd/an.xpi . + STATUS=0 + '[' 0 -ne 0 ']' + unpack -qq /tmp/B.qx2tm3hd/ar.xpi + typeset 'args=-qq' 'file=/tmp/B.qx2tm3hd/ar.xpi' + cp -p /tmp/B.qx2tm3hd/ar.xpi . + STATUS=0 + '[' 0 -ne 0 ']' + unpack -qq /tmp/B.qx2tm3hd/ast.xpi + typeset 'args=-qq' 'file=/tmp/B.qx2tm3hd/ast.xpi' + cp -p /tmp/B.qx2tm3hd/ast.xpi . + STATUS=0 + '[' 0 -ne 0 ']' + unpack -qq /tmp/B.qx2tm3hd/az.xpi + typeset 'args=-qq' 'file=/tmp/B.qx2tm3hd/az.xpi' + cp -p /tmp/B.qx2tm3hd/az.xpi . + STATUS=0 + '[' 0 -ne 0 ']' + unpack -qq /tmp/B.qx2tm3hd/be.xpi + typeset 'args=-qq' 'file=/tmp/B.qx2tm3hd/be.xpi' + cp -p /tmp/B.qx2tm3hd/be.xpi . + STATUS=0 + '[' 0 -ne 0 ']' + unpack -qq /tmp/B.qx2tm3hd/bg.xpi + typeset 'args=-qq' 'file=/tmp/B.qx2tm3hd/bg.xpi' + cp -p /tmp/B.qx2tm3hd/bg.xpi . + STATUS=0 + '[' 0 -ne 0 ']' + unpack -qq /tmp/B.qx2tm3hd/bn.xpi + typeset 'args=-qq' 'file=/tmp/B.qx2tm3hd/bn.xpi' + cp -p /tmp/B.qx2tm3hd/bn.xpi . + STATUS=0 + '[' 0 -ne 0 ']' + unpack -qq /tmp/B.qx2tm3hd/br.xpi + typeset 'args=-qq' 'file=/tmp/B.qx2tm3hd/br.xpi' + cp -p /tmp/B.qx2tm3hd/br.xpi . + STATUS=0 + '[' 0 -ne 0 ']' + unpack -qq /tmp/B.qx2tm3hd/bs.xpi + typeset 'args=-qq' 'file=/tmp/B.qx2tm3hd/bs.xpi' + cp -p /tmp/B.qx2tm3hd/bs.xpi . + STATUS=0 + '[' 0 -ne 0 ']' + unpack -qq /tmp/B.qx2tm3hd/ca.xpi + typeset 'args=-qq' 'file=/tmp/B.qx2tm3hd/ca.xpi' + cp -p /tmp/B.qx2tm3hd/ca.xpi . + STATUS=0 + '[' 0 -ne 0 ']' + unpack -qq /tmp/B.qx2tm3hd/ca-valencia.xpi + typeset 'args=-qq' 'file=/tmp/B.qx2tm3hd/ca-valencia.xpi' + cp -p /tmp/B.qx2tm3hd/ca-valencia.xpi . + STATUS=0 + '[' 0 -ne 0 ']' + unpack -qq /tmp/B.qx2tm3hd/cak.xpi + typeset 'args=-qq' 'file=/tmp/B.qx2tm3hd/cak.xpi' + cp -p /tmp/B.qx2tm3hd/cak.xpi . + STATUS=0 + '[' 0 -ne 0 ']' + unpack -qq /tmp/B.qx2tm3hd/cs.xpi + typeset 'args=-qq' 'file=/tmp/B.qx2tm3hd/cs.xpi' + cp -p /tmp/B.qx2tm3hd/cs.xpi . + STATUS=0 + '[' 0 -ne 0 ']' + unpack -qq /tmp/B.qx2tm3hd/cy.xpi + typeset 'args=-qq' 'file=/tmp/B.qx2tm3hd/cy.xpi' + cp -p /tmp/B.qx2tm3hd/cy.xpi . + STATUS=0 + '[' 0 -ne 0 ']' + unpack -qq /tmp/B.qx2tm3hd/da.xpi + typeset 'args=-qq' 'file=/tmp/B.qx2tm3hd/da.xpi' + cp -p /tmp/B.qx2tm3hd/da.xpi . + STATUS=0 + '[' 0 -ne 0 ']' + unpack -qq /tmp/B.qx2tm3hd/de.xpi + typeset 'args=-qq' 'file=/tmp/B.qx2tm3hd/de.xpi' + cp -p /tmp/B.qx2tm3hd/de.xpi . + STATUS=0 + '[' 0 -ne 0 ']' + unpack -qq /tmp/B.qx2tm3hd/dsb.xpi + typeset 'args=-qq' 'file=/tmp/B.qx2tm3hd/dsb.xpi' + cp -p /tmp/B.qx2tm3hd/dsb.xpi . + STATUS=0 + '[' 0 -ne 0 ']' + unpack -qq /tmp/B.qx2tm3hd/el.xpi + typeset 'args=-qq' 'file=/tmp/B.qx2tm3hd/el.xpi' + cp -p /tmp/B.qx2tm3hd/el.xpi . + STATUS=0 + '[' 0 -ne 0 ']' + unpack -qq /tmp/B.qx2tm3hd/en-CA.xpi + typeset 'args=-qq' 'file=/tmp/B.qx2tm3hd/en-CA.xpi' + cp -p /tmp/B.qx2tm3hd/en-CA.xpi . + STATUS=0 + '[' 0 -ne 0 ']' + unpack -qq /tmp/B.qx2tm3hd/en-GB.xpi + typeset 'args=-qq' 'file=/tmp/B.qx2tm3hd/en-GB.xpi' + cp -p /tmp/B.qx2tm3hd/en-GB.xpi . + STATUS=0 + '[' 0 -ne 0 ']' + unpack -qq /tmp/B.qx2tm3hd/en-US.xpi + typeset 'args=-qq' 'file=/tmp/B.qx2tm3hd/en-US.xpi' + cp -p /tmp/B.qx2tm3hd/en-US.xpi . + STATUS=0 + '[' 0 -ne 0 ']' + unpack -qq /tmp/B.qx2tm3hd/eo.xpi + typeset 'args=-qq' 'file=/tmp/B.qx2tm3hd/eo.xpi' + cp -p /tmp/B.qx2tm3hd/eo.xpi . + STATUS=0 + '[' 0 -ne 0 ']' + unpack -qq /tmp/B.qx2tm3hd/es-AR.xpi + typeset 'args=-qq' 'file=/tmp/B.qx2tm3hd/es-AR.xpi' + cp -p /tmp/B.qx2tm3hd/es-AR.xpi . + STATUS=0 + '[' 0 -ne 0 ']' + unpack -qq /tmp/B.qx2tm3hd/es-CL.xpi + typeset 'args=-qq' 'file=/tmp/B.qx2tm3hd/es-CL.xpi' + cp -p /tmp/B.qx2tm3hd/es-CL.xpi . + STATUS=0 + '[' 0 -ne 0 ']' + unpack -qq /tmp/B.qx2tm3hd/es-ES.xpi + typeset 'args=-qq' 'file=/tmp/B.qx2tm3hd/es-ES.xpi' + cp -p /tmp/B.qx2tm3hd/es-ES.xpi . + STATUS=0 + '[' 0 -ne 0 ']' + unpack -qq /tmp/B.qx2tm3hd/es-MX.xpi + typeset 'args=-qq' 'file=/tmp/B.qx2tm3hd/es-MX.xpi' + cp -p /tmp/B.qx2tm3hd/es-MX.xpi . + STATUS=0 + '[' 0 -ne 0 ']' + unpack -qq /tmp/B.qx2tm3hd/et.xpi + typeset 'args=-qq' 'file=/tmp/B.qx2tm3hd/et.xpi' + cp -p /tmp/B.qx2tm3hd/et.xpi . + STATUS=0 + '[' 0 -ne 0 ']' + unpack -qq /tmp/B.qx2tm3hd/eu.xpi + typeset 'args=-qq' 'file=/tmp/B.qx2tm3hd/eu.xpi' + cp -p /tmp/B.qx2tm3hd/eu.xpi . + STATUS=0 + '[' 0 -ne 0 ']' + unpack -qq /tmp/B.qx2tm3hd/fa.xpi + typeset 'args=-qq' 'file=/tmp/B.qx2tm3hd/fa.xpi' + cp -p /tmp/B.qx2tm3hd/fa.xpi . + STATUS=0 + '[' 0 -ne 0 ']' + unpack -qq /tmp/B.qx2tm3hd/ff.xpi + typeset 'args=-qq' 'file=/tmp/B.qx2tm3hd/ff.xpi' + cp -p /tmp/B.qx2tm3hd/ff.xpi . + STATUS=0 + '[' 0 -ne 0 ']' + unpack -qq /tmp/B.qx2tm3hd/fi.xpi + typeset 'args=-qq' 'file=/tmp/B.qx2tm3hd/fi.xpi' + cp -p /tmp/B.qx2tm3hd/fi.xpi . + STATUS=0 + '[' 0 -ne 0 ']' + unpack -qq /tmp/B.qx2tm3hd/fr.xpi + typeset 'args=-qq' 'file=/tmp/B.qx2tm3hd/fr.xpi' + cp -p /tmp/B.qx2tm3hd/fr.xpi . + STATUS=0 + '[' 0 -ne 0 ']' + unpack -qq /tmp/B.qx2tm3hd/fy-NL.xpi + typeset 'args=-qq' 'file=/tmp/B.qx2tm3hd/fy-NL.xpi' + cp -p /tmp/B.qx2tm3hd/fy-NL.xpi . + STATUS=0 + '[' 0 -ne 0 ']' + unpack -qq /tmp/B.qx2tm3hd/ga-IE.xpi + typeset 'args=-qq' 'file=/tmp/B.qx2tm3hd/ga-IE.xpi' + cp -p /tmp/B.qx2tm3hd/ga-IE.xpi . + STATUS=0 + '[' 0 -ne 0 ']' + unpack -qq /tmp/B.qx2tm3hd/gd.xpi + typeset 'args=-qq' 'file=/tmp/B.qx2tm3hd/gd.xpi' + cp -p /tmp/B.qx2tm3hd/gd.xpi . + STATUS=0 + '[' 0 -ne 0 ']' + unpack -qq /tmp/B.qx2tm3hd/gl.xpi + typeset 'args=-qq' 'file=/tmp/B.qx2tm3hd/gl.xpi' + cp -p /tmp/B.qx2tm3hd/gl.xpi . + STATUS=0 + '[' 0 -ne 0 ']' + unpack -qq /tmp/B.qx2tm3hd/gn.xpi + typeset 'args=-qq' 'file=/tmp/B.qx2tm3hd/gn.xpi' + cp -p /tmp/B.qx2tm3hd/gn.xpi . + STATUS=0 + '[' 0 -ne 0 ']' + unpack -qq /tmp/B.qx2tm3hd/gu-IN.xpi + typeset 'args=-qq' 'file=/tmp/B.qx2tm3hd/gu-IN.xpi' + cp -p /tmp/B.qx2tm3hd/gu-IN.xpi . + STATUS=0 + '[' 0 -ne 0 ']' + unpack -qq /tmp/B.qx2tm3hd/he.xpi + typeset 'args=-qq' 'file=/tmp/B.qx2tm3hd/he.xpi' + cp -p /tmp/B.qx2tm3hd/he.xpi . + STATUS=0 + '[' 0 -ne 0 ']' + unpack -qq /tmp/B.qx2tm3hd/hi-IN.xpi + typeset 'args=-qq' 'file=/tmp/B.qx2tm3hd/hi-IN.xpi' + cp -p /tmp/B.qx2tm3hd/hi-IN.xpi . + STATUS=0 + '[' 0 -ne 0 ']' + unpack -qq /tmp/B.qx2tm3hd/hr.xpi + typeset 'args=-qq' 'file=/tmp/B.qx2tm3hd/hr.xpi' + cp -p /tmp/B.qx2tm3hd/hr.xpi . + STATUS=0 + '[' 0 -ne 0 ']' + unpack -qq /tmp/B.qx2tm3hd/hsb.xpi + typeset 'args=-qq' 'file=/tmp/B.qx2tm3hd/hsb.xpi' + cp -p /tmp/B.qx2tm3hd/hsb.xpi . + STATUS=0 + '[' 0 -ne 0 ']' + unpack -qq /tmp/B.qx2tm3hd/hu.xpi + typeset 'args=-qq' 'file=/tmp/B.qx2tm3hd/hu.xpi' + cp -p /tmp/B.qx2tm3hd/hu.xpi . + STATUS=0 + '[' 0 -ne 0 ']' + unpack -qq /tmp/B.qx2tm3hd/hy-AM.xpi + typeset 'args=-qq' 'file=/tmp/B.qx2tm3hd/hy-AM.xpi' + cp -p /tmp/B.qx2tm3hd/hy-AM.xpi . + STATUS=0 + '[' 0 -ne 0 ']' + unpack -qq /tmp/B.qx2tm3hd/ia.xpi + typeset 'args=-qq' 'file=/tmp/B.qx2tm3hd/ia.xpi' + cp -p /tmp/B.qx2tm3hd/ia.xpi . + STATUS=0 + '[' 0 -ne 0 ']' + unpack -qq /tmp/B.qx2tm3hd/id.xpi + typeset 'args=-qq' 'file=/tmp/B.qx2tm3hd/id.xpi' + cp -p /tmp/B.qx2tm3hd/id.xpi . + STATUS=0 + '[' 0 -ne 0 ']' + unpack -qq /tmp/B.qx2tm3hd/is.xpi + typeset 'args=-qq' 'file=/tmp/B.qx2tm3hd/is.xpi' + cp -p /tmp/B.qx2tm3hd/is.xpi . + STATUS=0 + '[' 0 -ne 0 ']' + unpack -qq /tmp/B.qx2tm3hd/it.xpi + typeset 'args=-qq' 'file=/tmp/B.qx2tm3hd/it.xpi' + cp -p /tmp/B.qx2tm3hd/it.xpi . + STATUS=0 + '[' 0 -ne 0 ']' + unpack -qq /tmp/B.qx2tm3hd/ja.xpi + typeset 'args=-qq' 'file=/tmp/B.qx2tm3hd/ja.xpi' + cp -p /tmp/B.qx2tm3hd/ja.xpi . + STATUS=0 + '[' 0 -ne 0 ']' + unpack -qq /tmp/B.qx2tm3hd/ka.xpi + typeset 'args=-qq' 'file=/tmp/B.qx2tm3hd/ka.xpi' + cp -p /tmp/B.qx2tm3hd/ka.xpi . + STATUS=0 + '[' 0 -ne 0 ']' + unpack -qq /tmp/B.qx2tm3hd/kab.xpi + typeset 'args=-qq' 'file=/tmp/B.qx2tm3hd/kab.xpi' + cp -p /tmp/B.qx2tm3hd/kab.xpi . + STATUS=0 + '[' 0 -ne 0 ']' + unpack -qq /tmp/B.qx2tm3hd/kk.xpi + typeset 'args=-qq' 'file=/tmp/B.qx2tm3hd/kk.xpi' + cp -p /tmp/B.qx2tm3hd/kk.xpi . + STATUS=0 + '[' 0 -ne 0 ']' + unpack -qq /tmp/B.qx2tm3hd/km.xpi + typeset 'args=-qq' 'file=/tmp/B.qx2tm3hd/km.xpi' + cp -p /tmp/B.qx2tm3hd/km.xpi . + STATUS=0 + '[' 0 -ne 0 ']' + unpack -qq /tmp/B.qx2tm3hd/kn.xpi + typeset 'args=-qq' 'file=/tmp/B.qx2tm3hd/kn.xpi' + cp -p /tmp/B.qx2tm3hd/kn.xpi . + STATUS=0 + '[' 0 -ne 0 ']' + unpack -qq /tmp/B.qx2tm3hd/ko.xpi + typeset 'args=-qq' 'file=/tmp/B.qx2tm3hd/ko.xpi' + cp -p /tmp/B.qx2tm3hd/ko.xpi . + STATUS=0 + '[' 0 -ne 0 ']' + unpack -qq /tmp/B.qx2tm3hd/lij.xpi + typeset 'args=-qq' 'file=/tmp/B.qx2tm3hd/lij.xpi' + cp -p /tmp/B.qx2tm3hd/lij.xpi . + STATUS=0 + '[' 0 -ne 0 ']' + unpack -qq /tmp/B.qx2tm3hd/lt.xpi + typeset 'args=-qq' 'file=/tmp/B.qx2tm3hd/lt.xpi' + cp -p /tmp/B.qx2tm3hd/lt.xpi . + STATUS=0 + '[' 0 -ne 0 ']' + unpack -qq /tmp/B.qx2tm3hd/lv.xpi + typeset 'args=-qq' 'file=/tmp/B.qx2tm3hd/lv.xpi' + cp -p /tmp/B.qx2tm3hd/lv.xpi . + STATUS=0 + '[' 0 -ne 0 ']' + unpack -qq /tmp/B.qx2tm3hd/mk.xpi + typeset 'args=-qq' 'file=/tmp/B.qx2tm3hd/mk.xpi' + cp -p /tmp/B.qx2tm3hd/mk.xpi . + STATUS=0 + '[' 0 -ne 0 ']' + unpack -qq /tmp/B.qx2tm3hd/mr.xpi + typeset 'args=-qq' 'file=/tmp/B.qx2tm3hd/mr.xpi' + cp -p /tmp/B.qx2tm3hd/mr.xpi . + STATUS=0 + '[' 0 -ne 0 ']' + unpack -qq /tmp/B.qx2tm3hd/ms.xpi + typeset 'args=-qq' 'file=/tmp/B.qx2tm3hd/ms.xpi' + cp -p /tmp/B.qx2tm3hd/ms.xpi . + STATUS=0 + '[' 0 -ne 0 ']' + unpack -qq /tmp/B.qx2tm3hd/my.xpi + typeset 'args=-qq' 'file=/tmp/B.qx2tm3hd/my.xpi' + cp -p /tmp/B.qx2tm3hd/my.xpi . + STATUS=0 + '[' 0 -ne 0 ']' + unpack -qq /tmp/B.qx2tm3hd/nb-NO.xpi + typeset 'args=-qq' 'file=/tmp/B.qx2tm3hd/nb-NO.xpi' + cp -p /tmp/B.qx2tm3hd/nb-NO.xpi . + STATUS=0 + '[' 0 -ne 0 ']' + unpack -qq /tmp/B.qx2tm3hd/ne-NP.xpi + typeset 'args=-qq' 'file=/tmp/B.qx2tm3hd/ne-NP.xpi' + cp -p /tmp/B.qx2tm3hd/ne-NP.xpi . + STATUS=0 + '[' 0 -ne 0 ']' + unpack -qq /tmp/B.qx2tm3hd/nl.xpi + typeset 'args=-qq' 'file=/tmp/B.qx2tm3hd/nl.xpi' + cp -p /tmp/B.qx2tm3hd/nl.xpi . + STATUS=0 + '[' 0 -ne 0 ']' + unpack -qq /tmp/B.qx2tm3hd/nn-NO.xpi + typeset 'args=-qq' 'file=/tmp/B.qx2tm3hd/nn-NO.xpi' + cp -p /tmp/B.qx2tm3hd/nn-NO.xpi . + STATUS=0 + '[' 0 -ne 0 ']' + unpack -qq /tmp/B.qx2tm3hd/oc.xpi + typeset 'args=-qq' 'file=/tmp/B.qx2tm3hd/oc.xpi' + cp -p /tmp/B.qx2tm3hd/oc.xpi . + STATUS=0 + '[' 0 -ne 0 ']' + unpack -qq /tmp/B.qx2tm3hd/pa-IN.xpi + typeset 'args=-qq' 'file=/tmp/B.qx2tm3hd/pa-IN.xpi' + cp -p /tmp/B.qx2tm3hd/pa-IN.xpi . + STATUS=0 + '[' 0 -ne 0 ']' + unpack -qq /tmp/B.qx2tm3hd/pl.xpi + typeset 'args=-qq' 'file=/tmp/B.qx2tm3hd/pl.xpi' + cp -p /tmp/B.qx2tm3hd/pl.xpi . + STATUS=0 + '[' 0 -ne 0 ']' + unpack -qq /tmp/B.qx2tm3hd/pt-BR.xpi + typeset 'args=-qq' 'file=/tmp/B.qx2tm3hd/pt-BR.xpi' + cp -p /tmp/B.qx2tm3hd/pt-BR.xpi . + STATUS=0 + '[' 0 -ne 0 ']' + unpack -qq /tmp/B.qx2tm3hd/pt-PT.xpi + typeset 'args=-qq' 'file=/tmp/B.qx2tm3hd/pt-PT.xpi' + cp -p /tmp/B.qx2tm3hd/pt-PT.xpi . + STATUS=0 + '[' 0 -ne 0 ']' + unpack -qq /tmp/B.qx2tm3hd/rm.xpi + typeset 'args=-qq' 'file=/tmp/B.qx2tm3hd/rm.xpi' + cp -p /tmp/B.qx2tm3hd/rm.xpi . + STATUS=0 + '[' 0 -ne 0 ']' + unpack -qq /tmp/B.qx2tm3hd/ro.xpi + typeset 'args=-qq' 'file=/tmp/B.qx2tm3hd/ro.xpi' + cp -p /tmp/B.qx2tm3hd/ro.xpi . + STATUS=0 + '[' 0 -ne 0 ']' + unpack -qq /tmp/B.qx2tm3hd/ru.xpi + typeset 'args=-qq' 'file=/tmp/B.qx2tm3hd/ru.xpi' + cp -p /tmp/B.qx2tm3hd/ru.xpi . + STATUS=0 + '[' 0 -ne 0 ']' + unpack -qq /tmp/B.qx2tm3hd/sco.xpi + typeset 'args=-qq' 'file=/tmp/B.qx2tm3hd/sco.xpi' + cp -p /tmp/B.qx2tm3hd/sco.xpi . + STATUS=0 + '[' 0 -ne 0 ']' + unpack -qq /tmp/B.qx2tm3hd/si.xpi + typeset 'args=-qq' 'file=/tmp/B.qx2tm3hd/si.xpi' + cp -p /tmp/B.qx2tm3hd/si.xpi . + STATUS=0 + '[' 0 -ne 0 ']' + unpack -qq /tmp/B.qx2tm3hd/sk.xpi + typeset 'args=-qq' 'file=/tmp/B.qx2tm3hd/sk.xpi' + cp -p /tmp/B.qx2tm3hd/sk.xpi . + STATUS=0 + '[' 0 -ne 0 ']' + unpack -qq /tmp/B.qx2tm3hd/sl.xpi + typeset 'args=-qq' 'file=/tmp/B.qx2tm3hd/sl.xpi' + cp -p /tmp/B.qx2tm3hd/sl.xpi . + STATUS=0 + '[' 0 -ne 0 ']' + unpack -qq /tmp/B.qx2tm3hd/son.xpi + typeset 'args=-qq' 'file=/tmp/B.qx2tm3hd/son.xpi' + cp -p /tmp/B.qx2tm3hd/son.xpi . + STATUS=0 + '[' 0 -ne 0 ']' + unpack -qq /tmp/B.qx2tm3hd/sq.xpi + typeset 'args=-qq' 'file=/tmp/B.qx2tm3hd/sq.xpi' + cp -p /tmp/B.qx2tm3hd/sq.xpi . + STATUS=0 + '[' 0 -ne 0 ']' + unpack -qq /tmp/B.qx2tm3hd/sr.xpi + typeset 'args=-qq' 'file=/tmp/B.qx2tm3hd/sr.xpi' + cp -p /tmp/B.qx2tm3hd/sr.xpi . + STATUS=0 + '[' 0 -ne 0 ']' + unpack -qq /tmp/B.qx2tm3hd/sv-SE.xpi + typeset 'args=-qq' 'file=/tmp/B.qx2tm3hd/sv-SE.xpi' + cp -p /tmp/B.qx2tm3hd/sv-SE.xpi . + STATUS=0 + '[' 0 -ne 0 ']' + unpack -qq /tmp/B.qx2tm3hd/szl.xpi + typeset 'args=-qq' 'file=/tmp/B.qx2tm3hd/szl.xpi' + cp -p /tmp/B.qx2tm3hd/szl.xpi . + STATUS=0 + '[' 0 -ne 0 ']' + unpack -qq /tmp/B.qx2tm3hd/ta.xpi + typeset 'args=-qq' 'file=/tmp/B.qx2tm3hd/ta.xpi' + cp -p /tmp/B.qx2tm3hd/ta.xpi . + STATUS=0 + '[' 0 -ne 0 ']' + unpack -qq /tmp/B.qx2tm3hd/te.xpi + typeset 'args=-qq' 'file=/tmp/B.qx2tm3hd/te.xpi' + cp -p /tmp/B.qx2tm3hd/te.xpi . + STATUS=0 + '[' 0 -ne 0 ']' + unpack -qq /tmp/B.qx2tm3hd/th.xpi + typeset 'args=-qq' 'file=/tmp/B.qx2tm3hd/th.xpi' + cp -p /tmp/B.qx2tm3hd/th.xpi . + STATUS=0 + '[' 0 -ne 0 ']' + unpack -qq /tmp/B.qx2tm3hd/tl.xpi + typeset 'args=-qq' 'file=/tmp/B.qx2tm3hd/tl.xpi' + cp -p /tmp/B.qx2tm3hd/tl.xpi . + STATUS=0 + '[' 0 -ne 0 ']' + unpack -qq /tmp/B.qx2tm3hd/tr.xpi + typeset 'args=-qq' 'file=/tmp/B.qx2tm3hd/tr.xpi' + cp -p /tmp/B.qx2tm3hd/tr.xpi . + STATUS=0 + '[' 0 -ne 0 ']' + unpack -qq /tmp/B.qx2tm3hd/trs.xpi + typeset 'args=-qq' 'file=/tmp/B.qx2tm3hd/trs.xpi' + cp -p /tmp/B.qx2tm3hd/trs.xpi . + STATUS=0 + '[' 0 -ne 0 ']' + unpack -qq /tmp/B.qx2tm3hd/uk.xpi + typeset 'args=-qq' 'file=/tmp/B.qx2tm3hd/uk.xpi' + cp -p /tmp/B.qx2tm3hd/uk.xpi . + STATUS=0 + '[' 0 -ne 0 ']' + unpack -qq /tmp/B.qx2tm3hd/ur.xpi + typeset 'args=-qq' 'file=/tmp/B.qx2tm3hd/ur.xpi' + cp -p /tmp/B.qx2tm3hd/ur.xpi . + STATUS=0 + '[' 0 -ne 0 ']' + unpack -qq /tmp/B.qx2tm3hd/uz.xpi + typeset 'args=-qq' 'file=/tmp/B.qx2tm3hd/uz.xpi' + cp -p /tmp/B.qx2tm3hd/uz.xpi . + STATUS=0 + '[' 0 -ne 0 ']' + unpack -qq /tmp/B.qx2tm3hd/vi.xpi + typeset 'args=-qq' 'file=/tmp/B.qx2tm3hd/vi.xpi' + cp -p /tmp/B.qx2tm3hd/vi.xpi . + STATUS=0 + '[' 0 -ne 0 ']' + unpack -qq /tmp/B.qx2tm3hd/xh.xpi + typeset 'args=-qq' 'file=/tmp/B.qx2tm3hd/xh.xpi' + cp -p /tmp/B.qx2tm3hd/xh.xpi . + STATUS=0 + '[' 0 -ne 0 ']' + unpack -qq /tmp/B.qx2tm3hd/zh-CN.xpi + typeset 'args=-qq' 'file=/tmp/B.qx2tm3hd/zh-CN.xpi' + cp -p /tmp/B.qx2tm3hd/zh-CN.xpi . + STATUS=0 + '[' 0 -ne 0 ']' + unpack -qq /tmp/B.qx2tm3hd/zh-TW.xpi + typeset 'args=-qq' 'file=/tmp/B.qx2tm3hd/zh-TW.xpi' + cp -p /tmp/B.qx2tm3hd/zh-TW.xpi . + STATUS=0 + '[' 0 -ne 0 ']' + /bin/chmod -Rf a+rX,u+w,g-w,o-w . + echo 'Patch #4 (firefox-prefs.patch):' Patch #4 (firefox-prefs.patch): + </tmp/B.qx2tm3hd/firefox-prefs.patch + /usr/bin/patch -s -f -p1 '--fuzz=0' + echo 'Patch #5 (firefox-pld-bookmarks.patch):' Patch #5 (firefox-pld-bookmarks.patch): + </tmp/B.qx2tm3hd/firefox-pld-bookmarks.patch + /usr/bin/patch -s -f -p1 '--fuzz=0' + echo 'Patch #6 (firefox-no-subshell.patch):' Patch #6 (firefox-no-subshell.patch): + </tmp/B.qx2tm3hd/firefox-no-subshell.patch + /usr/bin/patch -s -f -p2 '--fuzz=0' + echo 'Patch #7 (firefox-middle_click_paste.patch):' Patch #7 (firefox-middle_click_paste.patch): + </tmp/B.qx2tm3hd/firefox-middle_click_paste.patch + /usr/bin/patch -s -f -p1 '--fuzz=0' + echo 'Patch #8 (firefox-system-virtualenv.patch):' Patch #8 (firefox-system-virtualenv.patch): + </tmp/B.qx2tm3hd/firefox-system-virtualenv.patch + /usr/bin/patch -s -f -p1 '--fuzz=0' + echo 'Patch #9 (firefox-Disable-Firefox-Health-Report.patch):' Patch #9 (firefox-Disable-Firefox-Health-Report.patch): + </tmp/B.qx2tm3hd/firefox-Disable-Firefox-Health-Report.patch + /usr/bin/patch -s -f -p1 '--fuzz=0' + RPM_EC=0 + jobs -p + exit 0 Executing(%build): /bin/sh -e /tmp/B.qx2tm3hd/BUILD/tmp/rpm-tmp.vD8ieZ TMP=/home/users/builder/tmp HOME=/home/users/builder PATH=/home/users/builder/GNUstep/Tools:/bin:/usr/bin:/usr/local/bin:/home/users/builder/bin TMPDIR=/tmp/B.qx2tm3hd/BUILD/tmp + umask 022 + cd /tmp/B.qx2tm3hd/BUILD + cd firefox-105.0 + cp -p /usr/share/automake/config.guess /usr/share/automake/config.sub build/autoconf + <<"EOF" . $topsrcdir/browser/config/mozconfig export CC="clang" export CXX="clang++" export LLVM_PROFDATA="llvm-profdata" export AR="llvm-ar" export NM="llvm-nm" export RANLIB="llvm-ranlib" export CFLAGS="-O2 -fwrapv -pipe -Wformat -Werror=format-security -Wp,-D_FORTIFY_SOURCE=2 -fstack-protector-strong --param=ssp-buffer-size=4 -Werror=trampolines -fomit-frame-pointer -march=i686 -fasynchronous-unwind-tables -mtune=pentium4 -D_FILE_OFFSET_BITS=64" export CXXFLAGS="-O2 -fwrapv -pipe -Wformat -Werror=format-security -Wp,-D_FORTIFY_SOURCE=2 -fstack-protector-strong --param=ssp-buffer-size=4 -Werror=trampolines -fomit-frame-pointer -march=i686 -fasynchronous-unwind-tables -mtune=pentium4 -mmmx -D_FILE_OFFSET_BITS=64" export CFLAGS="$CFLAGS -g0" export CXXFLAGS="$CXXFLAGS -g0" export MOZ_DEBUG_FLAGS=" " export LLVM_USE_SPLIT_DWARF=1 export LLVM_PARALLEL_LINK_JOBS=1 export MOZ_LINK_FLAGS="-Wl,--no-keep-memory -Wl,--reduce-memory-overheads" export RUSTFLAGS="-Cdebuginfo=0" mk_add_options MOZ_OBJDIR=@TOPSRCDIR@/obj-i686 # Options for 'configure' (same as command-line options). ac_add_options --host=i686-pld-linux ac_add_options --prefix=/usr ac_add_options --disable-debug ac_add_options --disable-strip ac_add_options --disable-install-strip ac_add_options --disable-tests ac_add_options --disable-crashreporter ac_add_options --disable-necko-wifi ac_add_options --disable-updater ac_add_options --enable-alsa ac_add_options --enable-chrome-format=omni ac_add_options --enable-default-toolkit=cairo-gtk3-wayland ac_add_options --enable-geckodriver ac_add_options --enable-linker=gold ac_add_options --disable-elf-hack ac_add_options --enable-linker=lld ac_add_options --enable-system-ffi ac_add_options --enable-official-branding ac_add_options --with-distribution-id=org.pld-linux ac_add_options --with-system-icu ac_add_options --with-system-jpeg ac_add_options --with-system-libevent ac_add_options --with-system-libvpx ac_add_options --with-system-nspr ac_add_options --with-system-nss ac_add_options --with-system-pixman ac_add_options --with-system-png ac_add_options --with-system-webp ac_add_options --with-system-zlib ac_add_options --without-wasm-sandboxed-libraries EOF + >.mozconfig + cat + export 'MOZ_PARALLEL_BUILD=9' + export 'MOZ_SERVICES_SYNC=1' + pwd + export 'MOZBUILD_STATE_PATH=/tmp/B.qx2tm3hd/BUILD/firefox-105.0/.mozbuild' + export 'MACH_SYSTEM_ASSERTED_COMPATIBLE_WITH_BUILD_SITE=1' + export 'MACH_SYSTEM_ASSERTED_COMPATIBLE_WITH_MACH_SITE=1' + AUTOCONF=/usr/bin/autoconf2_13 MACH_BUILD_PYTHON_NATIVE_PACKAGE_SOURCE=none ./mach build created virtual environment CPython3.10.7.final.0-32 in 112ms creator CPython3Posix(dest=/tmp/B.qx2tm3hd/BUILD/firefox-105.0/obj-i686/_virtualenvs/build, clear=False, no_vcs_ignore=False, global=False) activators BashActivator,CShellActivator,FishActivator,NushellActivator,PowerShellActivator,PythonActivator Creating global state directory from environment variable: /tmp/B.qx2tm3hd/BUILD/firefox-105.0/.mozbuild 0:02.28 Clobber not needed. 0:02.62 Using Python 3.10.7 from /tmp/B.qx2tm3hd/BUILD/firefox-105.0/obj-i686/_virtualenvs/build/bin/python 0:02.62 Adding configure options from /tmp/B.qx2tm3hd/BUILD/firefox-105.0/.mozconfig 0:02.62 --enable-application=browser 0:02.62 --host=i686-pld-linux 0:02.62 --prefix=/usr 0:02.62 --disable-debug 0:02.62 --disable-strip 0:02.63 --disable-install-strip 0:02.63 --disable-tests 0:02.63 --disable-crashreporter 0:02.63 --disable-necko-wifi 0:02.63 --disable-updater 0:02.63 --enable-alsa 0:02.63 --enable-chrome-format=omni 0:02.63 --enable-default-toolkit=cairo-gtk3-wayland 0:02.63 --enable-geckodriver 0:02.63 --enable-linker=gold 0:02.63 --disable-elf-hack 0:02.63 --enable-linker=lld 0:02.63 --enable-system-ffi 0:02.63 --enable-official-branding 0:02.63 --with-distribution-id=org.pld-linux 0:02.63 --with-system-icu 0:02.63 --with-system-jpeg 0:02.63 --with-system-libevent 0:02.63 --with-system-libvpx 0:02.63 --with-system-nspr 0:02.63 --with-system-nss 0:02.63 --with-system-pixman 0:02.63 --with-system-png 0:02.63 --with-system-webp 0:02.63 --with-system-zlib 0:02.63 --without-wasm-sandboxed-libraries 0:02.63 CC=clang 0:02.63 RUSTFLAGS=-Cdebuginfo=0 0:02.63 RANLIB=llvm-ranlib 0:02.63 LLVM_PROFDATA=llvm-profdata 0:02.63 LLVM_PARALLEL_LINK_JOBS=1 0:02.63 AR=llvm-ar 0:02.63 NM=llvm-nm 0:02.63 LLVM_USE_SPLIT_DWARF=1 0:02.63 CFLAGS=-O2 -fwrapv -pipe -Wformat -Werror=format-security -Wp,-D_FORTIFY_SOURCE=2 -fstack-protector-strong --param=ssp-buffer-size=4 -Werror=trampolines -fomit-frame-pointer -march=i686 -fasynchronous-unwind-tables -mtune=pentium4 -D_FILE_OFFSET_BITS=64 -g0 0:02.63 CXXFLAGS=-O2 -fwrapv -pipe -Wformat -Werror=format-security -Wp,-D_FORTIFY_SOURCE=2 -fstack-protector-strong --param=ssp-buffer-size=4 -Werror=trampolines -fomit-frame-pointer -march=i686 -fasynchronous-unwind-tables -mtune=pentium4 -mmmx -D_FILE_OFFSET_BITS=64 -g0 0:02.63 MOZ_LINK_FLAGS=-Wl,--no-keep-memory -Wl,--reduce-memory-overheads 0:02.63 MOZ_DEBUG_FLAGS= 0:02.63 CXX=clang++ 0:02.63 RANDOM=6123 0:02.63 EPOCHREALTIME=1663710296.530495 0:02.63 checking for vcs source checkout... no 0:02.70 checking for a shell... /bin/sh 0:02.72 checking for host system type... i686-pld-linux-gnu 0:02.72 checking for target system type... i686-pld-linux-gnu 0:03.41 checking whether cross compiling... no 0:03.81 checking for Python 3... /tmp/B.qx2tm3hd/BUILD/firefox-105.0/obj-i686/_virtualenvs/build/bin/python (3.10.7) 0:03.81 checking for wget... /usr/bin/wget 0:03.82 checking for ccache... not found 0:03.82 checking for the target C compiler... /usr/bin/clang 0:03.91 checking whether the target C compiler can be used... yes 0:03.91 checking the target C compiler version... 14.0.6 0:03.95 checking the target C compiler works... yes 0:03.95 checking for the target C++ compiler... /usr/bin/clang++ 0:04.04 checking whether the target C++ compiler can be used... yes 0:04.04 checking the target C++ compiler version... 14.0.6 0:04.08 checking the target C++ compiler works... yes 0:04.08 checking for the host C compiler... /usr/bin/clang 0:04.16 checking whether the host C compiler can be used... yes 0:04.16 checking the host C compiler version... 14.0.6 0:04.20 checking the host C compiler works... yes 0:04.20 checking for the host C++ compiler... /usr/bin/clang++ 0:04.28 checking whether the host C++ compiler can be used... yes 0:04.29 checking the host C++ compiler version... 14.0.6 0:04.33 checking the host C++ compiler works... yes 0:04.38 checking for linker... lld 0:04.43 checking for 64-bit OS... no 0:04.49 checking for new enough STL headers from libstdc++... yes 0:04.49 checking for the assembler... /usr/bin/clang 0:04.53 checking for ar... /usr/bin/llvm-ar 0:04.56 checking for nm... /usr/bin/llvm-nm 0:04.56 checking for pkg_config... /usr/bin/pkg-config 0:04.56 checking for pkg-config version... 0.29.2 0:04.57 checking whether pkg-config is pkgconf... no 0:04.68 checking for strndup... yes 0:04.80 checking for posix_memalign... yes 0:04.92 checking for memalign... yes 0:05.03 checking for malloc_usable_size... yes 0:05.08 checking for stdint.h... yes 0:05.12 checking for inttypes.h... yes 0:05.17 checking for malloc.h... yes 0:05.22 checking for alloca.h... yes 0:05.26 checking for sys/byteorder.h... no 0:05.30 checking for getopt.h... yes 0:05.35 checking for unistd.h... yes 0:05.40 checking for nl_types.h... yes 0:05.44 checking for cpuid.h... yes 0:05.49 checking for fts.h... yes 0:05.53 checking for sys/statvfs.h... yes 0:05.58 checking for sys/statfs.h... yes 0:05.62 checking for sys/vfs.h... yes 0:05.67 checking for sys/mount.h... yes 0:05.73 checking for sys/quota.h... yes 0:05.78 checking for linux/quota.h... yes 0:05.84 checking for linux/if_addr.h... yes 0:05.89 checking for linux/rtnetlink.h... yes 0:05.93 checking for sys/queue.h... yes 0:05.98 checking for sys/types.h... yes 0:06.04 checking for netinet/in.h... yes 0:06.08 checking for byteswap.h... yes 0:06.13 checking for memfd_create in sys/mman.h... yes 0:06.18 checking for linux/perf_event.h... yes 0:06.22 checking for perf_event_open system call... yes 0:06.27 checking whether the C compiler supports -Wbitfield-enum-conversion... yes 0:06.31 checking whether the C++ compiler supports -Wbitfield-enum-conversion... yes 0:06.35 checking whether the C++ compiler supports -Wdeprecated-this-capture... yes 0:06.39 checking whether the C compiler supports -Wformat-type-confusion... yes 0:06.43 checking whether the C++ compiler supports -Wformat-type-confusion... yes 0:06.47 checking whether the C compiler supports -Wshadow-field-in-constructor-modified... yes 0:06.51 checking whether the C++ compiler supports -Wshadow-field-in-constructor-modified... yes 0:06.56 checking whether the C compiler supports -Wno-error=tautological-type-limit-compare... yes 0:06.60 checking whether the C++ compiler supports -Wno-error=tautological-type-limit-compare... yes 0:06.64 checking whether the C compiler supports -Wunreachable-code-return... yes 0:06.68 checking whether the C++ compiler supports -Wunreachable-code-return... yes 0:06.72 checking whether the C compiler supports -Wunused-but-set-parameter... yes 0:06.77 checking whether the C++ compiler supports -Wunused-but-set-parameter... yes 0:06.81 checking whether the C compiler supports -Wclass-varargs... yes 0:06.85 checking whether the C++ compiler supports -Wclass-varargs... yes 0:06.89 checking whether the C++ compiler supports -Wempty-init-stmt... yes 0:06.93 checking whether the C compiler supports -Wfloat-overflow-conversion... yes 0:06.98 checking whether the C++ compiler supports -Wfloat-overflow-conversion... yes 0:07.02 checking whether the C compiler supports -Wfloat-zero-conversion... yes 0:07.06 checking whether the C++ compiler supports -Wfloat-zero-conversion... yes 0:07.10 checking whether the C compiler supports -Wloop-analysis... yes 0:07.14 checking whether the C++ compiler supports -Wloop-analysis... yes 0:07.18 checking whether the C compiler supports -Wno-range-loop-analysis... yes 0:07.22 checking whether the C++ compiler supports -Wno-range-loop-analysis... yes 0:07.26 checking whether the C++ compiler supports -Wc++2a-compat... yes 0:07.30 checking whether the C++ compiler supports -Wcomma-subscript... no 0:07.34 checking whether the C compiler supports -Wenum-compare-conditional... yes 0:07.38 checking whether the C++ compiler supports -Wenum-compare-conditional... yes 0:07.42 checking whether the C++ compiler supports -Wno-ambiguous-reversed-operator... yes 0:07.46 checking whether the C++ compiler supports -Wno-error=deprecated... yes 0:07.51 checking whether the C++ compiler supports -Wno-error=deprecated-anon-enum-enum-conversion... yes 0:07.55 checking whether the C++ compiler supports -Wno-error=deprecated-enum-enum-conversion... yes 0:07.59 checking whether the C++ compiler supports -Wno-error=deprecated-enum-float-conversion... yes 0:07.63 checking whether the C++ compiler supports -Wno-error=deprecated-pragma... yes 0:07.68 checking whether the C++ compiler supports -Wno-error=deprecated-this-capture... yes 0:07.72 checking whether the C++ compiler supports -Wno-error=deprecated-volatile... yes 0:07.76 checking whether the C++ compiler supports -Wno-error=volatile... no 0:07.80 checking whether the C++ compiler supports -Wcomma... yes 0:07.83 checking whether the C compiler supports -Wduplicated-cond... no 0:07.87 checking whether the C++ compiler supports -Wduplicated-cond... no 0:07.91 checking whether the C++ compiler supports -Wimplicit-fallthrough... yes 0:07.94 checking whether the C compiler supports -Wlogical-op... no 0:07.98 checking whether the C++ compiler supports -Wlogical-op... no 0:08.03 checking whether the C compiler supports -Wstring-conversion... yes 0:08.07 checking whether the C++ compiler supports -Wstring-conversion... yes 0:08.11 checking whether the C++ compiler supports -Wno-inline-new-delete... yes 0:08.14 checking whether the C compiler supports -Wno-error=maybe-uninitialized... no 0:08.18 checking whether the C++ compiler supports -Wno-error=maybe-uninitialized... no 0:08.22 checking whether the C compiler supports -Wno-error=deprecated-declarations... yes 0:08.26 checking whether the C++ compiler supports -Wno-error=deprecated-declarations... yes 0:08.30 checking whether the C compiler supports -Wno-error=array-bounds... yes 0:08.34 checking whether the C++ compiler supports -Wno-error=array-bounds... yes 0:08.38 checking whether the C compiler supports -Wno-error=coverage-mismatch... no 0:08.41 checking whether the C++ compiler supports -Wno-error=coverage-mismatch... no 0:08.47 checking whether the C compiler supports -Wno-error=backend-plugin... yes 0:08.51 checking whether the C++ compiler supports -Wno-error=backend-plugin... yes 0:08.55 checking whether the C compiler supports -Wno-error=free-nonheap-object... yes 0:08.59 checking whether the C++ compiler supports -Wno-error=free-nonheap-object... yes 0:08.63 checking whether the C compiler supports -Wno-multistatement-macros... no 0:08.66 checking whether the C++ compiler supports -Wno-multistatement-macros... no 0:08.70 checking whether the C compiler supports -Wno-error=return-std-move... yes 0:08.75 checking whether the C++ compiler supports -Wno-error=return-std-move... yes 0:08.78 checking whether the C compiler supports -Wno-error=class-memaccess... no 0:08.82 checking whether the C++ compiler supports -Wno-error=class-memaccess... no 0:08.86 checking whether the C compiler supports -Wno-error=atomic-alignment... yes 0:08.90 checking whether the C++ compiler supports -Wno-error=atomic-alignment... yes 0:08.94 checking whether the C compiler supports -Wno-error=deprecated-copy... yes 0:08.98 checking whether the C++ compiler supports -Wno-error=deprecated-copy... yes 0:09.01 checking whether the C compiler supports -Wno-error=deprecated-builtins... no 0:09.05 checking whether the C++ compiler supports -Wno-error=deprecated-builtins... no 0:09.09 checking whether the C compiler supports -Wformat... yes 0:09.13 checking whether the C++ compiler supports -Wformat... yes 0:09.17 checking whether the C compiler supports -Wformat-security... yes 0:09.22 checking whether the C++ compiler supports -Wformat-security... yes 0:09.25 checking whether the C compiler supports -Wformat-overflow=2... no 0:09.29 checking whether the C++ compiler supports -Wformat-overflow=2... no 0:09.34 checking whether the C compiler supports -Wno-gnu-zero-variadic-macro-arguments... yes 0:09.38 checking whether the C++ compiler supports -Wno-gnu-zero-variadic-macro-arguments... yes 0:09.43 checking whether the C compiler supports -Werror=implicit-function-declaration... yes 0:09.47 checking whether the C compiler supports -Wno-psabi... yes 0:09.51 checking whether the C++ compiler supports -Wno-psabi... yes 0:09.55 checking whether the C compiler supports -Wthread-safety... yes 0:09.59 checking whether the C++ compiler supports -Wthread-safety... yes 0:09.64 checking whether the C++ compiler supports -fno-sized-deallocation... yes 0:09.68 checking whether the C++ compiler supports -fno-aligned-new... yes 0:09.68 checking for llvm_profdata... /usr/bin/llvm-profdata 0:09.69 checking for alsa... yes 0:09.69 checking MOZ_ALSA_CFLAGS... 0:09.69 checking MOZ_ALSA_LIBS... -lasound 0:09.70 checking for libpulse... yes 0:09.70 checking MOZ_PULSEAUDIO_CFLAGS... -D_REENTRANT 0:09.70 checking MOZ_PULSEAUDIO_LIBS... -lpulse -pthread 0:09.71 checking for nspr >= 4.32... yes 0:09.71 checking NSPR_CFLAGS... -I/usr/include/nspr 0:09.71 checking NSPR_LIBS... -lplds4 -lplc4 -lnspr4 0:09.71 checking for rustc... /usr/bin/rustc 0:09.71 checking for cargo... /usr/bin/cargo 0:09.88 checking rustc version... 1.63.0 0:09.90 checking cargo version... 1.63.0 0:10.05 checking for rust host triplet... i686-unknown-linux-gnu 0:10.15 checking for rust target triplet... i686-unknown-linux-gnu 0:10.15 checking for rustdoc... /usr/bin/rustdoc 0:10.24 checking for cbindgen... /usr/bin/cbindgen 0:10.24 checking for rustfmt... /usr/bin/rustfmt 0:10.24 checking for clang for bindgen... /usr/bin/clang++ 0:10.27 checking for libclang for bindgen... /usr/lib/libclang.so 0:10.30 checking that libclang is new enough... yes 0:10.30 checking bindgen cflags... -x c++ -fno-sized-deallocation -fno-aligned-new -DTRACING=1 -DIMPL_LIBXUL -DMOZILLA_INTERNAL_API -DRUST_BINDGEN -DOS_POSIX=1 -DOS_LINUX=1 -std=gnu++17 0:10.30 checking for libffi > 3.0.9... yes 0:10.31 checking MOZ_FFI_CFLAGS... 0:10.31 checking MOZ_FFI_LIBS... -lffi 0:10.31 checking for icu-i18n >= 71.1... yes 0:10.32 checking MOZ_ICU_CFLAGS... 0:10.32 checking MOZ_ICU_LIBS... -licui18n -licuuc -licudata 0:10.37 checking for tm_zone and tm_gmtoff in struct tm... yes 0:10.48 checking for getpagesize... yes 0:10.59 checking for gmtime_r... yes 0:10.71 checking for localtime_r... yes 0:10.82 checking for gettid... yes 0:10.93 checking for setpriority... yes 0:11.05 checking for syscall... yes 0:11.16 checking for getc_unlocked... yes 0:11.28 checking for pthread_getname_np... yes 0:11.41 checking for pthread_get_name_np... no 0:11.52 checking for strerror... yes 0:11.64 checking for __cxa_demangle... yes 0:11.69 checking for unwind.h... yes 0:11.80 checking for _Unwind_Backtrace... yes 0:11.91 checking for _getc_nolock... no 0:12.03 checking for localeconv... yes 0:12.48 checking for nodejs... /usr/bin/node (16.16.0) 0:12.49 checking for gtk+-wayland-3.0 >= 3.14 xkbcommon >= 0.4.1 libdrm >= 2.4... yes 0:12.50 checking MOZ_WAYLAND_CFLAGS... -pthread -I/usr/include/gtk-3.0 -I/usr/include/at-spi2-atk/2.0 -I/usr/include/at-spi-2.0 -I/usr/include/dbus-1.0 -I/usr/lib/dbus-1.0/include -I/usr/include/gtk-3.0 -I/usr/include/gio-unix-2.0 -I/usr/include/cairo -I/usr/include/pango-1.0 -I/usr/include/harfbuzz -I/usr/include/pango-1.0 -I/usr/include/fribidi -I/usr/include/atk-1.0 -I/usr/include/cairo -I/usr/include/pixman-1 -I/usr/include/freetype2 -I/usr/include/harfbuzz -I/usr/include/gdk-pixbuf-2.0 -I/usr/include/libpng16 -I/usr/include/libmount -I/usr/include/blkid -I/usr/include/glib-2.0 -I/usr/lib/glib-2.0/include -I/usr/include/libdrm 0:12.50 checking MOZ_WAYLAND_LIBS... -lgtk-3 -lgdk-3 -lpangocairo-1.0 -lpango-1.0 -lharfbuzz -latk-1.0 -lcairo-gobject -lcairo -lgdk_pixbuf-2.0 -lgio-2.0 -lgobject-2.0 -lglib-2.0 -lxkbcommon -ldrm 0:12.51 checking for pango >= 1.22.0... yes 0:12.51 checking MOZ_PANGO_CFLAGS... -pthread -I/usr/include/pango-1.0 -I/usr/include/libmount -I/usr/include/blkid -I/usr/include/fribidi -I/usr/include/cairo -I/usr/include/pixman-1 -I/usr/include/harfbuzz -I/usr/include/glib-2.0 -I/usr/lib/glib-2.0/include -I/usr/include/freetype2 -I/usr/include/libpng16 0:12.51 checking MOZ_PANGO_LIBS... -lpango-1.0 -lgobject-2.0 -lglib-2.0 -lharfbuzz 0:12.52 checking for fontconfig >= 2.7.0... yes 0:12.52 checking _FONTCONFIG_CFLAGS... -I/usr/include/freetype2 -I/usr/include/libpng16 -I/usr/include/harfbuzz -I/usr/include/glib-2.0 -I/usr/lib/glib-2.0/include 0:12.52 checking _FONTCONFIG_LIBS... -lfontconfig -lfreetype 0:12.52 checking for freetype2 >= 9.10.3... yes 0:12.53 checking _FT2_CFLAGS... -I/usr/include/freetype2 -I/usr/include/libpng16 -I/usr/include/harfbuzz -I/usr/include/glib-2.0 -I/usr/lib/glib-2.0/include 0:12.53 checking _FT2_LIBS... -lfreetype 0:12.53 checking for tar... /usr/bin/gtar 0:12.53 checking for unzip... /usr/bin/unzip 0:12.53 checking for the Mozilla API key... no 0:12.53 checking for the Google Location Service API key... no 0:12.54 checking for the Google Safebrowsing API key... no 0:12.54 checking for the Bing API key... no 0:12.54 checking for the Adjust SDK key... no 0:12.54 checking for the Leanplum SDK key... no 0:12.54 checking for the Pocket API key... no 0:12.54 checking for libwebp >= 1.0.2 libwebpdemux >= 1.0.2... yes 0:12.54 checking MOZ_WEBP_CFLAGS... 0:12.54 checking MOZ_WEBP_LIBS... -lwebpdemux -lwebp 0:12.55 checking for x11 xcb xcb-shm x11-xcb xext xrandr >= 1.4.0 xcomposite xcursor xdamage xfixes xi xtst... yes 0:12.55 checking MOZ_X11_CFLAGS... 0:12.56 checking MOZ_X11_LIBS... -lxcb-shm -lX11-xcb -lX11 -lxcb -lXext -lXrandr -lXcomposite -lXcursor -lXdamage -lXfixes -lXi -lXtst 0:12.56 checking for ice sm... yes 0:12.56 checking MOZ_X11_SM_CFLAGS... 0:12.56 checking for vpx >= 1.8.0... yes 0:12.57 checking MOZ_LIBVPX_CFLAGS... 0:12.57 checking MOZ_LIBVPX_LIBS... -lvpx -lm 0:12.62 checking for vpx/vpx_decoder.h... yes 0:12.75 checking for vpx_codec_dec_init_ver... yes 0:12.86 checking for jpeg_destroy_compress... yes 0:12.92 checking for sufficient jpeg library version... yes 0:12.97 checking for sufficient libjpeg-turbo JCS_EXTENSIONS... yes 0:12.98 checking for libpng >= 1.6.35... yes 0:12.98 checking MOZ_PNG_CFLAGS... -I/usr/include/libpng16 0:12.98 checking MOZ_PNG_LIBS... -lpng16 0:13.11 checking for png_get_acTL... yes 0:13.11 checking for nasm... /usr/bin/nasm 0:13.12 checking nasm version... 2.15.05 0:13.12 checking for dump_syms... not found 0:13.25 checking for getcontext... yes 0:13.25 checking for nss >= 3.82... yes 0:13.26 checking NSS_CFLAGS... -I/usr/include/nss -I/usr/include/nspr 0:13.26 checking NSS_LIBS... -lnss3 -lnssutil3 -lsmime3 -lssl3 -lsoftokn3 -lplds4 -lplc4 -lnspr4 0:13.26 checking for libevent... yes 0:13.27 checking MOZ_LIBEVENT_CFLAGS... 0:13.27 checking MOZ_LIBEVENT_LIBS... -levent 0:13.28 checking for gtk+-3.0 >= 3.14.0 gtk+-unix-print-3.0 glib-2.0 gobject-2.0 gio-unix-2.0... yes 0:13.29 checking MOZ_GTK3_CFLAGS... -pthread -I/usr/include/gtk-3.0/unix-print -I/usr/include/gtk-3.0 -I/usr/include/at-spi2-atk/2.0 -I/usr/include/at-spi-2.0 -I/usr/include/dbus-1.0 -I/usr/lib/dbus-1.0/include -I/usr/include/gtk-3.0 -I/usr/include/cairo -I/usr/include/pango-1.0 -I/usr/include/harfbuzz -I/usr/include/pango-1.0 -I/usr/include/fribidi -I/usr/include/atk-1.0 -I/usr/include/cairo -I/usr/include/pixman-1 -I/usr/include/freetype2 -I/usr/include/harfbuzz -I/usr/include/gdk-pixbuf-2.0 -I/usr/include/libpng16 -I/usr/include/gio-unix-2.0 -I/usr/include/libmount -I/usr/include/blkid -I/usr/include/glib-2.0 -I/usr/lib/glib-2.0/include 0:13.29 checking MOZ_GTK3_LIBS... -lgtk-3 -lgdk-3 -lpangocairo-1.0 -lpango-1.0 -lharfbuzz -latk-1.0 -lcairo-gobject -lcairo -lgdk_pixbuf-2.0 -lgio-2.0 -lgobject-2.0 -lglib-2.0 0:13.29 checking for glib-2.0 >= 2.42 gobject-2.0... yes 0:13.29 checking GLIB_CFLAGS... -I/usr/include/glib-2.0 -I/usr/lib/glib-2.0/include 0:13.30 checking GLIB_LIBS... -lgobject-2.0 -lglib-2.0 0:13.30 checking for dbus-1 >= 0.60... yes 0:13.30 checking MOZ_DBUS_CFLAGS... -I/usr/include/dbus-1.0 -I/usr/lib/dbus-1.0/include 0:13.31 checking MOZ_DBUS_LIBS... -ldbus-1 0:13.31 checking for dbus-glib-1 >= 0.60... yes 0:13.32 checking MOZ_DBUS_GLIB_CFLAGS... -I/usr/include/dbus-1.0 -I/usr/lib/dbus-1.0/include -I/usr/include/glib-2.0 -I/usr/lib/glib-2.0/include 0:13.32 checking MOZ_DBUS_GLIB_LIBS... -ldbus-glib-1 -ldbus-1 -lgobject-2.0 -lglib-2.0 0:13.32 checking for pixman-1 >= 0.36.0... yes 0:13.32 checking MOZ_PIXMAN_CFLAGS... -I/usr/include/pixman-1 0:13.33 checking MOZ_PIXMAN_LIBS... -lpixman-1 0:13.38 checking for sin_len in struct sockaddr_in... no 0:13.43 checking for sin_len6 in struct sockaddr_in6... no 0:13.48 checking for sa_len in struct sockaddr... no 0:13.53 checking for pthread_cond_timedwait_monotonic_np... no 0:13.58 checking for 32-bits ethtool_cmd.speed... yes 0:13.64 checking for linux/joystick.h... yes 0:13.75 checking for stat64... yes 0:13.86 checking for lstat64... yes 0:13.98 checking for truncate64... yes 0:14.09 checking for statvfs64... yes 0:14.20 checking for statvfs... yes 0:14.32 checking for statfs64... yes 0:14.43 checking for statfs... yes 0:14.54 checking for lutimes... yes 0:14.66 checking for posix_fadvise... yes 0:14.78 checking for posix_fallocate... yes 0:14.89 checking for arc4random... yes 0:15.00 checking for arc4random_buf... yes 0:15.12 checking for mallinfo... yes 0:15.12 checking for awk... /usr/bin/gawk 0:15.12 checking for perl... /usr/bin/perl 0:15.12 checking for minimum required perl version >= 5.006... 5.036000 0:15.13 checking for full perl installation... yes 0:15.14 checking for gmake... /usr/bin/gmake 0:15.14 checking for watchman... not found 0:15.14 checking for xargs... /bin/xargs 0:15.14 checking for rpmbuild... /usr/bin/rpmbuild 0:15.17 checking for llvm-objdump... /usr/bin/llvm-objdump 0:15.23 checking for readelf... /usr/bin/llvm-readelf 0:15.28 checking for objcopy... /usr/bin/llvm-objcopy 0:15.33 checking for strip... /usr/bin/llvm-strip 0:15.33 checking for zlib >= 1.2.3... yes 0:15.34 checking MOZ_ZLIB_CFLAGS... 0:15.34 checking MOZ_ZLIB_LIBS... -lz 0:15.34 checking for m4... /usr/bin/m4 0:15.38 creating cache ./config.cache 0:15.41 checking host system type... i686-pld-linux-gnu 0:15.42 checking target system type... i686-pld-linux-gnu 0:15.44 checking build system type... i686-pld-linux-gnu 0:15.48 checking for Cygwin environment... no 0:15.53 checking for mingw32 environment... no 0:15.64 checking for executable suffix... no 0:15.64 checking for gcc... (cached) /usr/bin/clang -std=gnu99 0:15.65 checking whether the C compiler (/usr/bin/clang -std=gnu99 -O2 -fwrapv -pipe -Wformat -Werror=format-security -Wp,-D_FORTIFY_SOURCE=2 -fstack-protector-strong --param=ssp-buffer-size=4 -Werror=trampolines -fomit-frame-pointer -march=i686 -fasynchronous-unwind-tables -mtune=pentium4 -D_FILE_OFFSET_BITS=64 -g0 -fuse-ld=lld) works... (cached) yes 0:15.65 checking whether the C compiler (/usr/bin/clang -std=gnu99 -O2 -fwrapv -pipe -Wformat -Werror=format-security -Wp,-D_FORTIFY_SOURCE=2 -fstack-protector-strong --param=ssp-buffer-size=4 -Werror=trampolines -fomit-frame-pointer -march=i686 -fasynchronous-unwind-tables -mtune=pentium4 -D_FILE_OFFSET_BITS=64 -g0 -fuse-ld=lld) is a cross-compiler... no 0:15.65 checking whether we are using GNU C... (cached) yes 0:15.65 checking whether /usr/bin/clang -std=gnu99 accepts -g... (cached) yes 0:15.65 checking for c++... (cached) /usr/bin/clang++ -std=gnu++17 0:15.65 checking whether the C++ compiler (/usr/bin/clang++ -std=gnu++17 -O2 -fwrapv -pipe -Wformat -Werror=format-security -Wp,-D_FORTIFY_SOURCE=2 -fstack-protector-strong --param=ssp-buffer-size=4 -Werror=trampolines -fomit-frame-pointer -march=i686 -fasynchronous-unwind-tables -mtune=pentium4 -mmmx -D_FILE_OFFSET_BITS=64 -g0 -fuse-ld=lld) works... (cached) yes 0:15.65 checking whether the C++ compiler (/usr/bin/clang++ -std=gnu++17 -O2 -fwrapv -pipe -Wformat -Werror=format-security -Wp,-D_FORTIFY_SOURCE=2 -fstack-protector-strong --param=ssp-buffer-size=4 -Werror=trampolines -fomit-frame-pointer -march=i686 -fasynchronous-unwind-tables -mtune=pentium4 -mmmx -D_FILE_OFFSET_BITS=64 -g0 -fuse-ld=lld) is a cross-compiler... no 0:15.65 checking whether we are using GNU C++... (cached) yes 0:15.65 checking whether /usr/bin/clang++ -std=gnu++17 accepts -g... (cached) yes 0:15.65 checking for otool... no 0:15.82 checking for --noexecstack option to as... yes 0:15.94 checking for -z noexecstack option to ld... yes 0:16.07 checking for -z text option to ld... yes 0:16.19 checking for -z relro option to ld... yes 0:16.31 checking for -z nocopyreloc option to ld... yes 0:16.43 checking for -Bsymbolic-functions option to ld... yes 0:16.55 checking for --build-id=sha1 option to ld... yes 0:16.65 checking for --ignore-unresolved-symbol option to ld... no 0:16.80 checking whether the linker supports Identical Code Folding... no 0:17.17 checking whether removing dead symbols breaks debugging... yes 0:17.22 checking for working const... yes 0:17.26 checking for mode_t... yes 0:17.30 checking for off_t... yes 0:17.35 checking for pid_t... yes 0:17.39 checking for size_t... yes 0:17.39 checking whether 64-bits std::atomic requires -latomic... yes 0:17.45 checking for dirent.h that defines DIR... yes 0:17.56 checking for opendir in -ldir... no 0:17.66 checking for gethostbyname_r in -lc_r... no 0:17.79 checking for library containing dlopen... none required 0:17.84 checking for dlfcn.h... yes 0:17.96 checking for dladdr... yes 0:18.07 checking for socket in -lsocket... no 0:18.18 checking for pthread_create in -lpthreads... no 0:18.31 checking for pthread_create in -lpthread... yes 0:18.40 checking whether /usr/bin/clang -std=gnu99 accepts -pthread... egrep: warning: egrep is obsolescent; using grep -E 0:18.40 egrep: warning: egrep is obsolescent; using grep -E 0:18.41 yes 0:18.47 checking for pthread.h... yes 0:18.60 checking for clock_gettime(CLOCK_MONOTONIC)... 0:18.75 checking for res_ninit()... yes 0:18.89 checking for __thread keyword for TLS variables... yes 0:18.95 checking for malloc.h... yes 0:19.01 checking whether malloc_usable_size definition can use const argument... no 0:19.05 checking for valloc in malloc.h... yes 0:19.09 checking for valloc in unistd.h... no 0:19.14 checking for _aligned_malloc in malloc.h... no 0:19.14 checking if app-specific confvars.sh exists... /tmp/B.qx2tm3hd/BUILD/firefox-105.0/browser/confvars.sh 0:19.20 checking for valid C compiler optimization flags... yes 0:19.20 checking for -pipe support... yes 0:19.33 checking what kind of list files are supported by the linker... linkerscript 0:19.35 updating cache ./config.cache 0:19.35 creating ./config.data 0:19.36 js/src> Refreshing /tmp/B.qx2tm3hd/BUILD/firefox-105.0/js/src/old-configure with /tmp/B.qx2tm3hd/BUILD/firefox-105.0/build/autoconf/autoconf.sh 0:19.43 js/src> loading cache ./config.cache 0:19.46 js/src> checking host system type... i686-pld-linux-gnu 0:19.47 js/src> checking target system type... i686-pld-linux-gnu 0:19.49 js/src> checking build system type... i686-pld-linux-gnu 0:19.49 js/src> checking for Cygwin environment... (cached) no 0:19.49 js/src> checking for mingw32 environment... (cached) no 0:19.49 js/src> checking for executable suffix... (cached) no 0:19.50 js/src> checking for gcc... (cached) /usr/bin/clang -std=gnu99 0:19.50 js/src> checking whether the C compiler (/usr/bin/clang -std=gnu99 -O2 -fwrapv -pipe -Wformat -Werror=format-security -Wp,-D_FORTIFY_SOURCE=2 -fstack-protector-strong --param=ssp-buffer-size=4 -Werror=trampolines -fomit-frame-pointer -march=i686 -fasynchronous-unwind-tables -mtune=pentium4 -D_FILE_OFFSET_BITS=64 -g0 -fuse-ld=lld) works... (cached) yes 0:19.50 js/src> checking whether the C compiler (/usr/bin/clang -std=gnu99 -O2 -fwrapv -pipe -Wformat -Werror=format-security -Wp,-D_FORTIFY_SOURCE=2 -fstack-protector-strong --param=ssp-buffer-size=4 -Werror=trampolines -fomit-frame-pointer -march=i686 -fasynchronous-unwind-tables -mtune=pentium4 -D_FILE_OFFSET_BITS=64 -g0 -fuse-ld=lld) is a cross-compiler... no 0:19.50 js/src> checking whether we are using GNU C... (cached) yes 0:19.50 js/src> checking whether /usr/bin/clang -std=gnu99 accepts -g... (cached) yes 0:19.50 js/src> checking for c++... (cached) /usr/bin/clang++ -std=gnu++17 0:19.50 js/src> checking whether the C++ compiler (/usr/bin/clang++ -std=gnu++17 -O2 -fwrapv -pipe -Wformat -Werror=format-security -Wp,-D_FORTIFY_SOURCE=2 -fstack-protector-strong --param=ssp-buffer-size=4 -Werror=trampolines -fomit-frame-pointer -march=i686 -fasynchronous-unwind-tables -mtune=pentium4 -mmmx -D_FILE_OFFSET_BITS=64 -g0 -fuse-ld=lld) works... (cached) yes 0:19.50 js/src> checking whether the C++ compiler (/usr/bin/clang++ -std=gnu++17 -O2 -fwrapv -pipe -Wformat -Werror=format-security -Wp,-D_FORTIFY_SOURCE=2 -fstack-protector-strong --param=ssp-buffer-size=4 -Werror=trampolines -fomit-frame-pointer -march=i686 -fasynchronous-unwind-tables -mtune=pentium4 -mmmx -D_FILE_OFFSET_BITS=64 -g0 -fuse-ld=lld) is a cross-compiler... no 0:19.50 js/src> checking whether we are using GNU C++... (cached) yes 0:19.50 js/src> checking whether /usr/bin/clang++ -std=gnu++17 accepts -g... (cached) yes 0:19.68 js/src> checking for --noexecstack option to as... yes 0:19.80 js/src> checking for -z noexecstack option to ld... yes 0:19.93 js/src> checking for -z text option to ld... yes 0:20.05 js/src> checking for -z relro option to ld... yes 0:20.18 js/src> checking for -z nocopyreloc option to ld... yes 0:20.31 js/src> checking for -Bsymbolic-functions option to ld... yes 0:20.44 js/src> checking for --build-id=sha1 option to ld... yes 0:20.61 js/src> checking whether the linker supports Identical Code Folding... no 0:20.99 js/src> checking whether removing dead symbols breaks debugging... yes 0:20.99 js/src> checking for working const... (cached) yes 0:20.99 js/src> checking for mode_t... (cached) yes 0:20.99 js/src> checking for off_t... (cached) yes 0:20.99 js/src> checking for pid_t... (cached) yes 0:21.00 js/src> checking for size_t... (cached) yes 0:21.07 js/src> checking for ssize_t... yes 0:21.07 js/src> checking whether 64-bits std::atomic requires -latomic... (cached) yes 0:21.07 js/src> checking for dirent.h that defines DIR... (cached) yes 0:21.08 js/src> checking for opendir in -ldir... (cached) no 0:21.08 js/src> checking for gethostbyname_r in -lc_r... (cached) no 0:21.08 js/src> checking for library containing dlopen... (cached) none required 0:21.09 js/src> checking for dlfcn.h... (cached) yes 0:21.09 js/src> checking for dladdr... (cached) yes 0:21.10 js/src> checking for socket in -lsocket... (cached) no 0:21.10 js/src> checking for pthread_create in -lpthreads... (cached) no 0:21.10 js/src> checking for pthread_create in -lpthread... (cached) yes 0:21.21 js/src> checking whether /usr/bin/clang -std=gnu99 accepts -pthread... egrep: warning: egrep is obsolescent; using grep -E 0:21.21 js/src> egrep: warning: egrep is obsolescent; using grep -E 0:21.21 js/src> yes 0:21.22 js/src> checking for clock_gettime(CLOCK_MONOTONIC)... (cached) 0:21.35 js/src> checking for sin in -lm... yes 0:21.36 js/src> checking for res_ninit()... (cached) yes 0:21.50 js/src> checking for nl_langinfo and CODESET... yes 0:21.50 js/src> checking for __thread keyword for TLS variables... (cached) yes 0:21.57 js/src> checking for valid optimization flags... yes 0:21.57 js/src> checking for -pipe support... yes 0:21.70 js/src> checking what kind of list files are supported by the linker... linkerscript 0:21.71 js/src> checking for malloc.h... (cached) yes 0:21.77 js/src> checking whether malloc_usable_size definition can use const argument... no 0:21.81 js/src> checking for valloc in malloc.h... yes 0:21.85 js/src> checking for valloc in unistd.h... no 0:21.89 js/src> checking for _aligned_malloc in malloc.h... no 0:21.90 js/src> updating cache ./config.cache 0:22.75 js/src> creating ./config.data 0:22.77 Creating config.status 0:23.20 Reticulating splines... 0:24.62 0:01.46 File already read. Skipping: /tmp/B.qx2tm3hd/BUILD/firefox-105.0/intl/components/moz.build 0:25.11 0:01.95 File already read. Skipping: /tmp/B.qx2tm3hd/BUILD/firefox-105.0/gfx/angle/targets/angle_common/moz.build 0:38.01 Finished reading 1802 moz.build files in 5.18s 0:38.01 Read 13 gyp files in parallel contributing 0.00s to total wall time 0:38.01 Processed into 11509 build config descriptors in 3.01s 0:38.01 RecursiveMake backend executed in 5.51s 0:38.01 3796 total backend files; 3796 created; 0 updated; 0 unchanged; 0 deleted; 21 -> 1411 Makefile 0:38.01 FasterMake backend executed in 0.65s 0:38.01 13 total backend files; 13 created; 0 updated; 0 unchanged; 0 deleted 0:38.01 Total wall time: 14.85s; CPU time: 14.02s; Efficiency: 94%; Untracked: 0.49s 0:38.63 Adding make options from /tmp/B.qx2tm3hd/BUILD/firefox-105.0/.mozconfig MOZ_OBJDIR=/tmp/B.qx2tm3hd/BUILD/firefox-105.0/obj-i686 OBJDIR=/tmp/B.qx2tm3hd/BUILD/firefox-105.0/obj-i686 FOUND_MOZCONFIG=/tmp/B.qx2tm3hd/BUILD/firefox-105.0/.mozconfig export FOUND_MOZCONFIG 0:38.63 /usr/bin/gmake -f client.mk -j8 -s 0:38.87 Elapsed: 0.00s; From dist/public: Kept 0 existing; Added/updated 0; Removed 0 files and 0 directories. 0:38.87 Elapsed: 0.00s; From dist/private: Kept 0 existing; Added/updated 0; Removed 0 files and 0 directories. 0:38.87 Elapsed: 0.00s; From dist/xpi-stage: Kept 0 existing; Added/updated 5; Removed 0 files and 0 directories. 0:38.98 Elapsed: 0.11s; From _tests: Kept 13 existing; Added/updated 623; Removed 0 files and 0 directories. 0:39.09 Elapsed: 0.22s; From dist/bin: Kept 9 existing; Added/updated 2616; Removed 0 files and 0 directories. 0:39.21 Elapsed: 0.34s; From dist/include: Kept 1812 existing; Added/updated 4291; Removed 0 files and 0 directories. 0:39.44 ./mozilla-config.h.stub 0:39.44 ./buildid.h.stub 0:39.44 ./source-repo.h.stub 0:39.74 ./stl.sentinel.stub 0:39.74 ./application.ini.stub 0:39.74 ./buildconfig.rs.stub 0:39.74 ./cbindgen-metadata.json.stub 0:39.74 ./UseCounterList.h.stub 0:39.74 ./UseCounterWorkerList.h.stub 0:39.74 ./ServoCSSPropList.py.stub 0:39.75 ./encodingsgroups.properties.h.stub 0:39.76 config 0:39.97 ./BaseChars.h.stub 0:39.97 ./IsCombiningDiacritic.h.stub 0:39.98 ./js-confdefs.h.stub 0:39.98 ./js-config.h.stub 0:39.98 ./ProfilingCategoryList.h.stub 0:40.12 ./ReservedWordsGenerated.h.stub 0:40.18 ./StatsPhasesGenerated.h.stub 0:40.20 ./MIROpsGenerated.h.stub 0:40.20 ./LIROpsGenerated.h.stub 0:40.39 ./CacheIROpsGenerated.h.stub 0:40.41 ./AtomicOperationsGenerated.h.stub 0:40.41 ./WasmIntrinsicGenerated.h.stub 0:40.63 ./FrameIdList.h.stub 0:40.86 ./FrameTypeList.h.stub 0:40.88 ./CountedUnknownProperties.h.stub 0:40.98 ./metrics.rs.stub 0:41.08 ./GleanMetrics.h.stub 0:41.11 ./GleanJSMetricsLookup.h.stub 0:41.14 ./pings.rs.stub 0:41.16 ./GleanPings.h.stub 0:41.19 ./GleanJSPingsLookup.h.stub 0:41.44 ./EventGIFFTMap.h.stub 0:42.68 ./HistogramGIFFTMap.h.stub 0:42.69 ./ScalarGIFFTMap.h.stub 0:42.70 ./factory.rs.stub 0:44.33 ./NimbusFeatureManifest.h.stub 0:44.34 ./TelemetryScalarData.h.stub 0:44.36 ./TelemetryScalarEnums.h.stub 0:44.75 ./TelemetryEventData.h.stub 0:44.81 ./TelemetryEventEnums.h.stub 0:45.30 ./TelemetryProcessEnums.h.stub 0:45.50 ./TelemetryProcessData.h.stub 0:45.52 ./TelemetryUserInteractionData.h.stub 0:45.54 ./TelemetryUserInteractionNameMap.h.stub 0:45.75 ./CrashAnnotations.h.stub 0:45.76 ./profiling_categories.rs.stub 0:45.78 ./xpcom-config.h.stub 0:45.79 ./ErrorList.h.stub 0:45.89 ./ErrorNamesInternal.h.stub 0:46.00 ./error_list.rs.stub 0:46.01 ./Services.h.stub 0:46.06 ./services.rs.stub 0:46.11 ./GeckoProcessTypes.h.stub 0:46.13 ./nsGkAtomList.h.stub 0:46.21 ./nsGkAtomConsts.h.stub 0:46.22 ./xpidl.stub.stub 0:46.23 ./application.ini.h.stub 0:46.25 config/nsinstall_real 0:46.28 ./GeneratedElementDocumentState.h.stub 0:46.34 ./CSS2Properties.webidl.stub 0:46.35 ./data_encoding_ffi_generated.h.stub 0:46.49 ./audioipc2_client_ffi_generated.h.stub 0:46.50 ./audioipc2_server_ffi_generated.h.stub 0:46.51 ./audioipc_client_ffi_generated.h.stub 0:46.53 ./audioipc_server_ffi_generated.h.stub 0:46.54 ./midir_impl_ffi_generated.h.stub 0:46.60 ./origin_trials_ffi_generated.h.stub 0:46.62 ./webrender_ffi_generated.h.stub 0:46.77 ./wgpu_ffi_generated.h.stub 0:46.81 ./mapped_hyph.h.stub 0:46.83 ./fluent_ffi_generated.h.stub 0:46.86 ./l10nregistry_ffi_generated.h.stub 0:46.88 ./localization_ffi_generated.h.stub 0:46.89 ./fluent_langneg_ffi_generated.h.stub 0:46.90 ./unic_langid_ffi_generated.h.stub 0:47.12 ./selfhosted.out.h.stub 0:47.17 ./nsCSSPropertyID.h.stub 0:47.18 ./ServoCSSPropList.h.stub 0:47.20 ./CompositorAnimatableProperties.h.stub 0:47.20 ./ServoStyleConsts.h.stub 0:47.23 ./mp4parse_ffi_generated.h.stub 0:47.37 /usr/bin/clang++ -std=gnu++17 -E -o self-hosting-preprocessed.pp -Qunused-arguments -DCROSS_COMPILE= -DXP_UNIX=1 -DXP_LINUX=1 -DMOZ_BUILD_APP=browser -DRELEASE_OR_BETA=1 -DMOZILLA_VERSION="105.0" -DMOZILLA_VERSION_U=105.0 -DMOZILLA_UAVERSION="105.0" -DMOZ_UPDATE_CHANNEL=default -DHAVE_VISIBILITY_HIDDEN_ATTRIBUTE=1 -DHAVE_VISIBILITY_ATTRIBUTE=1 -DMOZ_MEMORY=1 -DHAVE_STRNDUP=1 -DHAVE_POSIX_MEMALIGN=1 -DHAVE_MEMALIGN=1 -DHAVE_MALLOC_USABLE_SIZE=1 -DHAVE_STDINT_H=1 -DHAVE_INTTYPES_H=1 -DSTDC_HEADERS=1 -DHAVE_MALLOC_H=1 -DHAVE_ALLOCA_H=1 -DHAVE_GETOPT_H=1 -DHAVE_UNISTD_H=1 -DHAVE_NL_TYPES_H=1 -DHAVE_CPUID_H=1 -DHAVE_FTS_H=1 -DHAVE_SYS_STATVFS_H=1 -DHAVE_SYS_STATFS_H=1 -DHAVE_SYS_VFS_H=1 -DHAVE_SYS_MOUNT_H=1 -DHAVE_SYS_QUOTA_H=1 -DHAVE_LINUX_QUOTA_H=1 -DHAVE_LINUX_IF_ADDR_H=1 -DHAVE_LINUX_RTNETLINK_H=1 -DHAVE_SYS_QUEUE_H=1 -DHAVE_SYS_TYPES_H=1 -DHAVE_NETINET_IN_H=1 -DHAVE_BYTESWAP_H=1 -DHAVE_MEMFD_CREATE=1 -DHAVE_LINUX_PERF_EVENT_H=1 -DMOZ_DLL_PREFIX="lib" -DMOZ_DLL_SUFFIX=".so" -DMOZ_GECKO_PROFILER=1 -DMOZ_GECKO_PROFILER_PARSE_ELF=1 -DMOZ_PROFILER_MEMORY=1 -DJS_NUNBOX32=1 -DSTATIC_JS_API=1 -DMOZ_STATIC_JS=1 -DJS_CODEGEN_X86=1 -DMOZ_AARCH64_JSCVT=0 -DBUILD_CTYPES=1 -DJS_HAS_CTYPES=1 -DENABLE_SHARED_MEMORY=1 -DENABLE_WASM_SIMD=1 -DENABLE_WASM_AVX=1 -DJS_DEFAULT_JITREPORT_GRANULARITY=3 -DMOZ_SYSTEM_ICU=1 -DJS_HAS_INTL_API=1 -DU_USING_ICU_NAMESPACE=0 -DMOZJS_MAJOR_VERSION=105 -DMOZJS_MINOR_VERSION=0 -DHAVE_TM_ZONE_TM_GMTOFF=1 -DHAVE_GETPAGESIZE=1 -DHAVE_GMTIME_R=1 -DHAVE_LOCALTIME_R=1 -DHAVE_GETTID=1 -DHAVE_SETPRIORITY=1 -DHAVE_SYSCALL=1 -DHAVE_GETC_UNLOCKED=1 -DHAVE_PTHREAD_GETNAME_NP=1 -DHAVE_STRERROR=1 -DHAVE_UNWIND_H=1 -DHAVE__UNWIND_BACKTRACE=1 -DHAVE_LOCALECONV=1 -DJSON_USE_EXCEPTION=0 -DMOZ_WIDGET_GTK=1 -DMOZ_WAYLAND=1 -DGL_PROVIDER_EGL=1 -DMOZ_PDF_PRINTING=1 -DMOZ_INSTRUMENT_EVENT_LOOP=1 -DUSE_FC_FREETYPE=1 -DMOZ_HAVE_FREETYPE2=1 -DMOZ_FFMPEG=1 -DMOZ_DAV1D_ASM=1 -DMOZ_AV1=1 -DMOZ_FMP4=1 -DMOZ_SAMPLE_TYPE_FLOAT32=1 -DMOZ_VORBIS=1 -DMOZ_PLACES=1 -DMOZ_SERVICES_HEALTHREPORT=1 -DMOZ_NORMANDY=1 -DMOZ_DEDICATED_PROFILES=1 -DMOZ_BLOCK_PROFILE_DOWNGRADE=1 -DNS_PRINTING=1 -DNS_PRINT_PREVIEW=1 -DMOZ_WEBSPEECH=1 -DMOZ_WEBSPEECH_TEST_BACKEND=1 -DENABLE_WEBDRIVER=1 -DMOZ_WEBRTC=1 -DMOZ_SCTP=1 -DMOZ_SRTP=1 -DMOZ_WEBRTC_SIGNALING=1 -DMOZ_PEERCONNECTION=1 -DMOZ_WEBRTC_ASSERT_ALWAYS=1 -DMOZ_RAW=1 -DMOZ_X11=1 -DMOZ_PROXY_DIRECT_FAILOVER=1 -DACCESSIBILITY=1 -DMOZ_REQUIRE_SIGNING=1 -DMOZ_BUNDLED_FONTS=1 -DHAVE_VPX_VPX_DECODER_H=1 -DMOZ_FFVPX=1 -DMOZ_FFVPX_AUDIOONLY=1 -DMOZ_HAS_REMOTE=1 -DMOZ_ENABLE_FORKSERVER=1 -DHAVE_GETCONTEXT=1 -DMOZ_VERIFY_MAR_SIGNATURE=1 -DMOZ_OXIDIZED_BREAKPAD=1 -DMOZ_DOM_STREAMS=1 -DGDK_VERSION_MIN_REQUIRED=GDK_VERSION_3_14 -DGDK_VERSION_MAX_ALLOWED=GDK_VERSION_3_14 -DGLIB_VERSION_MIN_REQUIRED=GLIB_VERSION_2_42 -DGLIB_VERSION_MAX_ALLOWED=GLIB_VERSION_2_42 -DMOZ_ACCESSIBILITY_ATK=1 -DMOZ_ENABLE_DBUS=1 -DMOZ_LOGGING=1 -DFORCE_PR_LOG=1 -DMOZ_AUTH_EXTENSION=1 -DMOZ_SANDBOX=1 -DENABLE_SYSTEM_EXTENSION_DIRS=1 -DMOZ_USER_DIR=".mozilla" -DHAVE_LINUX_JOYSTICK_H=1 -DHAVE_STAT64=1 -DHAVE_LSTAT64=1 -DHAVE_TRUNCATE64=1 -DHAVE_STATVFS64=1 -DHAVE_STATVFS=1 -DHAVE_STATFS64=1 -DHAVE_STATFS=1 -DHAVE_LUTIMES=1 -DHAVE_POSIX_FADVISE=1 -DHAVE_POSIX_FALLOCATE=1 -DHAVE_ARC4RANDOM=1 -DHAVE_ARC4RANDOM_BUF=1 -DHAVE_MALLINFO=1 -DHAVE_DIRENT_H=1 -DHAVE_DLOPEN=1 -DHAVE_DLADDR=1 -D_REENTRANT=1 -DHAVE_PTHREAD_H=1 -DHAVE_CLOCK_MONOTONIC=1 -DHAVE_RES_NINIT=1 -DHAVE_THREAD_TLS_KEYWORD=1 -DMALLOC_H=<malloc.h> -DMALLOC_USABLE_SIZE_CONST_PTR= -DHAVE_VALLOC=1 -DTARGET_XPCOM_ABI="x86-gcc3" -DMOZ_OFFICIAL_BRANDING=1 -DMOZ_DISTRIBUTION_ID="org.pld-linux" -DMOZ_GLUE_IN_PROGRAM=1 -DMOZ_MACBUNDLE_ID=org.pld-linux.firefox -DMOZ_APP_UA_NAME="" -DMOZ_APP_UA_VERSION="105.0" -DBROWSER_CHROME_URL=chrome://browser/content/browser.xhtml -DBROWSER_CHROME_URL_QUOTED="chrome://browser/content/browser.xhtml" -DMOZ_DATA_REPORTING=1 -DNO_NSPR_10_SUPPORT=1 -DNDEBUG=1 -DTRIMMED=1 self-hosting-cpp-input.cpp 0:47.43 ./MozURL_ffi.h.stub 0:47.45 ./rust_helper.h.stub 0:47.46 ./neqo_glue_ffi_generated.h.stub 0:47.48 ./regex_ffi_generated.h.stub 0:47.53 ./fog_ffi_generated.h.stub 0:47.76 ./jog_ffi_generated.h.stub 0:47.77 ./dap_ffi_generated.h.stub 0:47.80 ./TelemetryHistogramEnums.h.stub 0:47.84 ./TelemetryHistogramNameMap.h.stub 0:47.87 ./profiler_ffi_generated.h.stub 0:47.96 ./gk_rust_utils_ffi_generated.h.stub 0:48.12 config/system-header.sentinel.stub 0:48.49 accessible/xpcom/xpcAccEvents.h.stub 0:48.57 modules/libpref/StaticPrefListAll.h.stub 0:48.74 WARNING: mkdir -dot- requested by /usr/bin/gmake -C /tmp/B.qx2tm3hd/BUILD/firefox-105.0/obj-i686/config/makefiles/xpidl xpidl 0:48.74 config/makefiles/xpidl/Bits.xpt 0:48.74 config/makefiles/xpidl/accessibility.xpt 0:48.91 xpcom/components/Components.h.stub 0:49.09 config/makefiles/xpidl/alerts.xpt 0:49.33 config/makefiles/xpidl/appshell.xpt 0:49.48 config/makefiles/xpidl/appstartup.xpt 0:49.66 config/makefiles/xpidl/autocomplete.xpt 0:49.88 config/makefiles/xpidl/autoplay.xpt 0:49.96 config/makefiles/xpidl/backgroundhangmonitor.xpt 0:50.05 config/makefiles/xpidl/browser-element.xpt 0:50.09 config/makefiles/xpidl/browser-newtab.xpt 0:50.26 config/makefiles/xpidl/browsercompsbase.xpt 0:50.30 config/makefiles/xpidl/caps.xpt 0:50.35 config/makefiles/xpidl/captivedetect.xpt 0:50.39 config/makefiles/xpidl/cascade_bindings.xpt 0:50.57 config/makefiles/xpidl/chrome.xpt 0:50.58 config/makefiles/xpidl/commandhandler.xpt 0:50.63 config/makefiles/xpidl/commandlines.xpt 0:50.70 config/makefiles/xpidl/composer.xpt 0:50.87 config/makefiles/xpidl/content_events.xpt 0:50.87 config/makefiles/xpidl/content_geckomediaplugins.xpt 0:50.88 config/makefiles/xpidl/docshell.xpt 0:51.03 config/makefiles/xpidl/dom.xpt 0:51.07 config/makefiles/xpidl/dom_audiochannel.xpt 0:51.16 config/makefiles/xpidl/dom_base.xpt 0:51.18 config/makefiles/xpidl/dom_bindings.xpt 0:51.23 config/makefiles/xpidl/dom_events.xpt 0:51.47 config/makefiles/xpidl/dom_geolocation.xpt 0:51.54 config/makefiles/xpidl/dom_html.xpt 0:51.71 config/makefiles/xpidl/dom_indexeddb.xpt 0:51.76 config/makefiles/xpidl/dom_localstorage.xpt 0:51.82 config/makefiles/xpidl/dom_media.xpt 0:51.87 config/makefiles/xpidl/dom_network.xpt 0:52.03 config/makefiles/xpidl/dom_notification.xpt 0:52.04 config/makefiles/xpidl/dom_payments.xpt 0:52.10 config/makefiles/xpidl/dom_power.xpt 0:52.16 config/makefiles/xpidl/dom_push.xpt 0:52.20 config/makefiles/xpidl/dom_quota.xpt 0:52.34 config/makefiles/xpidl/dom_security.xpt 0:52.36 config/makefiles/xpidl/dom_serializers.xpt 0:52.38 config/makefiles/xpidl/dom_sidebar.xpt 0:52.48 config/makefiles/xpidl/dom_simpledb.xpt 0:52.57 config/makefiles/xpidl/dom_storage.xpt 0:52.71 config/makefiles/xpidl/dom_system.xpt 0:52.73 config/makefiles/xpidl/dom_webauthn.xpt 0:52.76 config/makefiles/xpidl/dom_webspeechrecognition.xpt 0:52.77 config/makefiles/xpidl/dom_webspeechsynth.xpt 0:52.79 config/makefiles/xpidl/dom_workers.xpt 0:52.94 config/makefiles/xpidl/dom_xslt.xpt 0:53.04 config/makefiles/xpidl/dom_xul.xpt 0:53.04 config/makefiles/xpidl/downloads.xpt 0:53.06 config/makefiles/xpidl/editor.xpt 0:53.07 config/makefiles/xpidl/enterprisepolicies.xpt 0:53.12 config/makefiles/xpidl/extensions.xpt 0:53.26 config/makefiles/xpidl/exthandler.xpt 0:53.33 config/makefiles/xpidl/fastfind.xpt 0:53.35 config/makefiles/xpidl/fog.xpt 0:53.41 config/makefiles/xpidl/gfx.xpt 0:53.49 config/makefiles/xpidl/html5.xpt 0:53.56 config/makefiles/xpidl/htmlparser.xpt 0:53.62 config/makefiles/xpidl/http-sfv.xpt 0:53.66 config/makefiles/xpidl/imglib2.xpt 0:53.75 config/makefiles/xpidl/inspector.xpt 0:53.78 config/makefiles/xpidl/intl.xpt 0:53.84 config/makefiles/xpidl/jar.xpt 0:53.86 config/makefiles/xpidl/jsdebugger.xpt 0:53.92 config/makefiles/xpidl/jsinspector.xpt 0:54.02 config/makefiles/xpidl/kvstore.xpt 0:54.10 config/makefiles/xpidl/layout_base.xpt 0:54.14 config/makefiles/xpidl/layout_xul_tree.xpt 0:54.22 config/makefiles/xpidl/locale.xpt 0:54.32 config/makefiles/xpidl/loginmgr.xpt 0:54.35 config/makefiles/xpidl/migration.xpt 0:54.36 config/makefiles/xpidl/mimetype.xpt 0:54.52 config/makefiles/xpidl/mozfind.xpt 0:54.55 config/makefiles/xpidl/mozintl.xpt 0:54.67 config/makefiles/xpidl/necko.xpt 0:54.69 config/makefiles/xpidl/necko_about.xpt 0:54.91 config/makefiles/xpidl/necko_cache2.xpt 0:54.92 config/makefiles/xpidl/necko_cookie.xpt 0:54.93 config/makefiles/xpidl/necko_dns.xpt 0:54.93 config/makefiles/xpidl/necko_file.xpt 0:55.00 config/makefiles/xpidl/necko_http.xpt 0:55.19 config/makefiles/xpidl/necko_res.xpt 0:55.31 config/makefiles/xpidl/necko_socket.xpt 0:55.35 config/makefiles/xpidl/necko_strconv.xpt 0:55.36 config/makefiles/xpidl/necko_viewsource.xpt 0:55.43 config/makefiles/xpidl/necko_websocket.xpt 0:55.63 config/makefiles/xpidl/parentalcontrols.xpt 0:55.74 config/makefiles/xpidl/peerconnection.xpt 0:55.76 config/makefiles/xpidl/pipnss.xpt 0:55.85 config/makefiles/xpidl/places.xpt 0:56.02 config/makefiles/xpidl/plugin.xpt 0:56.04 config/makefiles/xpidl/pref.xpt 0:56.05 config/makefiles/xpidl/prefetch.xpt 0:56.09 config/makefiles/xpidl/profiler.xpt 0:56.34 config/makefiles/xpidl/remote.xpt 0:56.39 config/makefiles/xpidl/reputationservice.xpt 0:56.45 config/makefiles/xpidl/sandbox.xpt 0:56.63 config/makefiles/xpidl/satchel.xpt 0:56.65 config/makefiles/xpidl/services.xpt 0:56.69 config/makefiles/xpidl/sessionstore.xpt 0:56.71 config/makefiles/xpidl/shellservice.xpt 0:56.77 config/makefiles/xpidl/shistory.xpt 0:56.95 config/makefiles/xpidl/spellchecker.xpt 0:56.97 config/makefiles/xpidl/startupcache.xpt 0:57.02 config/makefiles/xpidl/storage.xpt 0:57.08 config/makefiles/xpidl/telemetry.xpt 0:57.08 config/makefiles/xpidl/thumbnails.xpt 0:57.28 config/makefiles/xpidl/toolkit_antitracking.xpt 0:57.31 config/makefiles/xpidl/toolkit_asyncshutdown.xpt 0:57.37 config/makefiles/xpidl/toolkit_backgroundtasks.xpt 0:57.45 config/makefiles/xpidl/toolkit_cleardata.xpt 0:57.57 config/makefiles/xpidl/toolkit_cookiebanners.xpt 0:57.67 config/makefiles/xpidl/toolkit_crashservice.xpt 0:57.71 config/makefiles/xpidl/toolkit_finalizationwitness.xpt 0:57.78 config/makefiles/xpidl/toolkit_modules.xpt 0:57.79 config/makefiles/xpidl/toolkit_osfile.xpt 0:57.80 config/makefiles/xpidl/toolkit_processtools.xpt 0:57.93 config/makefiles/xpidl/toolkit_search.xpt 0:58.01 config/makefiles/xpidl/toolkit_shell.xpt 0:58.08 config/makefiles/xpidl/toolkit_xulstore.xpt 0:58.13 config/makefiles/xpidl/toolkitprofile.xpt 0:58.15 config/makefiles/xpidl/txmgr.xpt 0:58.19 config/makefiles/xpidl/txtsvc.xpt 0:58.23 config/makefiles/xpidl/uconv.xpt 0:58.35 config/makefiles/xpidl/update.xpt 0:58.38 config/makefiles/xpidl/uriloader.xpt 0:58.43 config/makefiles/xpidl/url-classifier.xpt 0:58.49 config/makefiles/xpidl/urlformatter.xpt 0:58.50 config/makefiles/xpidl/viaduct.xpt 0:58.53 config/makefiles/xpidl/webBrowser_core.xpt 0:58.66 config/makefiles/xpidl/webbrowserpersist.xpt 0:58.68 config/makefiles/xpidl/webextensions.xpt 0:58.80 config/makefiles/xpidl/webextensions-storage.xpt 0:58.83 config/makefiles/xpidl/webvtt.xpt 0:58.92 config/makefiles/xpidl/widget.xpt 0:59.04 config/makefiles/xpidl/windowcreator.xpt 0:59.08 config/makefiles/xpidl/windowwatcher.xpt 0:59.13 config/makefiles/xpidl/xpcom_base.xpt 0:59.13 config/makefiles/xpidl/xpcom_components.xpt 0:59.15 config/makefiles/xpidl/xpcom_ds.xpt 0:59.24 config/makefiles/xpidl/xpcom_io.xpt 0:59.39 config/makefiles/xpidl/xpcom_system.xpt 0:59.56 config/makefiles/xpidl/xpcom_threads.xpt 0:59.61 config/makefiles/xpidl/xpconnect.xpt 0:59.77 config/makefiles/xpidl/xul.xpt 0:59.95 config/makefiles/xpidl/xulapp.xpt 1:00.05 config/makefiles/xpidl/zipwriter.xpt 1:00.50 config/makefiles/xpidl/xptdata.stub 1:18.35 toolkit/library/rust/force-cargo-library-build 1:18.36 testing/geckodriver/force-cargo-program-build 1:18.36 accessible/aom 1:18.36 accessible/generic 1:18.36 accessible/basetypes 1:18.36 accessible/base 1:18.36 accessible/html 1:18.36 accessible/atk 1:18.71 Blocking waiting for file lock on package cache 1:22.76 Blocking waiting for file lock on package cache 1:24.68 accessible/ipc/extension/other 1:26.74 Blocking waiting for file lock on package cache 1:26.80 Blocking waiting for file lock on package cache 1:26.84 Blocking waiting for file lock on package cache 1:27.06 accessible/ipc/other 1:27.36 Compiling proc-macro2 v1.0.43 1:28.69 Compiling quote v1.0.21 1:29.30 Compiling proc-macro2 v1.0.43 1:29.65 Compiling libc v0.2.132 1:30.63 Compiling quote v1.0.21 1:30.95 Compiling unicode-ident v1.0.1 1:31.12 Compiling syn v1.0.99 1:31.67 Compiling unicode-ident v1.0.1 1:31.84 Compiling syn v1.0.99 1:31.98 accessible/ipc 1:32.28 Compiling cfg-if v1.0.0 1:32.34 Compiling version_check v0.9.4 1:33.05 Compiling cfg-if v1.0.0 1:33.12 Compiling serde_derive v1.0.143 1:34.05 Compiling libc v0.2.132 1:35.15 Compiling autocfg v1.1.0 (/tmp/B.qx2tm3hd/BUILD/firefox-105.0/third_party/rust/autocfg) 1:35.16 Compiling itoa v1.0.3 1:35.24 Compiling serde v1.0.143 1:35.38 Compiling log v0.4.17 1:35.76 Compiling memchr v2.5.0 1:36.28 Compiling autocfg v1.1.0 (/tmp/B.qx2tm3hd/BUILD/firefox-105.0/third_party/rust/autocfg) 1:36.52 Compiling serde_derive v1.0.143 1:37.46 Compiling serde v1.0.143 1:38.67 Compiling bytes v1.2.1 1:38.72 Compiling futures-core v0.3.23 1:39.18 Compiling pin-project-lite v0.2.9 1:39.30 Compiling typenum v1.15.0 1:39.94 Compiling version_check v0.9.4 1:40.60 Compiling hashbrown v0.12.3 1:41.85 Compiling once_cell v1.13.1 1:42.24 Compiling fnv v1.0.7 1:42.30 Compiling futures-sink v0.3.23 1:42.37 Compiling futures-task v0.3.23 1:42.44 Compiling futures-util v0.3.23 1:42.80 Compiling ryu v1.0.11 1:42.96 Compiling matches v0.1.9 1:42.98 Compiling once_cell v1.13.1 1:43.04 Compiling num_threads v0.1.6 1:43.40 Compiling bitflags v1.3.2 1:43.47 Compiling log v0.4.17 1:43.50 Compiling smallvec v1.9.0 1:43.82 Compiling lazy_static v1.4.0 1:43.89 Compiling serde_json v1.0.83 1:43.94 Compiling mozbuild v0.1.0 (/tmp/B.qx2tm3hd/BUILD/firefox-105.0/build/rust/mozbuild) 1:44.01 Compiling time-macros v0.2.4 1:44.90 Compiling httparse v1.7.1 1:45.64 Compiling base64 v0.13.0 1:45.73 Compiling cc v1.0.73 1:46.55 Compiling percent-encoding v2.1.0 1:47.12 Compiling futures-channel v0.3.23 1:47.49 Compiling pin-utils v0.1.0 1:47.56 Compiling fastrand v1.8.0 1:48.24 accessible/xpcom 1:48.25 Compiling try-lock v0.2.3 1:48.36 Compiling bitflags v1.3.2 1:48.43 Compiling mime v0.3.16 1:49.77 Compiling httpdate v1.0.2 1:50.83 Compiling remove_dir_all v0.5.3 1:50.89 Compiling cpufeatures v0.2.2 1:50.95 Compiling crc32fast v1.3.2 1:51.92 Compiling semver v1.0.13 1:52.91 Compiling unicode-bidi v0.3.8 1:54.86 Compiling regex-syntax v0.6.27 1:55.26 Compiling pkg-config v0.3.25 1:55.72 Compiling safemem v0.3.3 1:55.82 Compiling adler v1.0.2 1:56.12 Compiling tower-service v0.3.2 1:56.20 Compiling os_str_bytes v6.3.0 1:56.76 Compiling linked-hash-map v0.5.6 1:57.08 Compiling same-file v1.0.6 1:57.37 Compiling xml-rs v0.8.4 2:00.75 In file included from /tmp/B.qx2tm3hd/BUILD/firefox-105.0/accessible/atk/RootAccessibleWrap.cpp:9: 2:00.75 /tmp/B.qx2tm3hd/BUILD/firefox-105.0/other-licenses/atk-1.0/atk/atkobject.h:632:3: warning: Deprecated pre-processor symbol: replace with "const" [-W#pragma-messages] 2:00.75 G_CONST_RETURN gchar* (*get_name)(AtkObject* accessible); 2:00.75 ^ 2:00.75 /usr/include/glib-2.0/glib/gmacros.h:997:30: note: expanded from macro 'G_CONST_RETURN' 2:00.75 #define G_CONST_RETURN const GLIB_DEPRECATED_MACRO_IN_2_30_FOR(const) 2:00.75 ^ 2:00.75 /usr/include/glib-2.0/glib/gversionmacros.h:455:49: note: expanded from macro 'GLIB_DEPRECATED_MACRO_IN_2_30_FOR' 2:00.75 # define GLIB_DEPRECATED_MACRO_IN_2_30_FOR(f) GLIB_DEPRECATED_MACRO_FOR(f) 2:00.75 ^ 2:00.75 /usr/include/glib-2.0/glib/gmacros.h:1156:3: note: expanded from macro 'GLIB_DEPRECATED_MACRO_FOR' 2:00.75 _GLIB_GNUC_DO_PRAGMA(GCC warning G_STRINGIFY (Deprecated pre-processor symbol: replace with #f)) 2:00.75 ^ 2:00.75 /usr/include/glib-2.0/glib/gmacros.h:1153:33: note: expanded from macro '_GLIB_GNUC_DO_PRAGMA' 2:00.75 #define _GLIB_GNUC_DO_PRAGMA(x) _Pragma(G_STRINGIFY (x)) 2:00.75 ^ 2:00.75 <scratch space>:175:6: note: expanded from here 2:00.75 GCC warning "Deprecated pre-processor symbol: replace with \"const\"" 2:00.75 ^ 2:00.75 In file included from /tmp/B.qx2tm3hd/BUILD/firefox-105.0/accessible/atk/RootAccessibleWrap.cpp:9: 2:00.75 /tmp/B.qx2tm3hd/BUILD/firefox-105.0/other-licenses/atk-1.0/atk/atkobject.h:636:3: warning: Deprecated pre-processor symbol: replace with "const" [-W#pragma-messages] 2:00.75 G_CONST_RETURN gchar* (*get_description)(AtkObject* accessible); 2:00.75 ^ 2:00.75 /usr/include/glib-2.0/glib/gmacros.h:997:30: note: expanded from macro 'G_CONST_RETURN' 2:00.75 #define G_CONST_RETURN const GLIB_DEPRECATED_MACRO_IN_2_30_FOR(const) 2:00.75 ^ 2:00.75 /usr/include/glib-2.0/glib/gversionmacros.h:455:49: note: expanded from macro 'GLIB_DEPRECATED_MACRO_IN_2_30_FOR' 2:00.75 # define GLIB_DEPRECATED_MACRO_IN_2_30_FOR(f) GLIB_DEPRECATED_MACRO_FOR(f) 2:00.75 ^ 2:00.75 /usr/include/glib-2.0/glib/gmacros.h:1156:3: note: expanded from macro 'GLIB_DEPRECATED_MACRO_FOR' 2:00.75 _GLIB_GNUC_DO_PRAGMA(GCC warning G_STRINGIFY (Deprecated pre-processor symbol: replace with #f)) 2:00.75 ^ 2:00.75 /usr/include/glib-2.0/glib/gmacros.h:1153:33: note: expanded from macro '_GLIB_GNUC_DO_PRAGMA' 2:00.75 #define _GLIB_GNUC_DO_PRAGMA(x) _Pragma(G_STRINGIFY (x)) 2:00.75 ^ 2:00.75 <scratch space>:3:6: note: expanded from here 2:00.75 GCC warning "Deprecated pre-processor symbol: replace with \"const\"" 2:00.75 ^ 2:00.75 In file included from /tmp/B.qx2tm3hd/BUILD/firefox-105.0/accessible/atk/RootAccessibleWrap.cpp:9: 2:00.75 /tmp/B.qx2tm3hd/BUILD/firefox-105.0/other-licenses/atk-1.0/atk/atkobject.h:773:1: warning: Deprecated pre-processor symbol: replace with "const" [-W#pragma-messages] 2:00.75 G_CONST_RETURN gchar* atk_object_get_name(AtkObject* accessible); 2:00.75 ^ 2:00.75 /usr/include/glib-2.0/glib/gmacros.h:997:30: note: expanded from macro 'G_CONST_RETURN' 2:00.75 #define G_CONST_RETURN const GLIB_DEPRECATED_MACRO_IN_2_30_FOR(const) 2:00.75 ^ 2:00.75 /usr/include/glib-2.0/glib/gversionmacros.h:455:49: note: expanded from macro 'GLIB_DEPRECATED_MACRO_IN_2_30_FOR' 2:00.75 # define GLIB_DEPRECATED_MACRO_IN_2_30_FOR(f) GLIB_DEPRECATED_MACRO_FOR(f) 2:00.75 ^ 2:00.75 /usr/include/glib-2.0/glib/gmacros.h:1156:3: note: expanded from macro 'GLIB_DEPRECATED_MACRO_FOR' 2:00.75 _GLIB_GNUC_DO_PRAGMA(GCC warning G_STRINGIFY (Deprecated pre-processor symbol: replace with #f)) 2:00.75 ^ 2:00.75 /usr/include/glib-2.0/glib/gmacros.h:1153:33: note: expanded from macro '_GLIB_GNUC_DO_PRAGMA' 2:00.75 #define _GLIB_GNUC_DO_PRAGMA(x) _Pragma(G_STRINGIFY (x)) 2:00.75 ^ 2:00.75 <scratch space>:8:6: note: expanded from here 2:00.75 GCC warning "Deprecated pre-processor symbol: replace with \"const\"" 2:00.75 ^ 2:00.75 In file included from /tmp/B.qx2tm3hd/BUILD/firefox-105.0/accessible/atk/RootAccessibleWrap.cpp:9: 2:00.76 /tmp/B.qx2tm3hd/BUILD/firefox-105.0/other-licenses/atk-1.0/atk/atkobject.h:774:1: warning: Deprecated pre-processor symbol: replace with "const" [-W#pragma-messages] 2:00.76 G_CONST_RETURN gchar* atk_object_get_description(AtkObject* accessible); 2:00.76 ^ 2:00.76 /usr/include/glib-2.0/glib/gmacros.h:997:30: note: expanded from macro 'G_CONST_RETURN' 2:00.76 #define G_CONST_RETURN const GLIB_DEPRECATED_MACRO_IN_2_30_FOR(const) 2:00.76 ^ 2:00.76 /usr/include/glib-2.0/glib/gversionmacros.h:455:49: note: expanded from macro 'GLIB_DEPRECATED_MACRO_IN_2_30_FOR' 2:00.76 # define GLIB_DEPRECATED_MACRO_IN_2_30_FOR(f) GLIB_DEPRECATED_MACRO_FOR(f) 2:00.76 ^ 2:00.76 /usr/include/glib-2.0/glib/gmacros.h:1156:3: note: expanded from macro 'GLIB_DEPRECATED_MACRO_FOR' 2:00.76 _GLIB_GNUC_DO_PRAGMA(GCC warning G_STRINGIFY (Deprecated pre-processor symbol: replace with #f)) 2:00.76 ^ 2:00.76 /usr/include/glib-2.0/glib/gmacros.h:1153:33: note: expanded from macro '_GLIB_GNUC_DO_PRAGMA' 2:00.76 #define _GLIB_GNUC_DO_PRAGMA(x) _Pragma(G_STRINGIFY (x)) 2:00.76 ^ 2:00.76 <scratch space>:13:6: note: expanded from here 2:00.76 GCC warning "Deprecated pre-processor symbol: replace with \"const\"" 2:00.76 ^ 2:00.76 In file included from /tmp/B.qx2tm3hd/BUILD/firefox-105.0/accessible/atk/RootAccessibleWrap.cpp:9: 2:00.76 /tmp/B.qx2tm3hd/BUILD/firefox-105.0/other-licenses/atk-1.0/atk/atkobject.h:800:1: warning: Deprecated pre-processor symbol: replace with "const" [-W#pragma-messages] 2:00.76 G_CONST_RETURN gchar* atk_role_get_name(AtkRole role); 2:00.76 ^ 2:00.76 /usr/include/glib-2.0/glib/gmacros.h:997:30: note: expanded from macro 'G_CONST_RETURN' 2:00.76 #define G_CONST_RETURN const GLIB_DEPRECATED_MACRO_IN_2_30_FOR(const) 2:00.76 ^ 2:00.76 /usr/include/glib-2.0/glib/gversionmacros.h:455:49: note: expanded from macro 'GLIB_DEPRECATED_MACRO_IN_2_30_FOR' 2:00.76 # define GLIB_DEPRECATED_MACRO_IN_2_30_FOR(f) GLIB_DEPRECATED_MACRO_FOR(f) 2:00.76 ^ 2:00.76 /usr/include/glib-2.0/glib/gmacros.h:1156:3: note: expanded from macro 'GLIB_DEPRECATED_MACRO_FOR' 2:00.76 _GLIB_GNUC_DO_PRAGMA(GCC warning G_STRINGIFY (Deprecated pre-processor symbol: replace with #f)) 2:00.76 ^ 2:00.76 /usr/include/glib-2.0/glib/gmacros.h:1153:33: note: expanded from macro '_GLIB_GNUC_DO_PRAGMA' 2:00.76 #define _GLIB_GNUC_DO_PRAGMA(x) _Pragma(G_STRINGIFY (x)) 2:00.76 ^ 2:00.76 <scratch space>:18:6: note: expanded from here 2:00.76 GCC warning "Deprecated pre-processor symbol: replace with \"const\"" 2:00.76 ^ 2:00.76 In file included from /tmp/B.qx2tm3hd/BUILD/firefox-105.0/accessible/atk/RootAccessibleWrap.cpp:9: 2:00.77 /tmp/B.qx2tm3hd/BUILD/firefox-105.0/other-licenses/atk-1.0/atk/atkobject.h:810:1: warning: Deprecated pre-processor symbol: replace with "const" [-W#pragma-messages] 2:00.77 G_CONST_RETURN gchar* atk_role_get_localized_name(AtkRole role); 2:00.77 ^ 2:00.77 /usr/include/glib-2.0/glib/gmacros.h:997:30: note: expanded from macro 'G_CONST_RETURN' 2:00.77 #define G_CONST_RETURN const GLIB_DEPRECATED_MACRO_IN_2_30_FOR(const) 2:00.77 ^ 2:00.77 /usr/include/glib-2.0/glib/gversionmacros.h:455:49: note: expanded from macro 'GLIB_DEPRECATED_MACRO_IN_2_30_FOR' 2:00.77 # define GLIB_DEPRECATED_MACRO_IN_2_30_FOR(f) GLIB_DEPRECATED_MACRO_FOR(f) 2:00.77 ^ 2:00.77 /usr/include/glib-2.0/glib/gmacros.h:1156:3: note: expanded from macro 'GLIB_DEPRECATED_MACRO_FOR' 2:00.77 _GLIB_GNUC_DO_PRAGMA(GCC warning G_STRINGIFY (Deprecated pre-processor symbol: replace with #f)) 2:00.77 ^ 2:00.77 /usr/include/glib-2.0/glib/gmacros.h:1153:33: note: expanded from macro '_GLIB_GNUC_DO_PRAGMA' 2:00.77 #define _GLIB_GNUC_DO_PRAGMA(x) _Pragma(G_STRINGIFY (x)) 2:00.77 ^ 2:00.77 <scratch space>:23:6: note: expanded from here 2:00.77 GCC warning "Deprecated pre-processor symbol: replace with \"const\"" 2:00.77 ^ 2:01.02 Compiling memchr v2.5.0 2:01.60 6 warnings generated. 2:01.82 Compiling encoding_rs v0.8.31 2:02.74 Compiling byteorder v1.4.3 2:03.28 Compiling itoa v1.0.3 2:03.58 Compiling strsim v0.10.0 2:04.76 Compiling unix_str v1.0.0 2:05.71 Compiling scoped-tls v1.0.0 2:05.84 Compiling geckodriver v0.31.0 (/tmp/B.qx2tm3hd/BUILD/firefox-105.0/testing/geckodriver) 2:06.37 Compiling minimal-lexical v0.2.1 2:07.11 /tmp/B.qx2tm3hd/BUILD/firefox-105.0/accessible/atk/UtilInterface.cpp:237:23: warning: 'gtk_key_snooper_install' is deprecated [-Wdeprecated-declarations] 2:07.11 sKey_snooper_id = gtk_key_snooper_install(mai_key_snooper, data); 2:07.12 ^ 2:07.12 /usr/include/gtk-3.0/gtk/gtkmain.h:184:1: note: 'gtk_key_snooper_install' has been explicitly marked deprecated here 2:07.12 GDK_DEPRECATED_IN_3_4 2:07.12 ^ 2:07.12 /usr/include/gtk-3.0/gdk/gdkversionmacros.h:286:47: note: expanded from macro 'GDK_DEPRECATED_IN_3_4' 2:07.12 # define GDK_DEPRECATED_IN_3_4 GDK_DEPRECATED 2:07.12 ^ 2:07.12 /usr/include/gtk-3.0/gdk/gdkversionmacros.h:48:24: note: expanded from macro 'GDK_DEPRECATED' 2:07.12 #define GDK_DEPRECATED G_DEPRECATED _GDK_EXTERN 2:07.12 ^ 2:07.12 /usr/include/glib-2.0/glib/gmacros.h:1103:37: note: expanded from macro 'G_DEPRECATED' 2:07.12 #define G_DEPRECATED __attribute__((__deprecated__)) 2:07.12 ^ 2:07.12 /tmp/B.qx2tm3hd/BUILD/firefox-105.0/accessible/atk/UtilInterface.cpp:257:5: warning: 'gtk_key_snooper_remove' is deprecated [-Wdeprecated-declarations] 2:07.12 gtk_key_snooper_remove(sKey_snooper_id); 2:07.12 ^ 2:07.12 /usr/include/gtk-3.0/gtk/gtkmain.h:187:1: note: 'gtk_key_snooper_remove' has been explicitly marked deprecated here 2:07.12 GDK_DEPRECATED_IN_3_4 2:07.12 ^ 2:07.12 /usr/include/gtk-3.0/gdk/gdkversionmacros.h:286:47: note: expanded from macro 'GDK_DEPRECATED_IN_3_4' 2:07.12 # define GDK_DEPRECATED_IN_3_4 GDK_DEPRECATED 2:07.12 ^ 2:07.12 /usr/include/gtk-3.0/gdk/gdkversionmacros.h:48:24: note: expanded from macro 'GDK_DEPRECATED' 2:07.12 #define GDK_DEPRECATED G_DEPRECATED _GDK_EXTERN 2:07.12 ^ 2:07.12 /usr/include/glib-2.0/glib/gmacros.h:1103:37: note: expanded from macro 'G_DEPRECATED' 2:07.12 #define G_DEPRECATED __attribute__((__deprecated__)) 2:07.12 ^ 2:07.14 Compiling matches v0.1.9 2:07.22 Compiling scopeguard v1.1.0 2:07.37 Compiling serde_json v1.0.83 2:07.66 Compiling unicode-segmentation v1.9.0 2:08.02 2 warnings generated. 2:08.52 Compiling ryu v1.0.11 2:08.80 accessible/xul 2:09.17 Compiling thin-vec v0.2.5 2:09.31 Compiling byteorder v1.4.3 2:09.66 Compiling glob v0.3.0 2:09.85 Compiling rust-ini v0.10.3 2:10.01 browser/app 2:11.43 Compiling lazy_static v1.4.0 2:11.52 Compiling strsim v0.10.0 2:12.47 Compiling generic-array v0.14.6 2:12.63 memory/build 2:12.71 Compiling unicase v2.6.0 2:12.97 Compiling cookie v0.16.0 2:12.98 Compiling unicode-bidi v0.3.8 2:13.34 Compiling indexmap v1.9.1 2:13.57 Compiling slab v0.4.7 2:13.81 Compiling num-traits v0.2.15 2:13.87 Compiling num-integer v0.1.45 2:14.12 Compiling tracing-core v0.1.29 2:14.23 Compiling http v0.2.8 2:14.45 memory/mozalloc 2:14.98 mfbt 2:15.02 warning: unknown warning option '-Werror=trampolines' [-Wunknown-warning-option] 2:15.93 Compiling semver v1.0.13 2:16.51 mozglue/baseprofiler 2:16.90 Compiling tinyvec v1.999.999 (/tmp/B.qx2tm3hd/BUILD/firefox-105.0/build/rust/tinyvec) 2:16.93 Compiling threadbound v0.1.4 2:17.03 Compiling form_urlencoded v1.0.1 2:17.05 Compiling anyhow v1.0.61 2:17.66 1 warning generated. 2:17.69 warning: unknown warning option '-Werror=trampolines' [-Wunknown-warning-option] 2:17.75 Compiling line-wrap v0.1.1 2:17.92 Compiling miniz_oxide v0.5.3 2:18.24 1 warning generated. 2:18.28 warning: unknown warning option '-Werror=trampolines' [-Wunknown-warning-option] 2:18.33 Compiling regex-syntax v0.6.27 2:19.79 Compiling clap_lex v0.2.4 2:21.09 Compiling yaml-rust v0.4.5 2:21.84 Compiling walkdir v2.3.2 2:22.35 1 warning generated. 2:22.39 warning: unknown warning option '-Werror=trampolines' [-Wunknown-warning-option] 2:23.95 Compiling unix_path v1.0.1 2:25.65 1 warning generated. 2:26.19 mozglue/build 2:26.25 mozglue/misc 2:31.17 xpcom/glue/standalone 2:33.55 Compiling headers-core v0.2.0 2:33.66 Compiling http-body v0.4.5 2:34.24 Compiling unicode-normalization v0.1.21 2:36.02 browser/components/about 2:37.58 browser/components/shell 2:37.83 Compiling socket2 v0.4.4 2:38.45 Compiling percent-encoding v2.1.0 2:38.72 Compiling time v0.3.9 2:39.05 Compiling crossbeam-utils v0.8.11 2:39.46 Compiling termcolor v1.1.3 2:40.02 Compiling tempfile v3.3.0 2:40.81 Compiling ident_case v1.0.1 2:40.96 Compiling fnv v1.0.7 2:41.05 Compiling radium v0.5.3 2:41.62 Compiling tap v1.0.1 2:41.75 Compiling wyz v0.2.0 2:41.81 Compiling terminal_size v0.1.17 2:41.93 Compiling getrandom v0.2.7 2:42.01 Compiling funty v1.1.0 2:42.31 Compiling time v0.1.44 2:45.37 Compiling mio v0.8.0 2:45.68 Compiling camino v1.1.1 2:46.12 caps 2:47.55 Compiling want v0.3.0 2:49.06 Compiling aho-corasick v0.7.18 2:49.17 /tmp/B.qx2tm3hd/BUILD/firefox-105.0/browser/components/shell/nsGNOMEShellService.cpp:473:22: warning: 'gdk_color_parse' is deprecated: Use 'gdk_rgba_parse' instead [-Wdeprecated-declarations] 2:49.17 gboolean success = gdk_color_parse(background.get(), &color); 2:49.17 ^ 2:49.17 /usr/include/gtk-3.0/gdk/deprecated/gdkcolor.h:78:1: note: 'gdk_color_parse' has been explicitly marked deprecated here 2:49.17 GDK_DEPRECATED_IN_3_14_FOR(gdk_rgba_parse) 2:49.17 ^ 2:49.17 /usr/include/gtk-3.0/gdk/gdkversionmacros.h:357:47: note: expanded from macro 'GDK_DEPRECATED_IN_3_14_FOR' 2:49.17 # define GDK_DEPRECATED_IN_3_14_FOR(f) GDK_DEPRECATED_FOR(f) 2:49.17 ^ 2:49.17 /usr/include/gtk-3.0/gdk/gdkversionmacros.h:49:31: note: expanded from macro 'GDK_DEPRECATED_FOR' 2:49.17 #define GDK_DEPRECATED_FOR(f) G_DEPRECATED_FOR(f) _GDK_EXTERN 2:49.17 ^ 2:49.17 /usr/include/glib-2.0/glib/gmacros.h:1113:44: note: expanded from macro 'G_DEPRECATED_FOR' 2:49.17 #define G_DEPRECATED_FOR(f) __attribute__((__deprecated__("Use '" #f "' instead"))) 2:49.17 ^ 2:49.74 chrome 2:50.18 1 warning generated. 2:50.21 config/external/rlbox 2:51.12 devtools/platform 2:51.54 In file included from /tmp/B.qx2tm3hd/BUILD/firefox-105.0/config/external/rlbox/rlbox_thread_locals.cpp:12: 2:51.54 In file included from /tmp/B.qx2tm3hd/BUILD/firefox-105.0/obj-i686/dist/include/mozilla/rlbox/rlbox.hpp:15: 2:51.54 /tmp/B.qx2tm3hd/BUILD/firefox-105.0/obj-i686/dist/include/mozilla/rlbox/rlbox_stdlib.hpp:231:29: warning: result of comparison 'size_t' (aka 'unsigned int') <= 4294967295 is always true [-Wtautological-type-limit-compare] 2:51.54 detail::dynamic_check(num <= std::numeric_limits<uint32_t>::max(), 2:51.55 ~~~ ^ ~~~~~~~~~~~~~~~~~~~~~~~~~~~~~~~~~~~~ 2:51.65 1 warning generated. 2:51.67 devtools/shared/heapsnapshot 2:54.65 Compiling idna v0.2.3 2:54.78 docshell/base 2:56.80 Compiling flate2 v1.0.24 2:57.20 docshell/base/timeline 2:59.46 Compiling mozprofile v0.8.0 (/tmp/B.qx2tm3hd/BUILD/firefox-105.0/testing/mozbase/rust/mozprofile) 3:02.90 docshell/build 3:07.23 docshell/shistory 3:07.56 dom/abort 3:07.81 Compiling textwrap v0.15.0 3:09.60 Compiling mime_guess v2.0.4 3:11.15 Compiling bindgen v0.59.2 3:12.73 Compiling futures-task v0.3.23 3:13.23 Compiling humantime v2.1.0 3:13.52 Compiling tokio v1.17.0 3:14.30 Compiling lazycell v1.3.0 3:14.43 Compiling peeking_take_while v0.1.2 3:14.52 Compiling rustc-hash v1.1.0 3:14.61 dom/animation 3:14.63 Compiling shlex v1.1.0 3:15.26 Compiling paste v1.0.8 3:16.03 dom/audiochannel 3:20.25 Compiling mime v0.3.16 3:21.78 Compiling parking_lot_core v0.8.5 3:22.29 Compiling static_assertions v1.1.0 3:22.36 Compiling unicode-xid v0.2.3 3:23.57 Compiling ppv-lite86 v0.2.16 3:24.24 dom/base 3:24.33 Compiling askama_escape v0.10.3 3:24.45 Compiling heck v0.4.0 3:26.35 Compiling hashbrown v0.12.3 3:27.60 Compiling siphasher v0.3.10 3:29.01 Compiling os_str_bytes v6.3.0 3:30.79 Compiling tinystr v0.3.4 3:31.34 Compiling vcpkg v0.2.999 (/tmp/B.qx2tm3hd/BUILD/firefox-105.0/build/rust/vcpkg) 3:31.45 Compiling bytes v1.2.1 3:32.66 dom/battery 3:33.45 Compiling textwrap v0.15.0 3:35.92 Compiling base64 v0.13.0 3:36.58 Compiling regex v1.6.0 3:39.08 Compiling fs-err v2.7.0 3:39.12 dom/bindings 3:40.36 Compiling cmake v0.1.999 (/tmp/B.qx2tm3hd/BUILD/firefox-105.0/build/rust/cmake) 3:40.43 Compiling futures v0.1.31 3:44.36 Compiling proc-macro-hack v0.5.19 3:45.35 Compiling arrayref v0.3.6 3:45.42 Compiling futures-core v0.3.23 3:45.83 Compiling typenum v1.15.0 3:48.03 Compiling block-buffer v0.10.2 3:48.30 Compiling crypto-common v0.1.6 3:48.48 Compiling url v2.1.0 3:48.67 Compiling async-task v4.0.3 (https://github.com/smol-rs/async-task?rev=f6488e35beccb26eb6e85847b02aa78a42cd3d0e#f6488e35) 3:49.13 Compiling id-arena v2.2.1 3:49.34 Compiling crc32fast v1.3.2 3:50.27 Compiling fallible-iterator v0.2.0 3:51.05 Compiling futures-channel v0.3.23 3:51.42 Compiling fallible-streaming-iterator v0.1.9 3:51.44 dom/broadcastchannel 3:51.65 Compiling futures-sink v0.3.23 3:51.77 Compiling khronos_api v3.1.0 3:52.98 Compiling futures-util v0.3.23 3:53.37 Compiling adler v1.0.2 3:53.65 Compiling maybe-uninit v2.0.0 3:53.80 In file included from /tmp/B.qx2tm3hd/BUILD/firefox-105.0/dom/base/nsContentUtils.cpp:28: 3:53.80 /tmp/B.qx2tm3hd/BUILD/firefox-105.0/security/manager/ssl/ScopedNSSTypes.h:282:22: warning: result of comparison 'mozilla::Span::index_type' (aka 'unsigned int') > 4294967295 is always false [-Wtautological-type-limit-compare] 3:53.81 if (key.Length() > std::numeric_limits<unsigned int>::max()) { 3:53.81 ~~~~~~~~~~~~ ^ ~~~~~~~~~~~~~~~~~~~~~~~~~~~~~~~~~~~~~~~~ 3:54.28 Compiling zip v0.6.2 3:54.66 Compiling rayon-core v1.9.3 3:54.89 Compiling pin-project-lite v0.2.9 3:54.98 Compiling smallbitvec v2.5.1 3:55.62 Compiling stable_deref_trait v1.2.0 3:55.71 Compiling futures-io v0.3.23 3:56.12 Compiling pin-utils v0.1.0 3:56.18 Compiling void v1.0.2 3:56.29 Compiling atomic_refcell v0.1.8 3:56.45 Compiling dtoa v0.4.8 3:56.74 Compiling neqo-common v0.5.7 (/tmp/B.qx2tm3hd/BUILD/firefox-105.0/third_party/rust/neqo-common) 3:57.13 Compiling clap v3.1.18 3:57.34 Compiling xml-rs v0.8.4 4:00.13 In file included from RegisterBindings.cpp:424: 4:00.13 In file included from /tmp/B.qx2tm3hd/BUILD/firefox-105.0/obj-i686/dist/include/mozilla/dom/RTCStatsReportBinding.h:6: 4:00.13 In file included from /tmp/B.qx2tm3hd/BUILD/firefox-105.0/obj-i686/dist/include/mozilla/dom/RTCConfigurationBinding.h:13: 4:00.13 In file included from /tmp/B.qx2tm3hd/BUILD/firefox-105.0/obj-i686/dist/include/mozilla/dom/RTCCertificate.h:11: 4:00.13 /tmp/B.qx2tm3hd/BUILD/firefox-105.0/obj-i686/dist/include/ScopedNSSTypes.h:282:22: warning: result of comparison 'mozilla::Span::index_type' (aka 'unsigned int') > 4294967295 is always false [-Wtautological-type-limit-compare] 4:00.13 if (key.Length() > std::numeric_limits<unsigned int>::max()) { 4:00.13 ~~~~~~~~~~~~ ^ ~~~~~~~~~~~~~~~~~~~~~~~~~~~~~~~~~~~~~~~~ 4:02.96 Compiling tokio-stream v0.1.9 4:04.07 Compiling mozversion v0.5.0-alpha (/tmp/B.qx2tm3hd/BUILD/firefox-105.0/testing/mozbase/rust/mozversion) 4:06.59 Compiling nss_build_common v0.1.0 (https://github.com/mozilla/application-services?rev=2689788cecf24c385e6b7440e3aa1a89c511f14a#2689788c) 4:06.87 Compiling chrono v0.4.19 4:07.54 Compiling async-trait v0.1.57 4:08.67 Compiling self_cell v0.10.2 4:08.78 Compiling either v1.7.0 4:09.01 Compiling fastrand v1.8.0 4:09.31 dom/cache 4:09.43 dom/canvas 4:09.43 1 warning generated. 4:09.64 Compiling rust_decimal v1.26.1 4:10.75 Compiling remove_dir_all v0.5.3 4:10.82 Compiling bit-vec v0.6.3 4:11.31 Compiling nix v0.15.0 4:11.74 Compiling chunky-vec v0.1.0 4:11.89 Compiling ash v0.37.0+1.3.209 4:12.12 Compiling same-file v1.0.6 4:12.48 Compiling precomputed-hash v0.1.1 4:12.56 Compiling new_debug_unreachable v1.0.4 4:12.62 Compiling data-encoding v2.3.2 4:13.19 Compiling digest v0.10.3 4:15.53 Compiling sha-1 v0.10.0 4:15.60 1 warning generated. 4:16.53 Compiling headers v0.3.7 4:20.29 Compiling unicode-width v0.1.9 4:20.42 Compiling khronos-egl v4.1.0 4:20.63 Compiling replace_with v0.1.7 4:20.73 Compiling cpufeatures v0.2.2 4:20.80 Compiling cfg_aliases v0.1.1 4:20.87 Compiling cty v0.2.2 4:20.94 Compiling hexf-parse v0.2.1 4:21.29 Compiling error-support v0.1.0 (https://github.com/mozilla/application-services?rev=2689788cecf24c385e6b7440e3aa1a89c511f14a#2689788c) 4:21.65 Compiling renderdoc-sys v0.7.1 4:21.91 Compiling glow v0.11.2 4:26.85 In file included from RegisterWorkerBindings.cpp:109: 4:26.85 In file included from /tmp/B.qx2tm3hd/BUILD/firefox-105.0/obj-i686/dist/include/mozilla/dom/SubtleCryptoBinding.h:11: 4:26.85 In file included from /tmp/B.qx2tm3hd/BUILD/firefox-105.0/obj-i686/dist/include/mozilla/dom/CryptoKey.h:12: 4:26.85 /tmp/B.qx2tm3hd/BUILD/firefox-105.0/obj-i686/dist/include/ScopedNSSTypes.h:282:22: warning: result of comparison 'mozilla::Span::index_type' (aka 'unsigned int') > 4294967295 is always false [-Wtautological-type-limit-compare] 4:26.85 if (key.Length() > std::numeric_limits<unsigned int>::max()) { 4:26.85 ~~~~~~~~~~~~ ^ ~~~~~~~~~~~~~~~~~~~~~~~~~~~~~~~~~~~~~~~~ 4:29.39 1 warning generated. 4:29.69 Compiling inplace_it v0.3.4 4:31.24 Compiling encoding_c_mem v0.2.6 4:31.58 Compiling svg_fmt v0.4.1 4:32.28 Compiling cose v0.1.4 4:32.51 Compiling tracing-attributes v0.1.22 4:32.60 Compiling murmurhash3 v0.0.5 4:32.83 Compiling profiling v1.0.6 4:32.89 Compiling binary-space-partition v0.1.2 4:33.02 Compiling encoding_c v0.9.8 4:33.40 Compiling memalloc v0.1.0 4:33.61 Compiling topological-sort v0.1.0 4:33.79 Compiling copyless v0.1.5 4:33.90 Compiling moz_cbor v0.1.2 4:35.60 Compiling cache-padded v1.2.0 4:35.69 Compiling unicode-segmentation v1.9.0 4:37.18 Compiling authenticator v0.3.1 4:37.38 Compiling tracy-rs v0.1.2 4:37.50 Compiling quick-error v1.2.3 4:37.60 Compiling mozilla-central-workspace-hack v0.1.0 (/tmp/B.qx2tm3hd/BUILD/firefox-105.0/build/workspace-hack) 4:37.70 Compiling rustc-demangle v0.1.21 4:40.80 Compiling runloop v0.1.0 4:41.22 Compiling prefs_parser v0.0.1 (/tmp/B.qx2tm3hd/BUILD/firefox-105.0/modules/libpref/parser) 4:42.27 Compiling dap_ffi v0.1.0 (/tmp/B.qx2tm3hd/BUILD/firefox-105.0/toolkit/components/telemetry/dap/ffi) 4:42.52 Compiling cfg-if v0.1.999 (/tmp/B.qx2tm3hd/BUILD/firefox-105.0/build/rust/cfg-if) 4:42.59 Compiling instant v0.1.12 4:42.69 Compiling libloading v0.7.3 4:43.18 Compiling bitreader v0.3.6 4:43.89 Compiling num-traits v0.2.15 4:44.13 Compiling indexmap v1.9.1 4:44.38 Compiling slab v0.4.7 4:44.66 Compiling num-integer v0.1.45 4:44.90 Compiling lock_api v0.4.7 4:45.38 Compiling crossbeam-utils v0.7.2 4:45.47 In file included from /tmp/B.qx2tm3hd/BUILD/firefox-105.0/dom/base/nsGlobalWindowInner.cpp:19: 4:45.47 In file included from /tmp/B.qx2tm3hd/BUILD/firefox-105.0/dom/base/Crypto.h:10: 4:45.47 In file included from /tmp/B.qx2tm3hd/BUILD/firefox-105.0/obj-i686/dist/include/mozilla/dom/SubtleCrypto.h:13: 4:45.47 In file included from /tmp/B.qx2tm3hd/BUILD/firefox-105.0/obj-i686/dist/include/mozilla/dom/CryptoKey.h:12: 4:45.47 /tmp/B.qx2tm3hd/BUILD/firefox-105.0/security/manager/ssl/ScopedNSSTypes.h:282:22: warning: result of comparison 'mozilla::Span::index_type' (aka 'unsigned int') > 4294967295 is always false [-Wtautological-type-limit-compare] 4:45.47 if (key.Length() > std::numeric_limits<unsigned int>::max()) { 4:45.47 ~~~~~~~~~~~~ ^ ~~~~~~~~~~~~~~~~~~~~~~~~~~~~~~~~~~~~~~~~ 4:45.64 Compiling memoffset v0.6.5 4:45.89 Compiling memoffset v0.5.6 4:46.13 Compiling crossbeam-epoch v0.9.10 4:46.48 Compiling crossbeam-epoch v0.8.2 4:46.71 Compiling rayon v1.5.3 4:46.94 Compiling ahash v0.7.6 4:47.43 Compiling unicase v2.6.0 4:47.76 Compiling nom v6.1.2 4:47.98 Compiling proc-macro-error-attr v1.0.4 4:48.31 Compiling proc-macro-error v1.0.4 4:48.60 Compiling generic-array v0.14.6 4:48.83 Compiling error-chain v0.12.4 4:49.10 Compiling gpu-alloc-types v0.2.0 4:49.50 Compiling dom v0.1.0 (/tmp/B.qx2tm3hd/BUILD/firefox-105.0/dom/base/rust) 4:50.38 Compiling gpu-descriptor-types v0.1.1 4:50.73 Compiling whatsys v0.1.2 4:51.25 Compiling glslopt v0.1.9 4:52.21 Compiling audioipc v0.2.5 (https://github.com/mozilla/audioipc?rev=fb7a2b12ced3b43e6a268621989c6191d1ed7e39#fb7a2b12) 4:52.63 Compiling audioipc2 v0.5.0 (https://github.com/kinetiknz/audioipc-2?rev=499b95580c8b276e52bd9757d735249504202e5c#499b9558) 4:53.02 Compiling lmdb-rkv-sys v0.11.2 4:53.13 In file included from WebIDLSerializable.cpp:9: 4:53.13 In file included from /tmp/B.qx2tm3hd/BUILD/firefox-105.0/obj-i686/dist/include/mozilla/dom/SubtleCryptoBinding.h:11: 4:53.13 In file included from /tmp/B.qx2tm3hd/BUILD/firefox-105.0/obj-i686/dist/include/mozilla/dom/CryptoKey.h:12: 4:53.13 /tmp/B.qx2tm3hd/BUILD/firefox-105.0/obj-i686/dist/include/ScopedNSSTypes.h:282:22: warning: result of comparison 'mozilla::Span::index_type' (aka 'unsigned int') > 4294967295 is always false [-Wtautological-type-limit-compare] 4:53.13 if (key.Length() > std::numeric_limits<unsigned int>::max()) { 4:53.13 ~~~~~~~~~~~~ ^ ~~~~~~~~~~~~~~~~~~~~~~~~~~~~~~~~~~~~~~~~ 4:53.62 Compiling libdbus-sys v0.2.2 4:53.98 Compiling alsa-sys v0.3.1 4:55.07 Compiling fxhash v0.2.1 4:55.30 Compiling clang-sys v1.3.3 4:55.96 1 warning generated. 4:56.36 Compiling pin-project-internal v1.0.12 4:56.70 Compiling phf_shared v0.10.0 4:57.28 Compiling clap_lex v0.2.4 4:59.14 Compiling unic-langid-impl v0.9.0 5:01.40 Compiling libsqlite3-sys v0.24.2 5:01.82 Compiling type-map v0.4.0 5:02.18 Compiling cubeb-sys v0.10.0 5:02.20 In file included from /tmp/B.qx2tm3hd/BUILD/firefox-105.0/dom/base/nsGlobalWindowOuter.cpp:134: 5:02.20 In file included from /tmp/B.qx2tm3hd/BUILD/firefox-105.0/dom/base/Crypto.h:10: 5:02.20 In file included from /tmp/B.qx2tm3hd/BUILD/firefox-105.0/obj-i686/dist/include/mozilla/dom/SubtleCrypto.h:13: 5:02.20 In file included from /tmp/B.qx2tm3hd/BUILD/firefox-105.0/obj-i686/dist/include/mozilla/dom/CryptoKey.h:12: 5:02.20 /tmp/B.qx2tm3hd/BUILD/firefox-105.0/security/manager/ssl/ScopedNSSTypes.h:282:22: warning: result of comparison 'mozilla::Span::index_type' (aka 'unsigned int') > 4294967295 is always false [-Wtautological-type-limit-compare] 5:02.20 if (key.Length() > std::numeric_limits<unsigned int>::max()) { 5:02.20 ~~~~~~~~~~~~ ^ ~~~~~~~~~~~~~~~~~~~~~~~~~~~~~~~~~~~~~~~~ 5:03.14 Compiling miniz_oxide v0.5.3 5:07.13 In file included from UnifiedBindings0.cpp:145: 5:07.13 In file included from /tmp/B.qx2tm3hd/BUILD/firefox-105.0/obj-i686/dom/bindings/AnimatableBinding.cpp:23: 5:07.13 In file included from /tmp/B.qx2tm3hd/BUILD/firefox-105.0/obj-i686/dist/include/mozilla/dom/UnionConversions.h:90: 5:07.13 In file included from /tmp/B.qx2tm3hd/BUILD/firefox-105.0/obj-i686/dist/include/mozilla/dom/SubtleCryptoBinding.h:11: 5:07.13 In file included from /tmp/B.qx2tm3hd/BUILD/firefox-105.0/obj-i686/dist/include/mozilla/dom/CryptoKey.h:12: 5:07.14 /tmp/B.qx2tm3hd/BUILD/firefox-105.0/obj-i686/dist/include/ScopedNSSTypes.h:282:22: warning: result of comparison 'mozilla::Span::index_type' (aka 'unsigned int') > 4294967295 is always false [-Wtautological-type-limit-compare] 5:07.14 if (key.Length() > std::numeric_limits<unsigned int>::max()) { 5:07.14 ~~~~~~~~~~~~ ^ ~~~~~~~~~~~~~~~~~~~~~~~~~~~~~~~~~~~~~~~~ 5:07.33 Compiling servo_arc v0.1.1 (/tmp/B.qx2tm3hd/BUILD/firefox-105.0/servo/components/servo_arc) 5:07.84 Compiling owning_ref v0.4.1 5:08.06 Compiling dtoa-short v0.3.3 5:08.36 Compiling sql-support v0.1.0 (https://github.com/mozilla/application-services?rev=2689788cecf24c385e6b7440e3aa1a89c511f14a#2689788c) 5:08.57 Compiling webext-storage v0.1.0 (https://github.com/mozilla/application-services?rev=2689788cecf24c385e6b7440e3aa1a89c511f14a#2689788c) 5:08.84 Compiling itertools v0.10.3 5:12.23 1 warning generated. 5:12.43 Compiling bit-set v0.5.3 5:12.98 Compiling thiserror-impl v1.0.32 5:13.73 dom/clients/api 5:16.48 1 warning generated. 5:16.60 Compiling walkdir v2.3.2 5:19.56 Compiling codespan-reporting v0.11.1 5:21.24 Compiling serde_repr v0.1.9 5:23.17 Compiling wgpu-core v0.12.0 (https://github.com/gfx-rs/wgpu?rev=b370b990#b370b990) 5:24.91 Compiling raw-window-handle v0.4.3 5:25.30 Compiling ringbuf v0.2.8 5:25.85 Compiling dns-parser v0.8.0 5:26.29 dom/clients/manager 5:28.68 Compiling tracing v0.1.36 5:30.64 1 warning generated. 5:31.81 Compiling pin-project v1.0.12 5:31.90 Compiling tokio-util v0.7.2 5:34.38 Compiling thiserror v1.0.32 5:34.49 Compiling h2 v0.3.13 5:34.84 Compiling crossbeam-utils v0.6.6 5:37.91 Compiling tokio-util v0.6.999 (/tmp/B.qx2tm3hd/BUILD/firefox-105.0/build/rust/tokio-util) 5:41.48 In file included from UnifiedBindings1.cpp:158: 5:41.48 In file included from /tmp/B.qx2tm3hd/BUILD/firefox-105.0/obj-i686/dom/bindings/BaseKeyframeTypesBinding.cpp:27: 5:41.48 In file included from /tmp/B.qx2tm3hd/BUILD/firefox-105.0/obj-i686/dist/include/mozilla/dom/UnionConversions.h:90: 5:41.48 In file included from /tmp/B.qx2tm3hd/BUILD/firefox-105.0/obj-i686/dist/include/mozilla/dom/SubtleCryptoBinding.h:11: 5:41.48 In file included from /tmp/B.qx2tm3hd/BUILD/firefox-105.0/obj-i686/dist/include/mozilla/dom/CryptoKey.h:12: 5:41.48 /tmp/B.qx2tm3hd/BUILD/firefox-105.0/obj-i686/dist/include/ScopedNSSTypes.h:282:22: warning: result of comparison 'mozilla::Span::index_type' (aka 'unsigned int') > 4294967295 is always false [-Wtautological-type-limit-compare] 5:41.48 if (key.Length() > std::numeric_limits<unsigned int>::max()) { 5:41.48 ~~~~~~~~~~~~ ^ ~~~~~~~~~~~~~~~~~~~~~~~~~~~~~~~~~~~~~~~~ 5:44.50 Compiling gpu-alloc v0.5.3 5:44.87 Compiling serde_urlencoded v0.7.1 5:45.46 Compiling uuid v0.8.2 5:46.66 Compiling plist v1.3.1 5:50.18 Compiling serde_yaml v0.8.26 5:54.49 In file included from Unified_cpp_dom_base1.cpp:56: 5:54.49 In file included from /tmp/B.qx2tm3hd/BUILD/firefox-105.0/dom/base/Crypto.cpp:7: 5:54.49 In file included from /tmp/B.qx2tm3hd/BUILD/firefox-105.0/dom/base/Crypto.h:10: 5:54.49 In file included from /tmp/B.qx2tm3hd/BUILD/firefox-105.0/obj-i686/dist/include/mozilla/dom/SubtleCrypto.h:13: 5:54.49 In file included from /tmp/B.qx2tm3hd/BUILD/firefox-105.0/obj-i686/dist/include/mozilla/dom/CryptoKey.h:12: 5:54.49 /tmp/B.qx2tm3hd/BUILD/firefox-105.0/security/manager/ssl/ScopedNSSTypes.h:282:22: warning: result of comparison 'mozilla::Span::index_type' (aka 'unsigned int') > 4294967295 is always false [-Wtautological-type-limit-compare] 5:54.49 if (key.Length() > std::numeric_limits<unsigned int>::max()) { 5:54.49 ~~~~~~~~~~~~ ^ ~~~~~~~~~~~~~~~~~~~~~~~~~~~~~~~~~~~~~~~~ 6:01.72 Compiling marionette v0.2.0 (/tmp/B.qx2tm3hd/BUILD/firefox-105.0/testing/geckodriver/marionette) 6:02.45 Compiling hyper v0.14.20 6:09.00 Compiling mozdevice v0.5.0 (/tmp/B.qx2tm3hd/BUILD/firefox-105.0/testing/mozbase/rust/mozdevice) 6:12.10 1 warning generated. 6:15.64 Compiling mozrunner v0.14.0 (/tmp/B.qx2tm3hd/BUILD/firefox-105.0/testing/mozbase/rust/mozrunner) 6:17.99 Compiling warp v0.3.2 6:25.77 Compiling webdriver v0.46.0 (/tmp/B.qx2tm3hd/BUILD/firefox-105.0/testing/webdriver) 6:27.90 1 warning generated. 6:30.73 dom/commandhandler 6:35.62 dom/console 6:37.44 In file included from UnifiedBindings10.cpp:2: 6:37.44 In file included from /tmp/B.qx2tm3hd/BUILD/firefox-105.0/obj-i686/dom/bindings/HeadersBinding.cpp:31: 6:37.44 In file included from /tmp/B.qx2tm3hd/BUILD/firefox-105.0/obj-i686/dist/include/mozilla/dom/UnionConversions.h:90: 6:37.44 In file included from /tmp/B.qx2tm3hd/BUILD/firefox-105.0/obj-i686/dist/include/mozilla/dom/SubtleCryptoBinding.h:11: 6:37.44 In file included from /tmp/B.qx2tm3hd/BUILD/firefox-105.0/obj-i686/dist/include/mozilla/dom/CryptoKey.h:12: 6:37.44 /tmp/B.qx2tm3hd/BUILD/firefox-105.0/obj-i686/dist/include/ScopedNSSTypes.h:282:22: warning: result of comparison 'mozilla::Span::index_type' (aka 'unsigned int') > 4294967295 is always false [-Wtautological-type-limit-compare] 6:37.44 if (key.Length() > std::numeric_limits<unsigned int>::max()) { 6:37.44 ~~~~~~~~~~~~ ^ ~~~~~~~~~~~~~~~~~~~~~~~~~~~~~~~~~~~~~~~~ 6:46.23 In file included from UnifiedBindings11.cpp:132: 6:46.23 In file included from /tmp/B.qx2tm3hd/BUILD/firefox-105.0/obj-i686/dom/bindings/KeyframeEffectBinding.cpp:35: 6:46.23 In file included from /tmp/B.qx2tm3hd/BUILD/firefox-105.0/obj-i686/dist/include/mozilla/dom/UnionConversions.h:90: 6:46.23 In file included from /tmp/B.qx2tm3hd/BUILD/firefox-105.0/obj-i686/dist/include/mozilla/dom/SubtleCryptoBinding.h:11: 6:46.23 In file included from /tmp/B.qx2tm3hd/BUILD/firefox-105.0/obj-i686/dist/include/mozilla/dom/CryptoKey.h:12: 6:46.23 /tmp/B.qx2tm3hd/BUILD/firefox-105.0/obj-i686/dist/include/ScopedNSSTypes.h:282:22: warning: result of comparison 'mozilla::Span::index_type' (aka 'unsigned int') > 4294967295 is always false [-Wtautological-type-limit-compare] 6:46.23 if (key.Length() > std::numeric_limits<unsigned int>::max()) { 6:46.23 ~~~~~~~~~~~~ ^ ~~~~~~~~~~~~~~~~~~~~~~~~~~~~~~~~~~~~~~~~ 6:51.27 dom/credentialmanagement 7:11.83 1 warning generated. 7:12.91 1 warning generated. 7:18.34 Compiling unic-langid v0.9.0 7:21.10 dom/crypto 7:22.96 In file included from UnifiedBindings13.cpp:80: 7:22.96 In file included from /tmp/B.qx2tm3hd/BUILD/firefox-105.0/obj-i686/dom/bindings/MessageEventBinding.cpp:33: 7:22.96 In file included from /tmp/B.qx2tm3hd/BUILD/firefox-105.0/obj-i686/dist/include/mozilla/dom/UnionConversions.h:90: 7:22.96 In file included from /tmp/B.qx2tm3hd/BUILD/firefox-105.0/obj-i686/dist/include/mozilla/dom/SubtleCryptoBinding.h:11: 7:22.96 In file included from /tmp/B.qx2tm3hd/BUILD/firefox-105.0/obj-i686/dist/include/mozilla/dom/CryptoKey.h:12: 7:22.96 /tmp/B.qx2tm3hd/BUILD/firefox-105.0/obj-i686/dist/include/ScopedNSSTypes.h:282:22: warning: result of comparison 'mozilla::Span::index_type' (aka 'unsigned int') > 4294967295 is always false [-Wtautological-type-limit-compare] 7:22.96 if (key.Length() > std::numeric_limits<unsigned int>::max()) { 7:22.96 ~~~~~~~~~~~~ ^ ~~~~~~~~~~~~~~~~~~~~~~~~~~~~~~~~~~~~~~~~ 7:23.55 In file included from UnifiedBindings12.cpp:132: 7:23.55 In file included from /tmp/B.qx2tm3hd/BUILD/firefox-105.0/obj-i686/dom/bindings/MediaKeySessionBinding.cpp:32: 7:23.55 In file included from /tmp/B.qx2tm3hd/BUILD/firefox-105.0/obj-i686/dist/include/mozilla/dom/UnionConversions.h:90: 7:23.55 In file included from /tmp/B.qx2tm3hd/BUILD/firefox-105.0/obj-i686/dist/include/mozilla/dom/SubtleCryptoBinding.h:11: 7:23.55 In file included from /tmp/B.qx2tm3hd/BUILD/firefox-105.0/obj-i686/dist/include/mozilla/dom/CryptoKey.h:12: 7:23.55 /tmp/B.qx2tm3hd/BUILD/firefox-105.0/obj-i686/dist/include/ScopedNSSTypes.h:282:22: warning: result of comparison 'mozilla::Span::index_type' (aka 'unsigned int') > 4294967295 is always false [-Wtautological-type-limit-compare] 7:23.55 if (key.Length() > std::numeric_limits<unsigned int>::max()) { 7:23.55 ~~~~~~~~~~~~ ^ ~~~~~~~~~~~~~~~~~~~~~~~~~~~~~~~~~~~~~~~~ 7:24.07 In file included from Unified_cpp_dom_crypto0.cpp:11: 7:24.07 In file included from /tmp/B.qx2tm3hd/BUILD/firefox-105.0/dom/crypto/CryptoKey.cpp:7: 7:24.07 In file included from /tmp/B.qx2tm3hd/BUILD/firefox-105.0/obj-i686/dist/include/mozilla/dom/CryptoKey.h:12: 7:24.07 /tmp/B.qx2tm3hd/BUILD/firefox-105.0/security/manager/ssl/ScopedNSSTypes.h:282:22: warning: result of comparison 'mozilla::Span::index_type' (aka 'unsigned int') > 4294967295 is always false [-Wtautological-type-limit-compare] 7:24.07 if (key.Length() > std::numeric_limits<unsigned int>::max()) { 7:24.08 ~~~~~~~~~~~~ ^ ~~~~~~~~~~~~~~~~~~~~~~~~~~~~~~~~~~~~~~~~ 7:34.11 1 warning generated. 7:34.14 dom/debugger 7:35.21 Compiling crossbeam-queue v0.1.2 7:35.44 Compiling getrandom v0.2.7 7:35.89 Compiling atty v0.2.14 7:36.00 Compiling time v0.1.44 7:37.81 dom/encoding 7:38.07 Compiling iovec v0.1.4 7:38.30 Compiling num_cpus v1.13.1 7:39.87 dom/events 7:40.36 Compiling memmap2 v0.5.7 7:40.92 Compiling zeitstempel v0.1.1 7:41.01 Compiling net2 v0.2.37 7:42.43 Compiling tempfile v3.3.0 7:44.14 dom/fetch 7:48.11 1 warning generated. 7:56.58 1 warning generated. 7:58.67 Compiling dirs-sys v0.3.7 7:59.18 In file included from UnifiedBindings14.cpp:15: 7:59.18 In file included from /tmp/B.qx2tm3hd/BUILD/firefox-105.0/obj-i686/dom/bindings/NotificationBinding.cpp:36: 7:59.18 In file included from /tmp/B.qx2tm3hd/BUILD/firefox-105.0/obj-i686/dist/include/mozilla/dom/UnionConversions.h:90: 7:59.18 In file included from /tmp/B.qx2tm3hd/BUILD/firefox-105.0/obj-i686/dist/include/mozilla/dom/SubtleCryptoBinding.h:11: 7:59.18 In file included from /tmp/B.qx2tm3hd/BUILD/firefox-105.0/obj-i686/dist/include/mozilla/dom/CryptoKey.h:12: 7:59.18 /tmp/B.qx2tm3hd/BUILD/firefox-105.0/obj-i686/dist/include/ScopedNSSTypes.h:282:22: warning: result of comparison 'mozilla::Span::index_type' (aka 'unsigned int') > 4294967295 is always false [-Wtautological-type-limit-compare] 7:59.18 if (key.Length() > std::numeric_limits<unsigned int>::max()) { 7:59.18 ~~~~~~~~~~~~ ^ ~~~~~~~~~~~~~~~~~~~~~~~~~~~~~~~~~~~~~~~~ 8:00.08 Compiling libudev-sys v0.1.3 (/tmp/B.qx2tm3hd/BUILD/firefox-105.0/dom/webauthn/libudev-sys) 8:02.40 Compiling pulse-ffi v0.1.0 (https://github.com/mozilla/cubeb-pulse-rs?rev=1f1fe1e08e01a9a534ec7f079702a583a0899ce7#1f1fe1e0) 8:03.50 Compiling freetype v0.7.0 8:04.68 Compiling socket2 v0.4.4 8:06.65 Compiling qcms v0.2.0 (/tmp/B.qx2tm3hd/BUILD/firefox-105.0/gfx/qcms) 8:14.66 dom/file/ipc 8:17.58 Compiling ffi-support v0.4.4 8:17.78 Finished release [optimized] target(s) in 6m 59s 8:18.06 Compiling mio v0.8.0 8:18.25 dom/file 8:18.80 Compiling dogear v0.5.0 8:20.32 Compiling static_prefs v0.1.0 (/tmp/B.qx2tm3hd/BUILD/firefox-105.0/modules/libpref/init/static_prefs) 8:20.41 Compiling moz_asserts v0.1.0 (/tmp/B.qx2tm3hd/BUILD/firefox-105.0/mozglue/static/rust/moz_asserts) 8:21.20 Compiling jobserver v0.1.24 8:27.17 Compiling aho-corasick v0.7.18 8:28.27 Compiling object v0.28.4 8:30.71 In file included from Unified_cpp_dom_base6.cpp:56: 8:30.71 In file included from /tmp/B.qx2tm3hd/BUILD/firefox-105.0/dom/base/SubtleCrypto.cpp:7: 8:30.71 In file included from /tmp/B.qx2tm3hd/BUILD/firefox-105.0/obj-i686/dist/include/mozilla/dom/SubtleCrypto.h:13: 8:30.71 In file included from /tmp/B.qx2tm3hd/BUILD/firefox-105.0/obj-i686/dist/include/mozilla/dom/CryptoKey.h:12: 8:30.71 /tmp/B.qx2tm3hd/BUILD/firefox-105.0/security/manager/ssl/ScopedNSSTypes.h:282:22: warning: result of comparison 'mozilla::Span::index_type' (aka 'unsigned int') > 4294967295 is always false [-Wtautological-type-limit-compare] 8:30.71 if (key.Length() > std::numeric_limits<unsigned int>::max()) { 8:30.71 ~~~~~~~~~~~~ ^ ~~~~~~~~~~~~~~~~~~~~~~~~~~~~~~~~~~~~~~~~ 8:30.89 Compiling nsstring v0.1.0 (/tmp/B.qx2tm3hd/BUILD/firefox-105.0/xpcom/rust/nsstring) 8:33.00 Compiling chardetng v0.1.9 (https://github.com/hsivonen/chardetng?rev=3484d3e3ebdc8931493aa5df4d7ee9360a90e76b#3484d3e3) 8:33.31 Compiling xmldecl v0.2.0 8:33.95 Compiling nom v7.1.1 8:35.85 1 warning generated. 8:36.52 In file included from UnifiedBindings16.cpp:80: 8:36.52 In file included from /tmp/B.qx2tm3hd/BUILD/firefox-105.0/obj-i686/dom/bindings/PushEventBinding.cpp:30: 8:36.52 In file included from /tmp/B.qx2tm3hd/BUILD/firefox-105.0/obj-i686/dist/include/mozilla/dom/UnionConversions.h:90: 8:36.52 In file included from /tmp/B.qx2tm3hd/BUILD/firefox-105.0/obj-i686/dist/include/mozilla/dom/SubtleCryptoBinding.h:11: 8:36.52 In file included from /tmp/B.qx2tm3hd/BUILD/firefox-105.0/obj-i686/dist/include/mozilla/dom/CryptoKey.h:12: 8:36.52 /tmp/B.qx2tm3hd/BUILD/firefox-105.0/obj-i686/dist/include/ScopedNSSTypes.h:282:22: warning: result of comparison 'mozilla::Span::index_type' (aka 'unsigned int') > 4294967295 is always false [-Wtautological-type-limit-compare] 8:36.52 if (key.Length() > std::numeric_limits<unsigned int>::max()) { 8:36.52 ~~~~~~~~~~~~ ^ ~~~~~~~~~~~~~~~~~~~~~~~~~~~~~~~~~~~~~~~~ 8:38.26 dom/file/uri 8:39.71 In file included from UnifiedBindings17.cpp:2: 8:39.71 In file included from /tmp/B.qx2tm3hd/BUILD/firefox-105.0/obj-i686/dom/bindings/RTCRtpTransceiverBinding.cpp:6: 8:39.71 In file included from /tmp/B.qx2tm3hd/BUILD/firefox-105.0/dom/media/webrtc/jsapi/RTCRtpReceiver.h:14: 8:39.71 In file included from /tmp/B.qx2tm3hd/BUILD/firefox-105.0/dom/media/webrtc/libwebrtcglue/MediaConduitInterface.h:14: 8:39.71 In file included from /tmp/B.qx2tm3hd/BUILD/firefox-105.0/dom/media/webrtc/jsapi/RTCStatsReport.h:17: 8:39.71 In file included from /tmp/B.qx2tm3hd/BUILD/firefox-105.0/obj-i686/dist/include/mozilla/dom/RTCStatsReportBinding.h:6: 8:39.71 In file included from /tmp/B.qx2tm3hd/BUILD/firefox-105.0/obj-i686/dist/include/mozilla/dom/RTCConfigurationBinding.h:13: 8:39.71 In file included from /tmp/B.qx2tm3hd/BUILD/firefox-105.0/obj-i686/dist/include/mozilla/dom/RTCCertificate.h:11: 8:39.72 /tmp/B.qx2tm3hd/BUILD/firefox-105.0/obj-i686/dist/include/ScopedNSSTypes.h:282:22: warning: result of comparison 'mozilla::Span::index_type' (aka 'unsigned int') > 4294967295 is always false [-Wtautological-type-limit-compare] 8:39.72 if (key.Length() > std::numeric_limits<unsigned int>::max()) { 8:39.72 ~~~~~~~~~~~~ ^ ~~~~~~~~~~~~~~~~~~~~~~~~~~~~~~~~~~~~~~~~ 8:39.84 Compiling crossbeam-channel v0.5.6 8:41.60 Compiling bitvec v0.19.6 8:44.60 dom/filehandle 8:45.86 Compiling fluent-langneg v0.13.0 8:46.48 Compiling intl-memoizer v0.5.1 8:47.69 Compiling intl_pluralrules v7.0.1 8:47.86 1 warning generated. 8:53.47 Compiling flate2 v1.0.24 8:54.91 Compiling gl_generator v0.14.0 8:55.00 dom/filesystem/compat 9:00.59 dom/filesystem 9:02.76 Compiling cose-c v0.1.5 9:02.98 dom/flex 9:08.42 1 warning generated. 9:10.12 dom/fs/api 9:16.02 dom/fs/child 9:18.04 1 warning generated. 9:19.93 Compiling cstr v0.2.10 9:22.22 dom/fs/parent 9:24.83 Compiling rand_core v0.6.3 9:25.30 Compiling uuid v0.8.2 9:26.45 Compiling bytes v0.4.12 9:28.27 Compiling futures-cpupool v0.1.8 9:28.47 dom/fs/shared 9:28.96 dom/gamepad 9:30.40 Compiling memmap2 v0.2.999 (/tmp/B.qx2tm3hd/BUILD/firefox-105.0/build/rust/memmap2) 9:30.48 Compiling dirs v4.0.0 9:30.75 Compiling libudev v0.2.0 9:31.37 Compiling pulse v0.3.0 (https://github.com/mozilla/cubeb-pulse-rs?rev=1f1fe1e08e01a9a534ec7f079702a583a0899ce7#1f1fe1e0) 9:32.86 Compiling mio v0.6.23 (/tmp/B.qx2tm3hd/BUILD/firefox-105.0/third_party/rust/mio-0.6.23) 9:38.97 Compiling ordered-float v3.0.0 9:39.58 Compiling spirv v0.2.0+1.5.4 9:40.79 In file included from UnifiedBindings2.cpp:249: 9:40.79 In file included from /tmp/B.qx2tm3hd/BUILD/firefox-105.0/obj-i686/dom/bindings/CSSStyleSheetBinding.cpp:35: 9:40.79 In file included from /tmp/B.qx2tm3hd/BUILD/firefox-105.0/obj-i686/dist/include/mozilla/dom/UnionConversions.h:90: 9:40.79 In file included from /tmp/B.qx2tm3hd/BUILD/firefox-105.0/obj-i686/dist/include/mozilla/dom/SubtleCryptoBinding.h:11: 9:40.79 In file included from /tmp/B.qx2tm3hd/BUILD/firefox-105.0/obj-i686/dist/include/mozilla/dom/CryptoKey.h:12: 9:40.79 /tmp/B.qx2tm3hd/BUILD/firefox-105.0/obj-i686/dist/include/ScopedNSSTypes.h:282:22: warning: result of comparison 'mozilla::Span::index_type' (aka 'unsigned int') > 4294967295 is always false [-Wtautological-type-limit-compare] 9:40.79 if (key.Length() > std::numeric_limits<unsigned int>::max()) { 9:40.79 ~~~~~~~~~~~~ ^ ~~~~~~~~~~~~~~~~~~~~~~~~~~~~~~~~~~~~~~~~ 9:44.51 Compiling tokio-executor v0.1.10 9:45.00 dom/geolocation 9:47.91 Compiling mime_guess v2.0.4 9:49.40 dom/grid 9:52.34 Compiling build-parallel v0.1.2 9:52.61 Compiling lmdb-rkv v0.14.0 9:53.69 Compiling dbus v0.6.5 9:55.19 In file included from UnifiedBindings20.cpp:366: 9:55.19 In file included from /tmp/B.qx2tm3hd/BUILD/firefox-105.0/obj-i686/dom/bindings/SanitizerBinding.cpp:32: 9:55.19 In file included from /tmp/B.qx2tm3hd/BUILD/firefox-105.0/obj-i686/dist/include/mozilla/dom/UnionConversions.h:90: 9:55.19 In file included from /tmp/B.qx2tm3hd/BUILD/firefox-105.0/obj-i686/dist/include/mozilla/dom/SubtleCryptoBinding.h:11: 9:55.19 In file included from /tmp/B.qx2tm3hd/BUILD/firefox-105.0/obj-i686/dist/include/mozilla/dom/CryptoKey.h:12: 9:55.20 /tmp/B.qx2tm3hd/BUILD/firefox-105.0/obj-i686/dist/include/ScopedNSSTypes.h:282:22: warning: result of comparison 'mozilla::Span::index_type' (aka 'unsigned int') > 4294967295 is always false [-Wtautological-type-limit-compare] 9:55.20 if (key.Length() > std::numeric_limits<unsigned int>::max()) { 9:55.20 ~~~~~~~~~~~~ ^ ~~~~~~~~~~~~~~~~~~~~~~~~~~~~~~~~~~~~~~~~ 9:57.59 dom/html/input 10:04.51 1 warning generated. 10:06.09 dom/html 10:10.16 1 warning generated. 10:10.84 In file included from UnifiedBindings21.cpp:132: 10:10.84 In file included from /tmp/B.qx2tm3hd/BUILD/firefox-105.0/obj-i686/dom/bindings/SessionStoreUtilsBinding.cpp:36: 10:10.84 In file included from /tmp/B.qx2tm3hd/BUILD/firefox-105.0/obj-i686/dist/include/mozilla/dom/UnionConversions.h:90: 10:10.84 In file included from /tmp/B.qx2tm3hd/BUILD/firefox-105.0/obj-i686/dist/include/mozilla/dom/SubtleCryptoBinding.h:11: 10:10.84 In file included from /tmp/B.qx2tm3hd/BUILD/firefox-105.0/obj-i686/dist/include/mozilla/dom/CryptoKey.h:12: 10:10.84 /tmp/B.qx2tm3hd/BUILD/firefox-105.0/obj-i686/dist/include/ScopedNSSTypes.h:282:22: warning: result of comparison 'mozilla::Span::index_type' (aka 'unsigned int') > 4294967295 is always false [-Wtautological-type-limit-compare] 10:10.84 if (key.Length() > std::numeric_limits<unsigned int>::max()) { 10:10.84 ~~~~~~~~~~~~ ^ ~~~~~~~~~~~~~~~~~~~~~~~~~~~~~~~~~~~~~~~~ 10:13.68 Compiling alsa v0.4.3 10:14.17 dom/indexedDB 10:15.04 In file included from UnifiedBindings22.cpp:106: 10:15.04 In file included from /tmp/B.qx2tm3hd/BUILD/firefox-105.0/obj-i686/dom/bindings/StreamFilterBinding.cpp:28: 10:15.04 In file included from /tmp/B.qx2tm3hd/BUILD/firefox-105.0/obj-i686/dist/include/mozilla/dom/UnionConversions.h:90: 10:15.04 In file included from /tmp/B.qx2tm3hd/BUILD/firefox-105.0/obj-i686/dist/include/mozilla/dom/SubtleCryptoBinding.h:11: 10:15.04 In file included from /tmp/B.qx2tm3hd/BUILD/firefox-105.0/obj-i686/dist/include/mozilla/dom/CryptoKey.h:12: 10:15.05 /tmp/B.qx2tm3hd/BUILD/firefox-105.0/obj-i686/dist/include/ScopedNSSTypes.h:282:22: warning: result of comparison 'mozilla::Span::index_type' (aka 'unsigned int') > 4294967295 is always false [-Wtautological-type-limit-compare] 10:15.05 if (key.Length() > std::numeric_limits<unsigned int>::max()) { 10:15.05 ~~~~~~~~~~~~ ^ ~~~~~~~~~~~~~~~~~~~~~~~~~~~~~~~~~~~~~~~~ 10:20.08 In file included from UnifiedBindings23.cpp:15: 10:20.08 In file included from /tmp/B.qx2tm3hd/BUILD/firefox-105.0/obj-i686/dom/bindings/TextDecoderBinding.cpp:28: 10:20.08 In file included from /tmp/B.qx2tm3hd/BUILD/firefox-105.0/obj-i686/dist/include/mozilla/dom/UnionConversions.h:90: 10:20.08 In file included from /tmp/B.qx2tm3hd/BUILD/firefox-105.0/obj-i686/dist/include/mozilla/dom/SubtleCryptoBinding.h:11: 10:20.08 In file included from /tmp/B.qx2tm3hd/BUILD/firefox-105.0/obj-i686/dist/include/mozilla/dom/CryptoKey.h:12: 10:20.08 /tmp/B.qx2tm3hd/BUILD/firefox-105.0/obj-i686/dist/include/ScopedNSSTypes.h:282:22: warning: result of comparison 'mozilla::Span::index_type' (aka 'unsigned int') > 4294967295 is always false [-Wtautological-type-limit-compare] 10:20.08 if (key.Length() > std::numeric_limits<unsigned int>::max()) { 10:20.08 ~~~~~~~~~~~~ ^ ~~~~~~~~~~~~~~~~~~~~~~~~~~~~~~~~~~~~~~~~ 10:20.35 Compiling regex v1.6.0 10:23.17 In file included from /tmp/B.qx2tm3hd/BUILD/firefox-105.0/dom/indexedDB/ActorsParent.cpp:22: 10:23.17 In file included from /tmp/B.qx2tm3hd/BUILD/firefox-105.0/dom/indexedDB/ActorsParentCommon.h:22: 10:23.17 In file included from /tmp/B.qx2tm3hd/BUILD/firefox-105.0/obj-i686/dist/include/mozilla/dom/quota/IPCStreamCipherStrategy.h:10: 10:23.17 In file included from /tmp/B.qx2tm3hd/BUILD/firefox-105.0/obj-i686/dist/include/mozilla/dom/quota/NSSCipherStrategy.h:20: 10:23.17 /tmp/B.qx2tm3hd/BUILD/firefox-105.0/obj-i686/dist/include/ScopedNSSTypes.h:282:22: warning: result of comparison 'mozilla::Span::index_type' (aka 'unsigned int') > 4294967295 is always false [-Wtautological-type-limit-compare] 10:23.17 if (key.Length() > std::numeric_limits<unsigned int>::max()) { 10:23.17 ~~~~~~~~~~~~ ^ ~~~~~~~~~~~~~~~~~~~~~~~~~~~~~~~~~~~~~~~~ 10:29.69 dom/ipc/jsactor 10:33.52 1 warning generated. 10:33.77 Compiling nserror v0.1.0 (/tmp/B.qx2tm3hd/BUILD/firefox-105.0/xpcom/rust/nserror) 10:34.18 Compiling data-encoding-ffi v0.1.0 (/tmp/B.qx2tm3hd/BUILD/firefox-105.0/dom/fs/parent/rust/data-encoding-ffi) 10:34.34 Compiling chardetng_c v0.1.2 (https://github.com/hsivonen/chardetng_c?rev=ed8a4c6f900a90d4dbc1d64b856e61490a1c3570#ed8a4c6f) 10:35.78 1 warning generated. 10:39.05 In file included from UnifiedBindings25.cpp:2: 10:39.05 In file included from /tmp/B.qx2tm3hd/BUILD/firefox-105.0/obj-i686/dom/bindings/WindowBinding.cpp:6: 10:39.05 In file included from /tmp/B.qx2tm3hd/BUILD/firefox-105.0/dom/base/Crypto.h:10: 10:39.05 In file included from /tmp/B.qx2tm3hd/BUILD/firefox-105.0/obj-i686/dist/include/mozilla/dom/SubtleCrypto.h:13: 10:39.05 In file included from /tmp/B.qx2tm3hd/BUILD/firefox-105.0/obj-i686/dist/include/mozilla/dom/CryptoKey.h:12: 10:39.06 /tmp/B.qx2tm3hd/BUILD/firefox-105.0/obj-i686/dist/include/ScopedNSSTypes.h:282:22: warning: result of comparison 'mozilla::Span::index_type' (aka 'unsigned int') > 4294967295 is always false [-Wtautological-type-limit-compare] 10:39.06 if (key.Length() > std::numeric_limits<unsigned int>::max()) { 10:39.06 ~~~~~~~~~~~~ ^ ~~~~~~~~~~~~~~~~~~~~~~~~~~~~~~~~~~~~~~~~ 10:43.69 In file included from UnifiedBindings24.cpp:15: 10:43.69 In file included from /tmp/B.qx2tm3hd/BUILD/firefox-105.0/obj-i686/dom/bindings/UnderlyingSourceBinding.cpp:24: 10:43.69 In file included from /tmp/B.qx2tm3hd/BUILD/firefox-105.0/obj-i686/dist/include/mozilla/dom/UnionConversions.h:90: 10:43.69 In file included from /tmp/B.qx2tm3hd/BUILD/firefox-105.0/obj-i686/dist/include/mozilla/dom/SubtleCryptoBinding.h:11: 10:43.69 In file included from /tmp/B.qx2tm3hd/BUILD/firefox-105.0/obj-i686/dist/include/mozilla/dom/CryptoKey.h:12: 10:43.69 /tmp/B.qx2tm3hd/BUILD/firefox-105.0/obj-i686/dist/include/ScopedNSSTypes.h:282:22: warning: result of comparison 'mozilla::Span::index_type' (aka 'unsigned int') > 4294967295 is always false [-Wtautological-type-limit-compare] 10:43.69 if (key.Length() > std::numeric_limits<unsigned int>::max()) { 10:43.69 ~~~~~~~~~~~~ ^ ~~~~~~~~~~~~~~~~~~~~~~~~~~~~~~~~~~~~~~~~ 10:45.60 1 warning generated. 10:45.64 dom/ipc 10:46.68 Compiling cexpr v0.6.0 10:55.07 dom/jsurl 10:56.33 In file included from /tmp/B.qx2tm3hd/BUILD/firefox-105.0/dom/ipc/ContentChild.cpp:12: 10:56.33 In file included from /tmp/B.qx2tm3hd/BUILD/firefox-105.0/obj-i686/dist/include/nsNSSComponent.h:10: 10:56.33 In file included from /tmp/B.qx2tm3hd/BUILD/firefox-105.0/obj-i686/dist/include/nsINSSComponent.h:24: 10:56.33 In file included from /tmp/B.qx2tm3hd/BUILD/firefox-105.0/obj-i686/dist/include/SharedCertVerifier.h:8: 10:56.33 In file included from /tmp/B.qx2tm3hd/BUILD/firefox-105.0/obj-i686/dist/include/CertVerifier.h:15: 10:56.33 /tmp/B.qx2tm3hd/BUILD/firefox-105.0/obj-i686/dist/include/ScopedNSSTypes.h:282:22: warning: result of comparison 'mozilla::Span::index_type' (aka 'unsigned int') > 4294967295 is always false [-Wtautological-type-limit-compare] 10:56.33 if (key.Length() > std::numeric_limits<unsigned int>::max()) { 10:56.33 ~~~~~~~~~~~~ ^ ~~~~~~~~~~~~~~~~~~~~~~~~~~~~~~~~~~~~~~~~ 10:58.61 Compiling cubeb-core v0.10.0 10:59.74 Compiling crypto-common v0.1.6 10:59.89 Compiling block-buffer v0.10.2 11:00.06 Compiling gleam v0.13.1 11:02.42 1 warning generated. 11:04.56 dom/l10n 11:05.23 Compiling darling_core v0.13.4 11:09.48 Compiling synstructure v0.12.6 11:18.02 dom/localstorage 11:21.01 1 warning generated. 11:21.65 In file included from Unified_cpp_dom_indexedDB0.cpp:11: 11:21.65 In file included from /tmp/B.qx2tm3hd/BUILD/firefox-105.0/dom/indexedDB/ActorsParentCommon.cpp:7: 11:21.65 In file included from /tmp/B.qx2tm3hd/BUILD/firefox-105.0/dom/indexedDB/ActorsParentCommon.h:22: 11:21.65 In file included from /tmp/B.qx2tm3hd/BUILD/firefox-105.0/obj-i686/dist/include/mozilla/dom/quota/IPCStreamCipherStrategy.h:10: 11:21.65 In file included from /tmp/B.qx2tm3hd/BUILD/firefox-105.0/obj-i686/dist/include/mozilla/dom/quota/NSSCipherStrategy.h:20: 11:21.66 /tmp/B.qx2tm3hd/BUILD/firefox-105.0/obj-i686/dist/include/ScopedNSSTypes.h:282:22: warning: result of comparison 'mozilla::Span::index_type' (aka 'unsigned int') > 4294967295 is always false [-Wtautological-type-limit-compare] 11:21.66 if (key.Length() > std::numeric_limits<unsigned int>::max()) { 11:21.66 ~~~~~~~~~~~~ ^ ~~~~~~~~~~~~~~~~~~~~~~~~~~~~~~~~~~~~~~~~ 11:23.78 In file included from Unified_cpp_dom_indexedDB0.cpp:128: 11:23.79 /tmp/B.qx2tm3hd/BUILD/firefox-105.0/dom/indexedDB/IDBObjectStore.cpp:208:41: warning: result of comparison 'nsTArray_base::size_type' (aka 'unsigned int') > 4294967295 is always false [-Wtautological-type-limit-compare] 11:23.79 if (cloneWriteInfo->mFiles.Length() > size_t(UINT32_MAX)) { 11:23.79 ~~~~~~~~~~~~~~~~~~~~~~~~~~~~~~~ ^ ~~~~~~~~~~~~~~~~~~ 11:23.79 /tmp/B.qx2tm3hd/BUILD/firefox-105.0/dom/indexedDB/IDBObjectStore.cpp:252:43: warning: result of comparison 'nsTArray_base::size_type' (aka 'unsigned int') > 4294967295 is always false [-Wtautological-type-limit-compare] 11:23.79 if (cloneWriteInfo->mFiles.Length() > size_t(UINT32_MAX)) { 11:23.79 ~~~~~~~~~~~~~~~~~~~~~~~~~~~~~~~ ^ ~~~~~~~~~~~~~~~~~~ 11:23.80 /tmp/B.qx2tm3hd/BUILD/firefox-105.0/dom/indexedDB/IDBObjectStore.cpp:321:38: warning: result of comparison 'nsTArray_base::size_type' (aka 'unsigned int') > 4294967295 is always false [-Wtautological-type-limit-compare] 11:23.80 if (cloneInfo->mFiles.Length() > size_t(UINT32_MAX)) { 11:23.80 ~~~~~~~~~~~~~~~~~~~~~~~~~~ ^ ~~~~~~~~~~~~~~~~~~ 11:23.80 /tmp/B.qx2tm3hd/BUILD/firefox-105.0/dom/indexedDB/IDBObjectStore.cpp:344:38: warning: result of comparison 'nsTArray_base::size_type' (aka 'unsigned int') > 4294967295 is always false [-Wtautological-type-limit-compare] 11:23.80 if (cloneInfo->mFiles.Length() > size_t(UINT32_MAX)) { 11:23.80 ~~~~~~~~~~~~~~~~~~~~~~~~~~ ^ ~~~~~~~~~~~~~~~~~~ 11:25.25 1 warning generated. 11:29.74 Compiling rand_chacha v0.3.1 11:33.85 Compiling profiler_helper v0.1.0 (/tmp/B.qx2tm3hd/BUILD/firefox-105.0/tools/profiler/rust-helper) 11:37.14 Compiling tokio-io v0.1.13 11:38.47 Compiling mapped_hyph v0.4.3 (https://github.com/jfkthame/mapped_hyph.git?rev=746743227485a83123784df0c53227ab466612ed#74674322) 11:41.24 5 warnings generated. 11:43.80 Compiling mio-uds v0.6.8 11:44.43 Compiling tokio-current-thread v0.1.7 11:44.48 dom/locks 11:45.18 Compiling tokio-timer v0.2.13 11:45.42 Compiling crossbeam-deque v0.8.2 11:45.78 Compiling crossbeam-deque v0.7.4 11:47.11 Compiling audio_thread_priority v0.26.1 11:47.81 In file included from UnifiedBindings26.cpp:2: 11:47.81 In file included from /tmp/B.qx2tm3hd/BUILD/firefox-105.0/obj-i686/dom/bindings/XSLTProcessorBinding.cpp:29: 11:47.81 In file included from /tmp/B.qx2tm3hd/BUILD/firefox-105.0/obj-i686/dist/include/mozilla/dom/UnionConversions.h:90: 11:47.81 In file included from /tmp/B.qx2tm3hd/BUILD/firefox-105.0/obj-i686/dist/include/mozilla/dom/SubtleCryptoBinding.h:11: 11:47.81 In file included from /tmp/B.qx2tm3hd/BUILD/firefox-105.0/obj-i686/dist/include/mozilla/dom/CryptoKey.h:12: 11:47.82 /tmp/B.qx2tm3hd/BUILD/firefox-105.0/obj-i686/dist/include/ScopedNSSTypes.h:282:22: warning: result of comparison 'mozilla::Span::index_type' (aka 'unsigned int') > 4294967295 is always false [-Wtautological-type-limit-compare] 11:47.82 if (key.Length() > std::numeric_limits<unsigned int>::max()) { 11:47.82 ~~~~~~~~~~~~ ^ ~~~~~~~~~~~~~~~~~~~~~~~~~~~~~~~~~~~~~~~~ 11:48.26 Compiling midir v0.7.0 (https://github.com/mozilla/midir.git?rev=e1b4dcb767f9e69afe95a860374aaa9635d81e3d#e1b4dcb7) 11:49.87 Compiling env_logger v0.9.0 11:49.98 Compiling fluent-pseudo v0.3.1 11:51.48 Compiling regex-ffi v0.1.0 (/tmp/B.qx2tm3hd/BUILD/firefox-105.0/toolkit/components/regex-ffi) 11:52.08 In file included from Unified_cpp_dom_indexedDB1.cpp:65: 11:52.08 In file included from /tmp/B.qx2tm3hd/BUILD/firefox-105.0/dom/indexedDB/SchemaUpgrades.cpp:10: 11:52.08 In file included from /tmp/B.qx2tm3hd/BUILD/firefox-105.0/dom/indexedDB/ActorsParentCommon.h:22: 11:52.08 In file included from /tmp/B.qx2tm3hd/BUILD/firefox-105.0/obj-i686/dist/include/mozilla/dom/quota/IPCStreamCipherStrategy.h:10: 11:52.08 In file included from /tmp/B.qx2tm3hd/BUILD/firefox-105.0/obj-i686/dist/include/mozilla/dom/quota/NSSCipherStrategy.h:20: 11:52.09 /tmp/B.qx2tm3hd/BUILD/firefox-105.0/obj-i686/dist/include/ScopedNSSTypes.h:282:22: warning: result of comparison 'mozilla::Span::index_type' (aka 'unsigned int') > 4294967295 is always false [-Wtautological-type-limit-compare] 11:52.09 if (key.Length() > std::numeric_limits<unsigned int>::max()) { 11:52.09 ~~~~~~~~~~~~ ^ ~~~~~~~~~~~~~~~~~~~~~~~~~~~~~~~~~~~~~~~~ 11:55.01 Compiling thiserror-impl v1.0.32 12:01.55 dom/mathml 12:02.48 1 warning generated. 12:06.01 1 warning generated. 12:08.48 1 warning generated. 12:10.54 dom/media/autoplay 12:13.64 Compiling xpcom_macros v0.1.0 (/tmp/B.qx2tm3hd/BUILD/firefox-105.0/xpcom/rust/xpcom/xpcom_macros) 12:16.92 In file included from UnifiedBindings3.cpp:15: 12:16.92 In file included from /tmp/B.qx2tm3hd/BUILD/firefox-105.0/obj-i686/dom/bindings/CharacterDataBinding.cpp:28: 12:16.92 In file included from /tmp/B.qx2tm3hd/BUILD/firefox-105.0/obj-i686/dist/include/mozilla/dom/UnionConversions.h:90: 12:16.92 In file included from /tmp/B.qx2tm3hd/BUILD/firefox-105.0/obj-i686/dist/include/mozilla/dom/SubtleCryptoBinding.h:11: 12:16.92 In file included from /tmp/B.qx2tm3hd/BUILD/firefox-105.0/obj-i686/dist/include/mozilla/dom/CryptoKey.h:12: 12:16.92 /tmp/B.qx2tm3hd/BUILD/firefox-105.0/obj-i686/dist/include/ScopedNSSTypes.h:282:22: warning: result of comparison 'mozilla::Span::index_type' (aka 'unsigned int') > 4294967295 is always false [-Wtautological-type-limit-compare] 12:16.92 if (key.Length() > std::numeric_limits<unsigned int>::max()) { 12:16.92 ~~~~~~~~~~~~ ^ ~~~~~~~~~~~~~~~~~~~~~~~~~~~~~~~~~~~~~~~~ 12:21.27 dom/media/bridge 12:24.01 In file included from Unified_cpp_dom_ipc0.cpp:119: 12:24.01 In file included from /tmp/B.qx2tm3hd/BUILD/firefox-105.0/dom/ipc/ContentParent.cpp:258: 12:24.01 In file included from /tmp/B.qx2tm3hd/BUILD/firefox-105.0/dom/media/webrtc/jsapi/WebrtcGlobalParent.h:8: 12:24.01 In file included from /tmp/B.qx2tm3hd/BUILD/firefox-105.0/obj-i686/ipc/ipdl/_ipdlheaders/mozilla/dom/PWebrtcGlobalParent.h:18: 12:24.01 In file included from /tmp/B.qx2tm3hd/BUILD/firefox-105.0/obj-i686/dist/include/mozilla/media/webrtc/WebrtcGlobal.h:8: 12:24.01 In file included from /tmp/B.qx2tm3hd/BUILD/firefox-105.0/obj-i686/dist/include/mozilla/media/webrtc/WebrtcIPCTraits.h:12: 12:24.01 In file included from /tmp/B.qx2tm3hd/BUILD/firefox-105.0/obj-i686/dist/include/mozilla/dom/RTCConfigurationBinding.h:13: 12:24.01 In file included from /tmp/B.qx2tm3hd/BUILD/firefox-105.0/obj-i686/dist/include/mozilla/dom/RTCCertificate.h:11: 12:24.01 /tmp/B.qx2tm3hd/BUILD/firefox-105.0/obj-i686/dist/include/ScopedNSSTypes.h:282:22: warning: result of comparison 'mozilla::Span::index_type' (aka 'unsigned int') > 4294967295 is always false [-Wtautological-type-limit-compare] 12:24.01 if (key.Length() > std::numeric_limits<unsigned int>::max()) { 12:24.01 ~~~~~~~~~~~~ ^ ~~~~~~~~~~~~~~~~~~~~~~~~~~~~~~~~~~~~~~~~ 12:24.33 In file included from UnifiedBindings4.cpp:288: 12:24.33 In file included from /tmp/B.qx2tm3hd/BUILD/firefox-105.0/obj-i686/dom/bindings/DocumentBinding.cpp:83: 12:24.33 In file included from /tmp/B.qx2tm3hd/BUILD/firefox-105.0/obj-i686/dist/include/mozilla/dom/UnionConversions.h:90: 12:24.33 In file included from /tmp/B.qx2tm3hd/BUILD/firefox-105.0/obj-i686/dist/include/mozilla/dom/SubtleCryptoBinding.h:11: 12:24.33 In file included from /tmp/B.qx2tm3hd/BUILD/firefox-105.0/obj-i686/dist/include/mozilla/dom/CryptoKey.h:12: 12:24.33 /tmp/B.qx2tm3hd/BUILD/firefox-105.0/obj-i686/dist/include/ScopedNSSTypes.h:282:22: warning: result of comparison 'mozilla::Span::index_type' (aka 'unsigned int') > 4294967295 is always false [-Wtautological-type-limit-compare] 12:24.33 if (key.Length() > std::numeric_limits<unsigned int>::max()) { 12:24.33 ~~~~~~~~~~~~ ^ ~~~~~~~~~~~~~~~~~~~~~~~~~~~~~~~~~~~~~~~~ 12:26.02 In file included from Unified_cpp_dom_ipc0.cpp:119: 12:26.03 /tmp/B.qx2tm3hd/BUILD/firefox-105.0/dom/ipc/ContentParent.cpp:1254:3: warning: 'gdk_pointer_ungrab' is deprecated: Use 'gdk_device_ungrab' instead [-Wdeprecated-declarations] 12:26.03 gdk_pointer_ungrab(aTime); 12:26.03 ^ 12:26.03 /usr/include/gtk-3.0/gdk/gdkmain.h:99:1: note: 'gdk_pointer_ungrab' has been explicitly marked deprecated here 12:26.03 GDK_DEPRECATED_IN_3_0_FOR(gdk_device_ungrab) 12:26.03 ^ 12:26.03 /usr/include/gtk-3.0/gdk/gdkversionmacros.h:259:47: note: expanded from macro 'GDK_DEPRECATED_IN_3_0_FOR' 12:26.03 # define GDK_DEPRECATED_IN_3_0_FOR(f) GDK_DEPRECATED_FOR(f) 12:26.03 ^ 12:26.03 /usr/include/gtk-3.0/gdk/gdkversionmacros.h:49:31: note: expanded from macro 'GDK_DEPRECATED_FOR' 12:26.03 #define GDK_DEPRECATED_FOR(f) G_DEPRECATED_FOR(f) _GDK_EXTERN 12:26.03 ^ 12:26.03 /usr/include/glib-2.0/glib/gmacros.h:1113:44: note: expanded from macro 'G_DEPRECATED_FOR' 12:26.03 #define G_DEPRECATED_FOR(f) __attribute__((__deprecated__("Use '" #f "' instead"))) 12:26.03 ^ 12:27.42 In file included from /tmp/B.qx2tm3hd/BUILD/firefox-105.0/dom/media/bridge/MediaModule.cpp:8: 12:27.42 In file included from /tmp/B.qx2tm3hd/BUILD/firefox-105.0/dom/media/webrtc/jsapi/PeerConnectionImpl.h:36: 12:27.42 In file included from /tmp/B.qx2tm3hd/BUILD/firefox-105.0/obj-i686/dist/include/mozilla/dom/RTCConfigurationBinding.h:13: 12:27.42 In file included from /tmp/B.qx2tm3hd/BUILD/firefox-105.0/obj-i686/dist/include/mozilla/dom/RTCCertificate.h:11: 12:27.42 /tmp/B.qx2tm3hd/BUILD/firefox-105.0/obj-i686/dist/include/ScopedNSSTypes.h:282:22: warning: result of comparison 'mozilla::Span::index_type' (aka 'unsigned int') > 4294967295 is always false [-Wtautological-type-limit-compare] 12:27.42 if (key.Length() > std::numeric_limits<unsigned int>::max()) { 12:27.42 ~~~~~~~~~~~~ ^ ~~~~~~~~~~~~~~~~~~~~~~~~~~~~~~~~~~~~~~~~ 12:28.38 Compiling futures-macro v0.3.23 12:32.41 1 warning generated. 12:32.44 dom/media/doctor 12:35.68 dom/media/eme 12:38.89 Compiling cssparser v0.29.6 12:43.82 Compiling derive_more v0.99.17 12:43.90 dom/media/encoder 12:52.49 2 warnings generated. 12:52.60 1 warning generated. 12:57.76 dom/media/fake-cdm 12:58.75 1 warning generated. 13:02.05 dom/media/flac 13:02.11 dom/media/gmp-plugin-openh264 13:03.07 dom/media/gmp 13:03.15 In file included from UnifiedBindings5.cpp:2: 13:03.15 In file included from /tmp/B.qx2tm3hd/BUILD/firefox-105.0/obj-i686/dom/bindings/ElementInternalsBinding.cpp:31: 13:03.15 In file included from /tmp/B.qx2tm3hd/BUILD/firefox-105.0/obj-i686/dist/include/mozilla/dom/UnionConversions.h:90: 13:03.15 In file included from /tmp/B.qx2tm3hd/BUILD/firefox-105.0/obj-i686/dist/include/mozilla/dom/SubtleCryptoBinding.h:11: 13:03.15 In file included from /tmp/B.qx2tm3hd/BUILD/firefox-105.0/obj-i686/dist/include/mozilla/dom/CryptoKey.h:12: 13:03.15 /tmp/B.qx2tm3hd/BUILD/firefox-105.0/obj-i686/dist/include/ScopedNSSTypes.h:282:22: warning: result of comparison 'mozilla::Span::index_type' (aka 'unsigned int') > 4294967295 is always false [-Wtautological-type-limit-compare] 13:03.15 if (key.Length() > std::numeric_limits<unsigned int>::max()) { 13:03.15 ~~~~~~~~~~~~ ^ ~~~~~~~~~~~~~~~~~~~~~~~~~~~~~~~~~~~~~~~~ 13:08.42 Compiling cssparser-macros v0.6.0 13:09.11 In file included from UnifiedBindings6.cpp:93: 13:09.11 In file included from /tmp/B.qx2tm3hd/BUILD/firefox-105.0/obj-i686/dom/bindings/FileSystemSyncAccessHandleBinding.cpp:30: 13:09.11 In file included from /tmp/B.qx2tm3hd/BUILD/firefox-105.0/obj-i686/dist/include/mozilla/dom/UnionConversions.h:90: 13:09.11 In file included from /tmp/B.qx2tm3hd/BUILD/firefox-105.0/obj-i686/dist/include/mozilla/dom/SubtleCryptoBinding.h:11: 13:09.11 In file included from /tmp/B.qx2tm3hd/BUILD/firefox-105.0/obj-i686/dist/include/mozilla/dom/CryptoKey.h:12: 13:09.11 /tmp/B.qx2tm3hd/BUILD/firefox-105.0/obj-i686/dist/include/ScopedNSSTypes.h:282:22: warning: result of comparison 'mozilla::Span::index_type' (aka 'unsigned int') > 4294967295 is always false [-Wtautological-type-limit-compare] 13:09.11 if (key.Length() > std::numeric_limits<unsigned int>::max()) { 13:09.11 ~~~~~~~~~~~~ ^ ~~~~~~~~~~~~~~~~~~~~~~~~~~~~~~~~~~~~~~~~ 13:09.27 In file included from UnifiedBindings7.cpp:171: 13:09.27 In file included from /tmp/B.qx2tm3hd/BUILD/firefox-105.0/obj-i686/dom/bindings/GeometryUtilsBinding.cpp:24: 13:09.27 In file included from /tmp/B.qx2tm3hd/BUILD/firefox-105.0/obj-i686/dist/include/mozilla/dom/UnionConversions.h:90: 13:09.27 In file included from /tmp/B.qx2tm3hd/BUILD/firefox-105.0/obj-i686/dist/include/mozilla/dom/SubtleCryptoBinding.h:11: 13:09.27 In file included from /tmp/B.qx2tm3hd/BUILD/firefox-105.0/obj-i686/dist/include/mozilla/dom/CryptoKey.h:12: 13:09.27 /tmp/B.qx2tm3hd/BUILD/firefox-105.0/obj-i686/dist/include/ScopedNSSTypes.h:282:22: warning: result of comparison 'mozilla::Span::index_type' (aka 'unsigned int') > 4294967295 is always false [-Wtautological-type-limit-compare] 13:09.27 if (key.Length() > std::numeric_limits<unsigned int>::max()) { 13:09.27 ~~~~~~~~~~~~ ^ ~~~~~~~~~~~~~~~~~~~~~~~~~~~~~~~~~~~~~~~~ 13:09.89 Compiling inherent v1.0.2 13:11.25 Compiling profiler-macros v0.1.0 (/tmp/B.qx2tm3hd/BUILD/firefox-105.0/tools/profiler/rust-api/macros) 13:11.86 dom/media/gmp/widevine-adapter 13:16.96 Compiling prost-derive v0.8.0 13:16.96 dom/media/imagecapture 13:25.63 dom/media/ipc 13:26.86 1 warning generated. 13:32.60 1 warning generated. 13:32.74 1 warning generated. 13:38.91 Compiling num-derive v0.3.3 13:39.79 In file included from UnifiedBindings8.cpp:106: 13:39.79 In file included from /tmp/B.qx2tm3hd/BUILD/firefox-105.0/obj-i686/dom/bindings/HTMLFormControlsCollectionBinding.cpp:28: 13:39.79 In file included from /tmp/B.qx2tm3hd/BUILD/firefox-105.0/obj-i686/dist/include/mozilla/dom/UnionConversions.h:90: 13:39.79 In file included from /tmp/B.qx2tm3hd/BUILD/firefox-105.0/obj-i686/dist/include/mozilla/dom/SubtleCryptoBinding.h:11: 13:39.79 In file included from /tmp/B.qx2tm3hd/BUILD/firefox-105.0/obj-i686/dist/include/mozilla/dom/CryptoKey.h:12: 13:39.80 /tmp/B.qx2tm3hd/BUILD/firefox-105.0/obj-i686/dist/include/ScopedNSSTypes.h:282:22: warning: result of comparison 'mozilla::Span::index_type' (aka 'unsigned int') > 4294967295 is always false [-Wtautological-type-limit-compare] 13:39.80 if (key.Length() > std::numeric_limits<unsigned int>::max()) { 13:39.80 ~~~~~~~~~~~~ ^ ~~~~~~~~~~~~~~~~~~~~~~~~~~~~~~~~~~~~~~~~ 13:43.69 Compiling encoding_glue v0.1.0 (/tmp/B.qx2tm3hd/BUILD/firefox-105.0/intl/encoding_glue) 13:44.15 Compiling netwerk_helper v0.0.1 (/tmp/B.qx2tm3hd/BUILD/firefox-105.0/netwerk/base/rust-helper) 13:44.64 In file included from UnifiedBindings9.cpp:41: 13:44.64 In file included from /tmp/B.qx2tm3hd/BUILD/firefox-105.0/obj-i686/dom/bindings/HTMLOptionsCollectionBinding.cpp:31: 13:44.64 In file included from /tmp/B.qx2tm3hd/BUILD/firefox-105.0/obj-i686/dist/include/mozilla/dom/UnionConversions.h:90: 13:44.64 In file included from /tmp/B.qx2tm3hd/BUILD/firefox-105.0/obj-i686/dist/include/mozilla/dom/SubtleCryptoBinding.h:11: 13:44.64 In file included from /tmp/B.qx2tm3hd/BUILD/firefox-105.0/obj-i686/dist/include/mozilla/dom/CryptoKey.h:12: 13:44.64 /tmp/B.qx2tm3hd/BUILD/firefox-105.0/obj-i686/dist/include/ScopedNSSTypes.h:282:22: warning: result of comparison 'mozilla::Span::index_type' (aka 'unsigned int') > 4294967295 is always false [-Wtautological-type-limit-compare] 13:44.64 if (key.Length() > std::numeric_limits<unsigned int>::max()) { 13:44.64 ~~~~~~~~~~~~ ^ ~~~~~~~~~~~~~~~~~~~~~~~~~~~~~~~~~~~~~~~~ 13:48.01 Compiling weedle2 v3.0.0 14:05.23 1 warning generated. 14:07.73 Compiling glsl v6.0.1 14:08.16 1 warning generated. 14:08.19 dom/media/mediacapabilities 14:09.64 In file included from Unified_cpp_dom_ipc3.cpp:56: 14:09.64 In file included from /tmp/B.qx2tm3hd/BUILD/firefox-105.0/obj-i686/ipc/ipdl/PContent.cpp:69: 14:09.64 In file included from /tmp/B.qx2tm3hd/BUILD/firefox-105.0/obj-i686/ipc/ipdl/_ipdlheaders/mozilla/dom/PWebrtcGlobalParent.h:18: 14:09.64 In file included from /tmp/B.qx2tm3hd/BUILD/firefox-105.0/obj-i686/dist/include/mozilla/media/webrtc/WebrtcGlobal.h:8: 14:09.64 In file included from /tmp/B.qx2tm3hd/BUILD/firefox-105.0/obj-i686/dist/include/mozilla/media/webrtc/WebrtcIPCTraits.h:12: 14:09.64 In file included from /tmp/B.qx2tm3hd/BUILD/firefox-105.0/obj-i686/dist/include/mozilla/dom/RTCConfigurationBinding.h:13: 14:09.64 In file included from /tmp/B.qx2tm3hd/BUILD/firefox-105.0/obj-i686/dist/include/mozilla/dom/RTCCertificate.h:11: 14:09.65 /tmp/B.qx2tm3hd/BUILD/firefox-105.0/obj-i686/dist/include/ScopedNSSTypes.h:282:22: warning: result of comparison 'mozilla::Span::index_type' (aka 'unsigned int') > 4294967295 is always false [-Wtautological-type-limit-compare] 14:09.65 if (key.Length() > std::numeric_limits<unsigned int>::max()) { 14:09.65 ~~~~~~~~~~~~ ^ ~~~~~~~~~~~~~~~~~~~~~~~~~~~~~~~~~~~~~~~~ 14:25.84 dom/media/mediacontrol 14:32.94 dom/media/mediasession 14:38.59 Compiling cubeb v0.10.0 14:38.80 Compiling cubeb-backend v0.10.0 14:38.94 Compiling digest v0.10.3 14:40.25 Compiling malloc_size_of_derive v0.1.2 14:40.27 dom/media/mediasink 14:45.43 Compiling peek-poke-derive v0.3.0 (/tmp/B.qx2tm3hd/BUILD/firefox-105.0/gfx/wr/peek-poke/peek-poke-derive) 14:46.59 dom/media/mediasource 14:47.69 dom/media/mp3 14:48.09 dom/media/mp4 14:49.50 Compiling clap_derive v3.1.18 14:53.99 Compiling hashbrown v0.11.999 (/tmp/B.qx2tm3hd/BUILD/firefox-105.0/build/rust/hashbrown) 14:54.08 Compiling gpu-descriptor v0.2.3 14:54.42 Compiling fallible_collections v0.4.5 14:55.06 Compiling rand v0.8.5 14:56.67 Compiling tokio-reactor v0.1.3 14:58.79 Compiling darling_macro v0.13.4 14:59.88 dom/media/ogg 15:00.56 dom/media/platforms/agnostic/bytestreams 15:01.00 dom/media/platforms/agnostic/eme 15:03.72 Compiling tokio-threadpool v0.1.17 15:04.45 dom/media/platforms/agnostic/gmp 15:05.02 In file included from Unified_cpp_dom_media_ogg0.cpp:2: 15:05.02 In file included from /tmp/B.qx2tm3hd/BUILD/firefox-105.0/dom/media/ogg/OggCodecState.cpp:18: 15:05.02 In file included from /tmp/B.qx2tm3hd/BUILD/firefox-105.0/dom/media/ogg/OggRLBox.h:25: 15:05.02 In file included from /tmp/B.qx2tm3hd/BUILD/firefox-105.0/obj-i686/dist/include/mozilla/rlbox/rlbox.hpp:15: 15:05.02 /tmp/B.qx2tm3hd/BUILD/firefox-105.0/obj-i686/dist/include/mozilla/rlbox/rlbox_stdlib.hpp:231:29: warning: result of comparison 'size_t' (aka 'unsigned int') <= 4294967295 is always true [-Wtautological-type-limit-compare] 15:05.02 detail::dynamic_check(num <= std::numeric_limits<uint32_t>::max(), 15:05.02 ~~~ ^ ~~~~~~~~~~~~~~~~~~~~~~~~~~~~~~~~~~~~ 15:05.41 1 warning generated. 15:09.36 Compiling midir_impl v0.1.0 (/tmp/B.qx2tm3hd/BUILD/firefox-105.0/dom/midi/midir_impl) 15:10.03 Compiling env_logger v0.8.999 (/tmp/B.qx2tm3hd/BUILD/firefox-105.0/build/rust/env_logger) 15:10.12 Compiling thiserror v1.0.32 15:10.24 Compiling xpcom v0.1.0 (/tmp/B.qx2tm3hd/BUILD/firefox-105.0/xpcom/rust/xpcom) 15:12.59 dom/media/platforms/ffmpeg/ffmpeg57 15:14.54 dom/media/platforms/ffmpeg/ffmpeg58 15:14.70 dom/media/platforms/ffmpeg/ffmpeg59 15:14.75 1 warning generated. 15:14.79 dom/media/platforms/ffmpeg/ffvpx 15:24.43 Compiling prost v0.8.0 15:24.62 dom/media/platforms/ffmpeg/libav53 15:25.52 Compiling bindgen v0.56.999 (/tmp/B.qx2tm3hd/BUILD/firefox-105.0/build/rust/bindgen) 15:25.61 Compiling glsl-to-cxx v0.1.0 (/tmp/B.qx2tm3hd/BUILD/firefox-105.0/gfx/wr/glsl-to-cxx) 15:27.67 Compiling sha2 v0.10.2 15:29.70 dom/media/platforms/ffmpeg/libav54 15:30.01 dom/media/platforms/ffmpeg/libav55 15:33.31 dom/media/platforms/ffmpeg 15:34.68 dom/media/platforms/omx 15:37.86 dom/media/platforms 15:38.06 dom/media/systemservices 15:38.28 dom/media 15:41.32 Compiling gecko-profiler v0.1.0 (/tmp/B.qx2tm3hd/BUILD/firefox-105.0/tools/profiler/rust-api) 15:43.40 Compiling hashlink v0.7.0 15:43.44 Compiling rand v0.7.999 (/tmp/B.qx2tm3hd/BUILD/firefox-105.0/build/rust/rand) 15:44.04 Compiling darling v0.13.4 15:44.12 Compiling tokio v0.1.22 15:47.48 dom/media/utils 15:49.33 Compiling phf_generator v0.10.0 15:49.40 Compiling mp4parse v0.13.0 (https://github.com/mozilla/mp4parse-rust?rev=3bfc47d9a571d0842676043ba60716318e946c06#3bfc47d9) 15:49.47 Compiling fluent-syntax v0.11.0 15:50.53 Compiling clap v3.1.18 15:52.93 dom/media/wave 15:53.16 In file included from Unified_cpp_systemservices0.cpp:101: 15:53.16 In file included from /tmp/B.qx2tm3hd/BUILD/firefox-105.0/dom/media/systemservices/VideoEngine.cpp:8: 15:53.16 In file included from /tmp/B.qx2tm3hd/BUILD/firefox-105.0/dom/media/webrtc/libwebrtcglue/SystemTime.h:10: 15:53.16 In file included from /tmp/B.qx2tm3hd/BUILD/firefox-105.0/dom/media/webrtc/jsapi/RTCStatsReport.h:17: 15:53.16 In file included from /tmp/B.qx2tm3hd/BUILD/firefox-105.0/obj-i686/dist/include/mozilla/dom/RTCStatsReportBinding.h:6: 15:53.16 In file included from /tmp/B.qx2tm3hd/BUILD/firefox-105.0/obj-i686/dist/include/mozilla/dom/RTCConfigurationBinding.h:13: 15:53.16 In file included from /tmp/B.qx2tm3hd/BUILD/firefox-105.0/obj-i686/dist/include/mozilla/dom/RTCCertificate.h:11: 15:53.17 /tmp/B.qx2tm3hd/BUILD/firefox-105.0/obj-i686/dist/include/ScopedNSSTypes.h:282:22: warning: result of comparison 'mozilla::Span::index_type' (aka 'unsigned int') > 4294967295 is always false [-Wtautological-type-limit-compare] 15:53.17 if (key.Length() > std::numeric_limits<unsigned int>::max()) { 15:53.17 ~~~~~~~~~~~~ ^ ~~~~~~~~~~~~~~~~~~~~~~~~~~~~~~~~~~~~~~~~ 15:54.90 Compiling smallvec v1.9.0 15:55.71 Compiling bincode v1.3.3 15:55.80 dom/media/webaudio/blink 15:56.37 Compiling arrayvec v0.7.2 15:56.88 Compiling chrono v0.4.19 15:56.93 Compiling euclid v0.22.7 16:01.80 dom/media/webaudio 16:03.34 Compiling app_units v0.7.1 16:03.55 Compiling cargo-platform v0.1.2 16:04.04 Compiling serde_bytes v0.11.7 16:04.45 dom/media/webm 16:04.49 Compiling bitflags_serde_shim v0.2.2 16:04.57 Compiling ron v0.7.1 16:04.90 Compiling webrender_build v0.0.2 (/tmp/B.qx2tm3hd/BUILD/firefox-105.0/gfx/wr/webrender_build) 16:05.42 1 warning generated. 16:07.80 Compiling toml v0.5.9 16:13.57 dom/media/webrtc/common 16:13.61 warning: unknown warning option '-Werror=trampolines' [-Wunknown-warning-option] 16:13.70 1 warning generated. 16:16.58 dom/media/webrtc/jsapi 16:17.03 dom/media/webrtc/jsep 16:18.63 In file included from Unified_cpp_media_webrtc_jsapi0.cpp:2: 16:18.63 In file included from /tmp/B.qx2tm3hd/BUILD/firefox-105.0/dom/media/webrtc/jsapi/MediaTransportHandler.cpp:5: 16:18.63 In file included from /tmp/B.qx2tm3hd/BUILD/firefox-105.0/dom/media/webrtc/jsapi/MediaTransportHandler.h:12: 16:18.63 In file included from /tmp/B.qx2tm3hd/BUILD/firefox-105.0/dom/media/webrtc/transport/dtlsidentity.h:13: 16:18.63 /tmp/B.qx2tm3hd/BUILD/firefox-105.0/obj-i686/dist/include/ScopedNSSTypes.h:282:22: warning: result of comparison 'mozilla::Span::index_type' (aka 'unsigned int') > 4294967295 is always false [-Wtautological-type-limit-compare] 16:18.63 if (key.Length() > std::numeric_limits<unsigned int>::max()) { 16:18.63 ~~~~~~~~~~~~ ^ ~~~~~~~~~~~~~~~~~~~~~~~~~~~~~~~~~~~~~~~~ 16:25.31 Compiling futures-executor v0.3.23 16:26.41 Compiling moz_task v0.1.0 (/tmp/B.qx2tm3hd/BUILD/firefox-105.0/xpcom/rust/moz_task) 16:26.81 dom/media/webrtc/libwebrtcglue 16:28.63 Compiling storage_variant v0.1.0 (/tmp/B.qx2tm3hd/BUILD/firefox-105.0/storage/variant) 16:29.31 Compiling unic-langid-ffi v0.1.0 (/tmp/B.qx2tm3hd/BUILD/firefox-105.0/intl/locale/rust/unic-langid-ffi) 16:29.64 Compiling processtools v0.1.0 (/tmp/B.qx2tm3hd/BUILD/firefox-105.0/toolkit/components/processtools) 16:30.30 Compiling rust_cascade v1.4.0 16:30.56 In file included from Unified_cpp_libwebrtcglue0.cpp:2: 16:30.56 In file included from /tmp/B.qx2tm3hd/BUILD/firefox-105.0/dom/media/webrtc/libwebrtcglue/AudioConduit.cpp:5: 16:30.56 In file included from /tmp/B.qx2tm3hd/BUILD/firefox-105.0/dom/media/webrtc/libwebrtcglue/AudioConduit.h:14: 16:30.56 In file included from /tmp/B.qx2tm3hd/BUILD/firefox-105.0/dom/media/webrtc/libwebrtcglue/MediaConduitInterface.h:14: 16:30.56 In file included from /tmp/B.qx2tm3hd/BUILD/firefox-105.0/dom/media/webrtc/jsapi/RTCStatsReport.h:17: 16:30.56 In file included from /tmp/B.qx2tm3hd/BUILD/firefox-105.0/obj-i686/dist/include/mozilla/dom/RTCStatsReportBinding.h:6: 16:30.56 In file included from /tmp/B.qx2tm3hd/BUILD/firefox-105.0/obj-i686/dist/include/mozilla/dom/RTCConfigurationBinding.h:13: 16:30.57 In file included from /tmp/B.qx2tm3hd/BUILD/firefox-105.0/obj-i686/dist/include/mozilla/dom/RTCCertificate.h:11: 16:30.57 /tmp/B.qx2tm3hd/BUILD/firefox-105.0/obj-i686/dist/include/ScopedNSSTypes.h:282:22: warning: result of comparison 'mozilla::Span::index_type' (aka 'unsigned int') > 4294967295 is always false [-Wtautological-type-limit-compare] 16:30.57 if (key.Length() > std::numeric_limits<unsigned int>::max()) { 16:30.57 ~~~~~~~~~~~~ ^ ~~~~~~~~~~~~~~~~~~~~~~~~~~~~~~~~~~~~~~~~ 16:31.59 Compiling derive_common v0.0.1 (/tmp/B.qx2tm3hd/BUILD/firefox-105.0/servo/components/derive_common) 16:32.45 dom/media/webrtc/sdp 16:34.63 Compiling serde_with_macros v1.5.2 16:34.73 Compiling enumset_derive v0.6.0 16:42.23 Compiling phf_codegen v0.10.0 16:42.42 Compiling phf_macros v0.10.0 16:42.81 Compiling mp4parse_capi v0.13.0 (https://github.com/mozilla/mp4parse-rust?rev=3bfc47d9a571d0842676043ba60716318e946c06#3bfc47d9) 16:49.56 Compiling tinyvec v1.999.999 (/tmp/B.qx2tm3hd/BUILD/firefox-105.0/build/rust/tinyvec) 16:50.41 Compiling fluent-bundle v0.15.2 16:56.37 Compiling naga v0.8.0 (https://github.com/gfx-rs/naga?rev=27d38aae#27d38aae) 17:00.10 1 warning generated. 17:00.14 dom/media/webrtc 17:04.48 dom/media/webrtc/transport/build 17:05.08 dom/media/webrtc/transport/ipc 17:06.50 In file included from /tmp/B.qx2tm3hd/BUILD/firefox-105.0/dom/media/webrtc/transport/SrtpFlow.cpp:12: 17:06.50 In file included from /tmp/B.qx2tm3hd/BUILD/firefox-105.0/dom/media/webrtc/transport/transportlayerdtls.h:25: 17:06.50 /tmp/B.qx2tm3hd/BUILD/firefox-105.0/obj-i686/dist/include/ScopedNSSTypes.h:282:22: warning: result of comparison 'mozilla::Span::index_type' (aka 'unsigned int') > 4294967295 is always false [-Wtautological-type-limit-compare] 17:06.50 if (key.Length() > std::numeric_limits<unsigned int>::max()) { 17:06.51 ~~~~~~~~~~~~ ^ ~~~~~~~~~~~~~~~~~~~~~~~~~~~~~~~~~~~~~~~~ 17:07.30 1 warning generated. 17:11.20 Compiling uluru v3.0.0 17:11.36 Compiling peek-poke v0.3.0 (/tmp/B.qx2tm3hd/BUILD/firefox-105.0/gfx/wr/peek-poke) 17:11.86 Compiling plane-split v0.17.1 17:12.24 Compiling etagere v0.2.7 17:12.71 Compiling gkrust_utils v0.1.0 (/tmp/B.qx2tm3hd/BUILD/firefox-105.0/xpcom/rust/gkrust_utils) 17:12.88 Compiling cubeb-pulse v0.4.0 (https://github.com/mozilla/cubeb-pulse-rs?rev=1f1fe1e08e01a9a534ec7f079702a583a0899ce7#1f1fe1e0) 17:14.87 Compiling wr_malloc_size_of v0.0.2 (/tmp/B.qx2tm3hd/BUILD/firefox-105.0/gfx/wr/wr_malloc_size_of) 17:17.33 Compiling wgpu-types v0.12.0 (https://github.com/gfx-rs/wgpu?rev=b370b990#b370b990) 17:17.50 In file included from /tmp/B.qx2tm3hd/BUILD/firefox-105.0/dom/media/webrtc/transport/dtlsidentity.cpp:7: 17:17.50 In file included from /tmp/B.qx2tm3hd/BUILD/firefox-105.0/dom/media/webrtc/transport/dtlsidentity.h:13: 17:17.50 /tmp/B.qx2tm3hd/BUILD/firefox-105.0/obj-i686/dist/include/ScopedNSSTypes.h:282:22: warning: result of comparison 'mozilla::Span::index_type' (aka 'unsigned int') > 4294967295 is always false [-Wtautological-type-limit-compare] 17:17.50 if (key.Length() > std::numeric_limits<unsigned int>::max()) { 17:17.50 ~~~~~~~~~~~~ ^ ~~~~~~~~~~~~~~~~~~~~~~~~~~~~~~~~~~~~~~~~ 17:18.54 1 warning generated. 17:21.89 Compiling askama_shared v0.12.2 17:23.35 In file included from Unified_cpp_dom_media_webrtc0.cpp:56: 17:23.35 In file included from /tmp/B.qx2tm3hd/BUILD/firefox-105.0/dom/media/webrtc/RTCCertificate.cpp:7: 17:23.35 In file included from /tmp/B.qx2tm3hd/BUILD/firefox-105.0/obj-i686/dist/include/mozilla/dom/RTCCertificate.h:11: 17:23.36 /tmp/B.qx2tm3hd/BUILD/firefox-105.0/obj-i686/dist/include/ScopedNSSTypes.h:282:22: warning: result of comparison 'mozilla::Span::index_type' (aka 'unsigned int') > 4294967295 is always false [-Wtautological-type-limit-compare] 17:23.36 if (key.Length() > std::numeric_limits<unsigned int>::max()) { 17:23.36 ~~~~~~~~~~~~ ^ ~~~~~~~~~~~~~~~~~~~~~~~~~~~~~~~~~~~~~~~~ 17:25.41 dom/media/webrtc/transport/third_party/nICEr 17:25.45 warning: unknown warning option '-Werror=trampolines' [-Wunknown-warning-option] 17:26.03 Compiling toml v0.4.999 (/tmp/B.qx2tm3hd/BUILD/firefox-105.0/build/rust/toml) 17:26.11 Compiling rustc_version v0.4.0 17:28.37 1 warning generated. 17:28.41 warning: unknown warning option '-Werror=trampolines' [-Wunknown-warning-option] 17:28.62 Compiling style v0.0.1 (/tmp/B.qx2tm3hd/BUILD/firefox-105.0/servo/components/style) 17:30.47 1 warning generated. 17:30.51 warning: unknown warning option '-Werror=trampolines' [-Wunknown-warning-option] 17:30.60 1 warning generated. 17:30.61 dom/media/webrtc/transport/third_party/nrappkit 17:30.65 warning: unknown warning option '-Werror=trampolines' [-Wunknown-warning-option] 17:31.64 1 warning generated. 17:32.23 1 warning generated. 17:32.24 dom/media/webrtc/transportbridge 17:35.40 Compiling cargo_metadata v0.14.2 17:35.97 In file included from Unified_cpp_transportbridge0.cpp:2: 17:35.97 In file included from /tmp/B.qx2tm3hd/BUILD/firefox-105.0/dom/media/webrtc/transportbridge/MediaPipeline.cpp:8: 17:35.97 In file included from /tmp/B.qx2tm3hd/BUILD/firefox-105.0/dom/media/webrtc/transportbridge/MediaPipeline.h:16: 17:35.97 In file included from /tmp/B.qx2tm3hd/BUILD/firefox-105.0/dom/media/webrtc/libwebrtcglue/MediaConduitInterface.h:14: 17:35.97 In file included from /tmp/B.qx2tm3hd/BUILD/firefox-105.0/dom/media/webrtc/jsapi/RTCStatsReport.h:17: 17:35.97 In file included from /tmp/B.qx2tm3hd/BUILD/firefox-105.0/obj-i686/dist/include/mozilla/dom/RTCStatsReportBinding.h:6: 17:35.97 In file included from /tmp/B.qx2tm3hd/BUILD/firefox-105.0/obj-i686/dist/include/mozilla/dom/RTCConfigurationBinding.h:13: 17:35.97 In file included from /tmp/B.qx2tm3hd/BUILD/firefox-105.0/obj-i686/dist/include/mozilla/dom/RTCCertificate.h:11: 17:35.98 /tmp/B.qx2tm3hd/BUILD/firefox-105.0/obj-i686/dist/include/ScopedNSSTypes.h:282:22: warning: result of comparison 'mozilla::Span::index_type' (aka 'unsigned int') > 4294967295 is always false [-Wtautological-type-limit-compare] 17:35.98 if (key.Length() > std::numeric_limits<unsigned int>::max()) { 17:35.98 ~~~~~~~~~~~~ ^ ~~~~~~~~~~~~~~~~~~~~~~~~~~~~~~~~~~~~~~~~ 17:37.14 In file included from /tmp/B.qx2tm3hd/BUILD/firefox-105.0/dom/media/webrtc/transport/nricectx.cpp:57: 17:37.14 /tmp/B.qx2tm3hd/BUILD/firefox-105.0/obj-i686/dist/include/ScopedNSSTypes.h:282:22: warning: result of comparison 'mozilla::Span::index_type' (aka 'unsigned int') > 4294967295 is always false [-Wtautological-type-limit-compare] 17:37.14 if (key.Length() > std::numeric_limits<unsigned int>::max()) { 17:37.14 ~~~~~~~~~~~~ ^ ~~~~~~~~~~~~~~~~~~~~~~~~~~~~~~~~~~~~~~~~ 17:40.13 1 warning generated. 17:46.40 1 warning generated. 17:46.44 dom/media/webspeech/recognition 17:50.09 Compiling futures v0.3.23 17:50.17 Compiling storage v0.1.0 (/tmp/B.qx2tm3hd/BUILD/firefox-105.0/storage/rust) 17:50.99 Compiling fluent-langneg-ffi v0.1.0 (/tmp/B.qx2tm3hd/BUILD/firefox-105.0/intl/locale/rust/fluent-langneg-ffi) 17:51.46 In file included from /tmp/B.qx2tm3hd/BUILD/firefox-105.0/dom/media/webrtc/transport/transportlayerdtls.cpp:9: 17:51.46 In file included from /tmp/B.qx2tm3hd/BUILD/firefox-105.0/dom/media/webrtc/transport/transportlayerdtls.h:25: 17:51.46 /tmp/B.qx2tm3hd/BUILD/firefox-105.0/obj-i686/dist/include/ScopedNSSTypes.h:282:22: warning: result of comparison 'mozilla::Span::index_type' (aka 'unsigned int') > 4294967295 is always false [-Wtautological-type-limit-compare] 17:51.46 if (key.Length() > std::numeric_limits<unsigned int>::max()) { 17:51.46 ~~~~~~~~~~~~ ^ ~~~~~~~~~~~~~~~~~~~~~~~~~~~~~~~~~~~~~~~~ 17:52.55 Compiling swgl v0.1.0 (/tmp/B.qx2tm3hd/BUILD/firefox-105.0/gfx/wr/swgl) 17:54.47 1 warning generated. 17:55.27 Compiling webrender v0.62.0 (/tmp/B.qx2tm3hd/BUILD/firefox-105.0/gfx/wr/webrender) 17:55.28 1 warning generated. 17:55.33 dom/media/webspeech/synth/speechd 17:55.42 Compiling cascade_bloom_filter v0.1.0 (/tmp/B.qx2tm3hd/BUILD/firefox-105.0/toolkit/components/cascade_bloom_filter) 17:56.18 Compiling to_shmem_derive v0.0.1 (/tmp/B.qx2tm3hd/BUILD/firefox-105.0/servo/components/to_shmem_derive) 17:56.68 In file included from /tmp/B.qx2tm3hd/BUILD/firefox-105.0/dom/media/webrtc/transport/transportlayersrtp.cpp:10: 17:56.68 In file included from /tmp/B.qx2tm3hd/BUILD/firefox-105.0/dom/media/webrtc/transport/transportlayerdtls.h:25: 17:56.68 /tmp/B.qx2tm3hd/BUILD/firefox-105.0/obj-i686/dist/include/ScopedNSSTypes.h:282:22: warning: result of comparison 'mozilla::Span::index_type' (aka 'unsigned int') > 4294967295 is always false [-Wtautological-type-limit-compare] 17:56.68 if (key.Length() > std::numeric_limits<unsigned int>::max()) { 17:56.68 ~~~~~~~~~~~~ ^ ~~~~~~~~~~~~~~~~~~~~~~~~~~~~~~~~~~~~~~~~ 17:57.58 1 warning generated. 17:57.60 dom/media/webspeech/synth 17:58.20 Compiling style_derive v0.0.1 (/tmp/B.qx2tm3hd/BUILD/firefox-105.0/servo/components/style_derive) 17:58.97 Compiling enumset v1.0.11 17:59.36 Compiling selectors v0.22.0 (/tmp/B.qx2tm3hd/BUILD/firefox-105.0/servo/components/selectors) 17:59.47 Compiling serde_with v1.14.0 17:59.88 dom/media/webvtt 18:01.83 Compiling unicode-normalization v0.1.21 18:03.11 dom/messagechannel 18:03.43 Compiling parking_lot v0.11.2 18:03.68 Compiling fluent v0.16.0 18:03.77 Compiling phf v0.10.1 18:04.04 Compiling rusqlite v0.27.0 18:06.00 Compiling origin-trial-token v0.1.1 18:08.85 Compiling audioipc-client v0.4.0 (https://github.com/mozilla/audioipc?rev=fb7a2b12ced3b43e6a268621989c6191d1ed7e39#fb7a2b12) 18:10.88 dom/midi 18:10.94 Compiling audioipc-server v0.2.3 (https://github.com/mozilla/audioipc?rev=fb7a2b12ced3b43e6a268621989c6191d1ed7e39#fb7a2b12) 18:14.18 Compiling sfv v0.9.2 18:18.27 Compiling webrender_api v0.62.0 (/tmp/B.qx2tm3hd/BUILD/firefox-105.0/gfx/wr/webrender_api) 18:21.64 dom/network 18:22.93 Compiling audioipc2-server v0.5.0 (https://github.com/kinetiknz/audioipc-2?rev=499b95580c8b276e52bd9757d735249504202e5c#499b9558) 18:24.92 Compiling audioipc2-client v0.5.0 (https://github.com/kinetiknz/audioipc-2?rev=499b95580c8b276e52bd9757d735249504202e5c#499b9558) 18:28.22 Compiling neqo-crypto v0.5.7 (https://github.com/mozilla/neqo?tag=v0.5.7#f3de275b) 18:28.89 dom/notification 18:28.94 Compiling mozglue-static v0.1.0 (/tmp/B.qx2tm3hd/BUILD/firefox-105.0/mozglue/static/rust) 18:35.28 Compiling fluent-fallback v0.6.0 18:36.37 Compiling askama_derive v0.11.2 18:36.64 Compiling mdns_service v0.1.0 (/tmp/B.qx2tm3hd/BUILD/firefox-105.0/dom/media/webrtc/transport/mdns_service) 18:49.90 dom/offline 18:50.53 Compiling idna v0.2.3 18:51.65 Compiling qlog v0.4.0 18:55.28 Compiling parking_lot v0.12.999 (/tmp/B.qx2tm3hd/BUILD/firefox-105.0/build/rust/parking_lot) 18:56.20 dom/origin-trials/keys.inc.stub 18:56.51 dom/payments/ipc 18:57.18 Compiling sync-guid v0.1.0 (https://github.com/mozilla/application-services?rev=2689788cecf24c385e6b7440e3aa1a89c511f14a#2689788c) 18:58.48 dom/payments 18:59.35 Compiling origin-trials-ffi v0.1.0 (/tmp/B.qx2tm3hd/BUILD/firefox-105.0/dom/origin-trials/ffi) 18:59.58 Compiling uniffi v0.19.3 18:59.68 Compiling http_sfv v0.1.0 (/tmp/B.qx2tm3hd/BUILD/firefox-105.0/netwerk/base/http-sfv) 19:00.58 Compiling l10nregistry v0.3.0 (/tmp/B.qx2tm3hd/BUILD/firefox-105.0/intl/l10n/rust/l10nregistry-rs) 19:03.52 dom/performance 19:04.68 Compiling askama v0.11.1 19:04.79 Compiling url v2.1.0 19:06.77 Compiling interrupt-support v0.1.0 (https://github.com/mozilla/application-services?rev=2689788cecf24c385e6b7440e3aa1a89c511f14a#2689788c) 19:07.26 Compiling wgpu-hal v0.12.0 (https://github.com/gfx-rs/wgpu?rev=b370b990#b370b990) 19:09.15 Compiling to_shmem v0.0.1 (/tmp/B.qx2tm3hd/BUILD/firefox-105.0/servo/components/to_shmem) 19:09.98 Compiling fluent-ffi v0.1.0 (/tmp/B.qx2tm3hd/BUILD/firefox-105.0/intl/l10n/rust/fluent-ffi) 19:10.74 Compiling uniffi_bindgen v0.19.3 19:11.19 dom/permission 19:15.55 Compiling rkv v0.17.1 19:16.93 Compiling sync15-traits v0.1.0 (https://github.com/mozilla/application-services?rev=2689788cecf24c385e6b7440e3aa1a89c511f14a#2689788c) 19:18.29 dom/plugins/base 19:22.14 dom/power 19:23.67 Compiling viaduct v0.1.0 (https://github.com/mozilla/application-services?rev=2689788cecf24c385e6b7440e3aa1a89c511f14a#2689788c) 19:26.55 dom/prio 19:27.39 Compiling webrtc-sdp v0.3.9 19:30.20 dom/promise 19:30.23 Compiling bookmark_sync v0.1.0 (/tmp/B.qx2tm3hd/BUILD/firefox-105.0/toolkit/components/places/bookmark_sync) 19:31.49 dom/prototype 19:37.25 dom/push 19:41.17 dom/quota 19:41.84 Compiling mozurl v0.0.1 (/tmp/B.qx2tm3hd/BUILD/firefox-105.0/netwerk/base/mozurl) 19:47.26 dom/reporting 19:48.95 Compiling jsrust_shared v0.1.0 (/tmp/B.qx2tm3hd/BUILD/firefox-105.0/js/src/rust/shared) 19:49.02 Compiling l10nregistry-ffi v0.1.0 (/tmp/B.qx2tm3hd/BUILD/firefox-105.0/intl/l10n/rust/l10nregistry-ffi) 19:54.13 In file included from Unified_cpp_dom_quota0.cpp:101: 19:54.13 In file included from /tmp/B.qx2tm3hd/BUILD/firefox-105.0/dom/quota/NSSCipherStrategy.cpp:7: 19:54.13 In file included from /tmp/B.qx2tm3hd/BUILD/firefox-105.0/dom/quota/NSSCipherStrategy.h:20: 19:54.13 /tmp/B.qx2tm3hd/BUILD/firefox-105.0/obj-i686/dist/include/ScopedNSSTypes.h:282:22: warning: result of comparison 'mozilla::Span::index_type' (aka 'unsigned int') > 4294967295 is always false [-Wtautological-type-limit-compare] 19:54.13 if (key.Length() > std::numeric_limits<unsigned int>::max()) { 19:54.13 ~~~~~~~~~~~~ ^ ~~~~~~~~~~~~~~~~~~~~~~~~~~~~~~~~~~~~~~~~ 19:54.79 Compiling cert_storage v0.0.1 (/tmp/B.qx2tm3hd/BUILD/firefox-105.0/security/manager/ssl/cert_storage) 19:56.11 dom/script 20:01.89 Compiling kvstore v0.1.0 (/tmp/B.qx2tm3hd/BUILD/firefox-105.0/toolkit/components/kvstore) 20:02.12 dom/security/featurepolicy 20:05.87 Compiling golden_gate v0.1.0 (/tmp/B.qx2tm3hd/BUILD/firefox-105.0/services/sync/golden_gate) 20:06.68 Compiling uniffi_build v0.19.3 20:06.82 Compiling rsdparsa_capi v0.1.0 (/tmp/B.qx2tm3hd/BUILD/firefox-105.0/dom/media/webrtc/sdp/rsdparsa_capi) 20:12.12 dom/security/sanitizer 20:13.21 Compiling neqo-transport v0.5.7 (https://github.com/mozilla/neqo?tag=v0.5.7#f3de275b) 20:13.95 dom/security 20:15.94 1 warning generated. 20:18.64 dom/serializers 20:26.84 Compiling malloc_size_of v0.0.1 (/tmp/B.qx2tm3hd/BUILD/firefox-105.0/servo/components/malloc_size_of) 20:27.24 Compiling localization-ffi v0.1.0 (/tmp/B.qx2tm3hd/BUILD/firefox-105.0/intl/l10n/rust/localization-ffi) 20:33.23 dom/serviceworkers 20:34.34 dom/simpledb 20:42.37 Compiling wgpu_bindings v0.1.0 (/tmp/B.qx2tm3hd/BUILD/firefox-105.0/gfx/wgpu_bindings) 20:44.56 Compiling app_services_logger v0.1.0 (/tmp/B.qx2tm3hd/BUILD/firefox-105.0/services/common/app_services_logger) 20:46.17 Compiling webext_storage_bridge v0.1.0 (/tmp/B.qx2tm3hd/BUILD/firefox-105.0/toolkit/components/extensions/storage/webext_storage_bridge) 20:47.80 dom/smil 20:51.10 Compiling neqo-qpack v0.5.7 (https://github.com/mozilla/neqo?tag=v0.5.7#f3de275b) 20:57.71 Compiling style_traits v0.0.1 (/tmp/B.qx2tm3hd/BUILD/firefox-105.0/servo/components/style_traits) 20:59.43 Compiling glean-core v51.1.0 21:00.16 Compiling uniffi_macros v0.19.3 21:00.80 Compiling gecko_logger v0.1.0 (/tmp/B.qx2tm3hd/BUILD/firefox-105.0/xpcom/rust/gecko_logger) 21:00.90 Compiling neqo-http3 v0.5.7 (https://github.com/mozilla/neqo?tag=v0.5.7#f3de275b) 21:01.90 dom/storage 21:04.27 Compiling neqo_glue v0.1.0 (/tmp/B.qx2tm3hd/BUILD/firefox-105.0/netwerk/socket/neqo_glue) 21:15.51 dom/streams 21:25.59 Compiling glean v51.1.0 21:27.42 Compiling fog v0.1.0 (/tmp/B.qx2tm3hd/BUILD/firefox-105.0/toolkit/components/glean/api) 21:40.76 dom/svg 21:55.67 dom/system/linux 22:04.95 dom/system 22:09.29 In file included from Unified_cpp_dom_system0.cpp:2: 22:09.29 In file included from /tmp/B.qx2tm3hd/BUILD/firefox-105.0/dom/system/IOUtils.cpp:48: 22:09.29 In file included from /tmp/B.qx2tm3hd/BUILD/firefox-105.0/obj-i686/dist/include/nsNSSComponent.h:10: 22:09.29 In file included from /tmp/B.qx2tm3hd/BUILD/firefox-105.0/obj-i686/dist/include/nsINSSComponent.h:24: 22:09.29 In file included from /tmp/B.qx2tm3hd/BUILD/firefox-105.0/obj-i686/dist/include/SharedCertVerifier.h:8: 22:09.29 In file included from /tmp/B.qx2tm3hd/BUILD/firefox-105.0/obj-i686/dist/include/CertVerifier.h:15: 22:09.30 /tmp/B.qx2tm3hd/BUILD/firefox-105.0/obj-i686/dist/include/ScopedNSSTypes.h:282:22: warning: result of comparison 'mozilla::Span::index_type' (aka 'unsigned int') > 4294967295 is always false [-Wtautological-type-limit-compare] 22:09.30 if (key.Length() > std::numeric_limits<unsigned int>::max()) { 22:09.30 ~~~~~~~~~~~~ ^ ~~~~~~~~~~~~~~~~~~~~~~~~~~~~~~~~~~~~~~~~ 22:20.92 Compiling fog_control v0.1.0 (/tmp/B.qx2tm3hd/BUILD/firefox-105.0/toolkit/components/glean) 22:22.27 Compiling jog v0.1.0 (/tmp/B.qx2tm3hd/BUILD/firefox-105.0/toolkit/components/glean/bindings/jog) 22:27.53 dom/u2f 22:27.96 1 warning generated. 22:27.99 dom/url 22:33.26 In file included from Unified_cpp_dom_u2f0.cpp:2: 22:33.26 In file included from /tmp/B.qx2tm3hd/BUILD/firefox-105.0/dom/u2f/U2F.cpp:8: 22:33.26 In file included from /tmp/B.qx2tm3hd/BUILD/firefox-105.0/obj-i686/dist/include/mozilla/dom/WebCryptoCommon.h:30: 22:33.26 /tmp/B.qx2tm3hd/BUILD/firefox-105.0/security/manager/ssl/ScopedNSSTypes.h:282:22: warning: result of comparison 'mozilla::Span::index_type' (aka 'unsigned int') > 4294967295 is always false [-Wtautological-type-limit-compare] 22:33.26 if (key.Length() > std::numeric_limits<unsigned int>::max()) { 22:33.27 ~~~~~~~~~~~~ ^ ~~~~~~~~~~~~~~~~~~~~~~~~~~~~~~~~~~~~~~~~ 22:37.75 dom/vr 22:39.77 1 warning generated. 22:39.80 dom/webauthn 22:41.74 dom/webbrowserpersist 22:45.01 In file included from Unified_cpp_dom_webauthn0.cpp:38: 22:45.01 In file included from /tmp/B.qx2tm3hd/BUILD/firefox-105.0/dom/webauthn/U2FHIDTokenManager.cpp:7: 22:45.01 In file included from /tmp/B.qx2tm3hd/BUILD/firefox-105.0/dom/webauthn/WebAuthnCoseIdentifiers.h:10: 22:45.01 In file included from /tmp/B.qx2tm3hd/BUILD/firefox-105.0/obj-i686/dist/include/mozilla/dom/WebCryptoCommon.h:30: 22:45.01 /tmp/B.qx2tm3hd/BUILD/firefox-105.0/security/manager/ssl/ScopedNSSTypes.h:282:22: warning: result of comparison 'mozilla::Span::index_type' (aka 'unsigned int') > 4294967295 is always false [-Wtautological-type-limit-compare] 22:45.01 if (key.Length() > std::numeric_limits<unsigned int>::max()) { 22:45.01 ~~~~~~~~~~~~ ^ ~~~~~~~~~~~~~~~~~~~~~~~~~~~~~~~~~~~~~~~~ 23:00.27 1 warning generated. 23:10.51 dom/webgpu 23:10.79 dom/webscheduling 23:11.30 dom/websocket 23:17.21 dom/workers/loader 23:18.42 dom/workers/remoteworkers 23:20.14 dom/workers/sharedworkers 23:20.31 Compiling geckoservo v0.0.1 (/tmp/B.qx2tm3hd/BUILD/firefox-105.0/servo/ports/geckolib) 23:25.39 dom/workers 23:28.41 dom/worklet 23:30.32 dom/xhr 23:39.65 dom/xml 23:40.75 dom/xslt/base 23:42.06 In file included from Unified_cpp_dom_xhr0.cpp:47: 23:42.06 In file included from /tmp/B.qx2tm3hd/BUILD/firefox-105.0/dom/xhr/XMLHttpRequestWorker.cpp:30: 23:42.06 In file included from /tmp/B.qx2tm3hd/BUILD/firefox-105.0/obj-i686/dist/include/mozilla/dom/UnionConversions.h:90: 23:42.06 In file included from /tmp/B.qx2tm3hd/BUILD/firefox-105.0/obj-i686/dist/include/mozilla/dom/SubtleCryptoBinding.h:11: 23:42.06 In file included from /tmp/B.qx2tm3hd/BUILD/firefox-105.0/obj-i686/dist/include/mozilla/dom/CryptoKey.h:12: 23:42.06 /tmp/B.qx2tm3hd/BUILD/firefox-105.0/obj-i686/dist/include/ScopedNSSTypes.h:282:22: warning: result of comparison 'mozilla::Span::index_type' (aka 'unsigned int') > 4294967295 is always false [-Wtautological-type-limit-compare] 23:42.06 if (key.Length() > std::numeric_limits<unsigned int>::max()) { 23:42.06 ~~~~~~~~~~~~ ^ ~~~~~~~~~~~~~~~~~~~~~~~~~~~~~~~~~~~~~~~~ 23:47.34 dom/xslt/xml 23:52.49 dom/xslt/xpath 23:54.64 1 warning generated. 23:54.67 dom/xslt/xslt 23:55.55 dom/xul 24:02.09 In file included from Unified_cpp_dom_workers1.cpp:47: 24:02.09 In file included from /tmp/B.qx2tm3hd/BUILD/firefox-105.0/dom/workers/WorkerScope.cpp:12: 24:02.09 In file included from /tmp/B.qx2tm3hd/BUILD/firefox-105.0/dom/base/Crypto.h:10: 24:02.09 In file included from /tmp/B.qx2tm3hd/BUILD/firefox-105.0/obj-i686/dist/include/mozilla/dom/SubtleCrypto.h:13: 24:02.09 In file included from /tmp/B.qx2tm3hd/BUILD/firefox-105.0/obj-i686/dist/include/mozilla/dom/CryptoKey.h:12: 24:02.09 /tmp/B.qx2tm3hd/BUILD/firefox-105.0/obj-i686/dist/include/ScopedNSSTypes.h:282:22: warning: result of comparison 'mozilla::Span::index_type' (aka 'unsigned int') > 4294967295 is always false [-Wtautological-type-limit-compare] 24:02.09 if (key.Length() > std::numeric_limits<unsigned int>::max()) { 24:02.09 ~~~~~~~~~~~~ ^ ~~~~~~~~~~~~~~~~~~~~~~~~~~~~~~~~~~~~~~~~ 24:04.21 editor/composer 24:11.76 editor/libeditor 24:14.61 1 warning generated. 24:14.65 editor/spellchecker 24:15.62 editor/txmgr 24:19.62 extensions/auth 24:24.85 extensions/permissions 24:26.89 extensions/pref/autoconfig/src 24:27.14 In file included from /tmp/B.qx2tm3hd/BUILD/firefox-105.0/extensions/auth/nsIAuthModule.cpp:15: 24:27.14 In file included from /tmp/B.qx2tm3hd/BUILD/firefox-105.0/security/manager/ssl/nsNSSComponent.h:10: 24:27.14 In file included from /tmp/B.qx2tm3hd/BUILD/firefox-105.0/obj-i686/dist/include/nsINSSComponent.h:24: 24:27.14 In file included from /tmp/B.qx2tm3hd/BUILD/firefox-105.0/obj-i686/dist/include/SharedCertVerifier.h:8: 24:27.14 In file included from /tmp/B.qx2tm3hd/BUILD/firefox-105.0/obj-i686/dist/include/CertVerifier.h:15: 24:27.14 /tmp/B.qx2tm3hd/BUILD/firefox-105.0/obj-i686/dist/include/ScopedNSSTypes.h:282:22: warning: result of comparison 'mozilla::Span::index_type' (aka 'unsigned int') > 4294967295 is always false [-Wtautological-type-limit-compare] 24:27.14 if (key.Length() > std::numeric_limits<unsigned int>::max()) { 24:27.14 ~~~~~~~~~~~~ ^ ~~~~~~~~~~~~~~~~~~~~~~~~~~~~~~~~~~~~~~~~ 24:27.98 extensions/spellcheck/hunspell/glue 24:28.01 1 warning generated. 24:29.32 extensions/spellcheck/hunspell/src 24:30.26 In file included from Unified_cpp_hunspell_glue0.cpp:2: 24:30.26 In file included from /tmp/B.qx2tm3hd/BUILD/firefox-105.0/extensions/spellcheck/hunspell/glue/RLBoxHunspell.cpp:10: 24:30.26 In file included from /tmp/B.qx2tm3hd/BUILD/firefox-105.0/extensions/spellcheck/hunspell/glue/RLBoxHunspell.h:25: 24:30.26 In file included from /tmp/B.qx2tm3hd/BUILD/firefox-105.0/obj-i686/dist/include/mozilla/rlbox/rlbox.hpp:15: 24:30.26 /tmp/B.qx2tm3hd/BUILD/firefox-105.0/obj-i686/dist/include/mozilla/rlbox/rlbox_stdlib.hpp:231:29: warning: result of comparison 'size_t' (aka 'unsigned int') <= 4294967295 is always true [-Wtautological-type-limit-compare] 24:30.26 detail::dynamic_check(num <= std::numeric_limits<uint32_t>::max(), 24:30.27 ~~~ ^ ~~~~~~~~~~~~~~~~~~~~~~~~~~~~~~~~~~~~ 24:30.35 extensions/spellcheck/src 24:32.26 In file included from <built-in>:3: 24:32.26 In file included from /tmp/B.qx2tm3hd/BUILD/firefox-105.0/extensions/spellcheck/hunspell/glue/hunspell_alloc_hooks.h:47: 24:32.26 In file included from /tmp/B.qx2tm3hd/BUILD/firefox-105.0/extensions/spellcheck/hunspell/glue/mozHunspellAllocator.h:10: 24:32.26 /tmp/B.qx2tm3hd/BUILD/firefox-105.0/obj-i686/dist/include/mozilla/CountingAllocatorBase.h:111:5: warning: instantiation of variable 'mozilla::CountingAllocatorBase<HunspellAllocator>::sAmount' required here, but no definition is available [-Wundefined-var-template] 24:32.26 sAmount -= MallocSizeOfOnFree(p); 24:32.26 ^ 24:32.26 /tmp/B.qx2tm3hd/BUILD/firefox-105.0/obj-i686/dist/include/js/Utility.h:414:3: note: in instantiation of member function 'mozilla::CountingAllocatorBase<HunspellAllocator>::CountingFree' requested here 24:32.26 free(p); 24:32.26 ^ 24:32.26 /tmp/B.qx2tm3hd/BUILD/firefox-105.0/extensions/spellcheck/hunspell/glue/hunspell_alloc_hooks.h:56:38: note: expanded from macro 'free' 24:32.26 #define free(ptr) HunspellAllocator::CountingFree(ptr) 24:32.26 ^ 24:32.26 /tmp/B.qx2tm3hd/BUILD/firefox-105.0/obj-i686/dist/include/mozilla/CountingAllocatorBase.h:150:21: note: forward declaration of template entity is here 24:32.26 static AmountType sAmount; 24:32.26 ^ 24:32.26 /tmp/B.qx2tm3hd/BUILD/firefox-105.0/obj-i686/dist/include/mozilla/CountingAllocatorBase.h:111:5: note: add an explicit instantiation declaration to suppress this warning if 'mozilla::CountingAllocatorBase<HunspellAllocator>::sAmount' is explicitly instantiated in another translation unit 24:32.26 sAmount -= MallocSizeOfOnFree(p); 24:32.26 ^ 24:32.99 gfx/2d 24:33.02 warning: unknown warning option '-Werror=trampolines' [-Wunknown-warning-option] 24:33.20 1 warning generated. 24:45.61 1 warning generated. 24:45.63 gfx/angle/targets/angle_common 24:45.66 warning: unknown warning option '-Werror=trampolines' [-Wunknown-warning-option] 24:45.99 1 warning generated. 24:46.01 gfx/angle/targets/preprocessor 24:54.69 gfx/angle/targets/translator 24:54.88 1 warning generated. 25:09.54 gfx/cairo/cairo/src 25:09.58 warning: unknown warning option '-Werror=trampolines' [-Wunknown-warning-option] 25:09.81 1 warning generated. 25:09.85 warning: unknown warning option '-Werror=trampolines' [-Wunknown-warning-option] 25:10.28 1 warning generated. 25:10.32 warning: unknown warning option '-Werror=trampolines' [-Wunknown-warning-option] 25:10.69 1 warning generated. 25:10.73 warning: unknown warning option '-Werror=trampolines' [-Wunknown-warning-option] 25:11.30 1 warning generated. 25:11.34 warning: unknown warning option '-Werror=trampolines' [-Wunknown-warning-option] 25:11.73 1 warning generated. 25:11.77 warning: unknown warning option '-Werror=trampolines' [-Wunknown-warning-option] 25:13.20 1 warning generated. 25:13.24 warning: unknown warning option '-Werror=trampolines' [-Wunknown-warning-option] 25:13.49 1 warning generated. 25:13.53 warning: unknown warning option '-Werror=trampolines' [-Wunknown-warning-option] 25:13.78 1 warning generated. 25:13.82 warning: unknown warning option '-Werror=trampolines' [-Wunknown-warning-option] 25:14.81 1 warning generated. 25:14.85 warning: unknown warning option '-Werror=trampolines' [-Wunknown-warning-option] 25:15.38 1 warning generated. 25:15.42 warning: unknown warning option '-Werror=trampolines' [-Wunknown-warning-option] 25:15.95 1 warning generated. 25:15.99 warning: unknown warning option '-Werror=trampolines' [-Wunknown-warning-option] 25:16.47 1 warning generated. 25:16.51 warning: unknown warning option '-Werror=trampolines' [-Wunknown-warning-option] 25:16.85 1 warning generated. 25:16.89 warning: unknown warning option '-Werror=trampolines' [-Wunknown-warning-option] 25:17.61 1 warning generated. 25:17.65 warning: unknown warning option '-Werror=trampolines' [-Wunknown-warning-option] 25:18.19 1 warning generated. 25:18.22 warning: unknown warning option '-Werror=trampolines' [-Wunknown-warning-option] 25:18.48 1 warning generated. 25:18.52 warning: unknown warning option '-Werror=trampolines' [-Wunknown-warning-option] 25:18.80 /tmp/B.qx2tm3hd/BUILD/firefox-105.0/gfx/cairo/cairo/src/cairo-pdf-surface.c:2436:9: warning: variable 'status' is used uninitialized whenever 'if' condition is true [-Wsometimes-uninitialized] 25:18.80 if (surface->base.status != CAIRO_STATUS_SUCCESS) 25:18.80 ^~~~~~~~~~~~~~~~~~~~~~~~~~~~~~~~~~~~~~~~~~~~ 25:18.80 /tmp/B.qx2tm3hd/BUILD/firefox-105.0/gfx/cairo/cairo/src/cairo-pdf-surface.c:2504:9: note: uninitialized use occurs here 25:18.80 if (status == CAIRO_STATUS_SUCCESS) 25:18.80 ^~~~~~ 25:18.80 /tmp/B.qx2tm3hd/BUILD/firefox-105.0/gfx/cairo/cairo/src/cairo-pdf-surface.c:2436:5: note: remove the 'if' if its condition is always false 25:18.80 if (surface->base.status != CAIRO_STATUS_SUCCESS) 25:18.80 ^~~~~~~~~~~~~~~~~~~~~~~~~~~~~~~~~~~~~~~~~~~~~~~~~ 25:18.80 /tmp/B.qx2tm3hd/BUILD/firefox-105.0/gfx/cairo/cairo/src/cairo-pdf-surface.c:2428:5: note: variable 'status' is declared here 25:18.80 cairo_status_t status, status2; 25:18.80 ^ 25:20.87 2 warnings generated. 25:20.91 warning: unknown warning option '-Werror=trampolines' [-Wunknown-warning-option] 25:21.52 warning: unknown warning option '-Werror=trampolines' [-Wunknown-warning-option] 25:21.54 1 warning generated. 25:21.57 warning: unknown warning option '-Werror=trampolines' [-Wunknown-warning-option] 25:22.04 1 warning generated. 25:22.07 warning: unknown warning option '-Werror=trampolines' [-Wunknown-warning-option] 25:22.10 1 warning generated. 25:22.14 warning: unknown warning option '-Werror=trampolines' [-Wunknown-warning-option] 25:22.47 1 warning generated. 25:22.56 warning: unknown warning option '-Werror=trampolines' [-Wunknown-warning-option] 25:22.85 1 warning generated. 25:22.88 warning: unknown warning option '-Werror=trampolines' [-Wunknown-warning-option] 25:23.27 1 warning generated. 25:23.31 warning: unknown warning option '-Werror=trampolines' [-Wunknown-warning-option] 25:23.60 1 warning generated. 25:23.63 warning: unknown warning option '-Werror=trampolines' [-Wunknown-warning-option] 25:23.81 1 warning generated. 25:23.84 warning: unknown warning option '-Werror=trampolines' [-Wunknown-warning-option] 25:23.85 1 warning generated. 25:23.89 warning: unknown warning option '-Werror=trampolines' [-Wunknown-warning-option] 25:24.19 1 warning generated. 25:24.23 warning: unknown warning option '-Werror=trampolines' [-Wunknown-warning-option] 25:24.60 1 warning generated. 25:24.64 1 warning generated. 25:24.64 warning: unknown warning option '-Werror=trampolines' [-Wunknown-warning-option] 25:24.68 warning: unknown warning option '-Werror=trampolines' [-Wunknown-warning-option] 25:24.94 1 warning generated. 25:24.98 warning: unknown warning option '-Werror=trampolines' [-Wunknown-warning-option] 25:25.01 1 warning generated. 25:25.05 warning: unknown warning option '-Werror=trampolines' [-Wunknown-warning-option] 25:25.42 1 warning generated. 25:25.47 warning: unknown warning option '-Werror=trampolines' [-Wunknown-warning-option] 25:25.73 1 warning generated. 25:25.77 warning: unknown warning option '-Werror=trampolines' [-Wunknown-warning-option] 25:26.00 1 warning generated. 25:26.04 warning: unknown warning option '-Werror=trampolines' [-Wunknown-warning-option] 25:26.07 1 warning generated. 25:26.12 warning: unknown warning option '-Werror=trampolines' [-Wunknown-warning-option] 25:26.43 1 warning generated. 25:26.47 warning: unknown warning option '-Werror=trampolines' [-Wunknown-warning-option] 25:26.66 gfx/config 25:26.67 1 warning generated. 25:26.71 warning: unknown warning option '-Werror=trampolines' [-Wunknown-warning-option] 25:26.85 1 warning generated. 25:26.89 warning: unknown warning option '-Werror=trampolines' [-Wunknown-warning-option] 25:28.78 1 warning generated. 25:28.88 warning: unknown warning option '-Werror=trampolines' [-Wunknown-warning-option] 25:29.47 1 warning generated. 25:29.56 warning: unknown warning option '-Werror=trampolines' [-Wunknown-warning-option] 25:29.88 gfx/gl 25:30.28 In file included from Unified_c_gfx_cairo_cairo_src3.c:137: 25:30.28 /tmp/B.qx2tm3hd/BUILD/firefox-105.0/gfx/cairo/cairo/src/cairo-shape-mask-compositor.c:119:14: warning: equality comparison with extraneous parentheses [-Wparentheses-equality] 25:30.28 if ((status == CAIRO_INT_STATUS_SUCCESS)) { 25:30.28 ~~~~~~~^~~~~~~~~~~~~~~~~~~~~~~~~~~ 25:30.28 /tmp/B.qx2tm3hd/BUILD/firefox-105.0/gfx/cairo/cairo/src/cairo-shape-mask-compositor.c:119:14: note: remove extraneous parentheses around the comparison to silence this warning 25:30.28 if ((status == CAIRO_INT_STATUS_SUCCESS)) { 25:30.28 ~ ^ ~ 25:30.28 /tmp/B.qx2tm3hd/BUILD/firefox-105.0/gfx/cairo/cairo/src/cairo-shape-mask-compositor.c:119:14: note: use '=' to turn this equality comparison into an assignment 25:30.28 if ((status == CAIRO_INT_STATUS_SUCCESS)) { 25:30.28 ^~ 25:30.28 = 25:30.28 /tmp/B.qx2tm3hd/BUILD/firefox-105.0/gfx/cairo/cairo/src/cairo-shape-mask-compositor.c:213:14: warning: equality comparison with extraneous parentheses [-Wparentheses-equality] 25:30.28 if ((status == CAIRO_INT_STATUS_SUCCESS)) { 25:30.29 ~~~~~~~^~~~~~~~~~~~~~~~~~~~~~~~~~~ 25:30.29 /tmp/B.qx2tm3hd/BUILD/firefox-105.0/gfx/cairo/cairo/src/cairo-shape-mask-compositor.c:213:14: note: remove extraneous parentheses around the comparison to silence this warning 25:30.29 if ((status == CAIRO_INT_STATUS_SUCCESS)) { 25:30.29 ~ ^ ~ 25:30.29 /tmp/B.qx2tm3hd/BUILD/firefox-105.0/gfx/cairo/cairo/src/cairo-shape-mask-compositor.c:213:14: note: use '=' to turn this equality comparison into an assignment 25:30.29 if ((status == CAIRO_INT_STATUS_SUCCESS)) { 25:30.29 ^~ 25:30.29 = 25:30.29 /tmp/B.qx2tm3hd/BUILD/firefox-105.0/gfx/cairo/cairo/src/cairo-shape-mask-compositor.c:306:14: warning: equality comparison with extraneous parentheses [-Wparentheses-equality] 25:30.29 if ((status == CAIRO_INT_STATUS_SUCCESS)) { 25:30.29 ~~~~~~~^~~~~~~~~~~~~~~~~~~~~~~~~~~ 25:30.29 /tmp/B.qx2tm3hd/BUILD/firefox-105.0/gfx/cairo/cairo/src/cairo-shape-mask-compositor.c:306:14: note: remove extraneous parentheses around the comparison to silence this warning 25:30.29 if ((status == CAIRO_INT_STATUS_SUCCESS)) { 25:30.29 ~ ^ ~ 25:30.29 /tmp/B.qx2tm3hd/BUILD/firefox-105.0/gfx/cairo/cairo/src/cairo-shape-mask-compositor.c:306:14: note: use '=' to turn this equality comparison into an assignment 25:30.29 if ((status == CAIRO_INT_STATUS_SUCCESS)) { 25:30.29 ^~ 25:30.29 = 25:31.90 1 warning generated. 25:31.94 warning: unknown warning option '-Werror=trampolines' [-Wunknown-warning-option] 25:34.40 1 warning generated. 25:34.44 warning: unknown warning option '-Werror=trampolines' [-Wunknown-warning-option] 25:34.48 4 warnings generated. 25:34.76 In file included from Unified_c_gfx_cairo_cairo_src5.c:65: 25:34.76 /tmp/B.qx2tm3hd/BUILD/firefox-105.0/gfx/cairo/cairo/src/cairo.c:3305:22: warning: equality comparison with extraneous parentheses [-Wparentheses-equality] 25:34.76 if ((scaled_font == NULL)) { 25:34.76 ~~~~~~~~~~~~^~~~~~~ 25:34.76 /tmp/B.qx2tm3hd/BUILD/firefox-105.0/gfx/cairo/cairo/src/cairo.c:3305:22: note: remove extraneous parentheses around the comparison to silence this warning 25:34.76 if ((scaled_font == NULL)) { 25:34.76 ~ ^ ~ 25:34.76 /tmp/B.qx2tm3hd/BUILD/firefox-105.0/gfx/cairo/cairo/src/cairo.c:3305:22: note: use '=' to turn this equality comparison into an assignment 25:34.76 if ((scaled_font == NULL)) { 25:34.76 ^~ 25:34.76 = 25:35.94 2 warnings generated. 25:35.95 gfx/graphite2/src 25:37.27 In file included from Unified_cpp_gfx_graphite2_src0.cpp:83: 25:37.27 /tmp/B.qx2tm3hd/BUILD/firefox-105.0/gfx/graphite2/src/GlyphCache.cpp:47:40: warning: 'iterator<std::input_iterator_tag, std::pair<unsigned short, unsigned short>>' is deprecated [-Wdeprecated-declarations] 25:37.27 class _glat_iterator : public std::iterator<std::input_iterator_tag, std::pair<sparse::key_type, sparse::mapped_type> > 25:37.27 ^ 25:37.27 /usr/bin/../lib/gcc/i686-pld-linux/12.2.0/../../../../include/c++/12.2.0/bits/stl_iterator_base_types.h:127:12: note: 'iterator<std::input_iterator_tag, std::pair<unsigned short, unsigned short>>' has been explicitly marked deprecated here 25:37.27 struct _GLIBCXX17_DEPRECATED iterator 25:37.27 ^ 25:37.27 /usr/bin/../lib/gcc/i686-pld-linux/12.2.0/../../../../include/c++/12.2.0/i686-pld-linux/bits/c++config.h:119:34: note: expanded from macro '_GLIBCXX17_DEPRECATED' 25:37.27 # define _GLIBCXX17_DEPRECATED [[__deprecated__]] 25:37.27 ^ 25:39.24 gfx/harfbuzz/src 25:40.11 1 warning generated. 25:40.13 gfx/ipc 25:42.62 gfx/layers 26:03.96 gfx/ots/src 26:05.73 In file included from Unified_cpp_gfx_ots_src0.cpp:2: 26:05.73 In file included from /tmp/B.qx2tm3hd/BUILD/firefox-105.0/gfx/ots/RLBoxWOFF2Host.cpp:7: 26:05.73 In file included from /tmp/B.qx2tm3hd/BUILD/firefox-105.0/gfx/ots/RLBoxWOFF2Host.h:27: 26:05.73 In file included from /tmp/B.qx2tm3hd/BUILD/firefox-105.0/obj-i686/dist/include/mozilla/rlbox/rlbox.hpp:15: 26:05.74 /tmp/B.qx2tm3hd/BUILD/firefox-105.0/obj-i686/dist/include/mozilla/rlbox/rlbox_stdlib.hpp:231:29: warning: result of comparison 'size_t' (aka 'unsigned int') <= 4294967295 is always true [-Wtautological-type-limit-compare] 26:05.74 detail::dynamic_check(num <= std::numeric_limits<uint32_t>::max(), 26:05.74 ~~~ ^ ~~~~~~~~~~~~~~~~~~~~~~~~~~~~~~~~~~~~ 26:14.27 1 warning generated. 26:21.12 In file included from Unified_cpp_gfx_ots_src2.cpp:2: 26:21.12 In file included from /tmp/B.qx2tm3hd/BUILD/firefox-105.0/gfx/ots/src/ots.cc:17: 26:21.12 In file included from /tmp/B.qx2tm3hd/BUILD/firefox-105.0/gfx/ots/src/../RLBoxWOFF2Host.h:27: 26:21.12 In file included from /tmp/B.qx2tm3hd/BUILD/firefox-105.0/obj-i686/dist/include/mozilla/rlbox/rlbox.hpp:15: 26:21.12 /tmp/B.qx2tm3hd/BUILD/firefox-105.0/obj-i686/dist/include/mozilla/rlbox/rlbox_stdlib.hpp:231:29: warning: result of comparison 'size_t' (aka 'unsigned int') <= 4294967295 is always true [-Wtautological-type-limit-compare] 26:21.12 detail::dynamic_check(num <= std::numeric_limits<uint32_t>::max(), 26:21.12 ~~~ ^ ~~~~~~~~~~~~~~~~~~~~~~~~~~~~~~~~~~~~ 26:26.41 gfx/skia 26:27.85 1 warning generated. 26:27.86 gfx/src 26:37.28 gfx/thebes 26:50.35 gfx/vr/service/openvr 26:57.15 gfx/vr/service 26:59.42 gfx/vr 27:04.15 In file included from /tmp/B.qx2tm3hd/BUILD/firefox-105.0/gfx/skia/skia/src/core/SkScan_AntiPath.cpp:16: 27:04.15 /tmp/B.qx2tm3hd/BUILD/firefox-105.0/gfx/skia/skia/src/core/SkPathPriv.h:272:17: warning: use of bitwise '|' with boolean operands [-Wbitwise-instead-of-logical] 27:04.15 return (path.fPathRef->fIsRRect | path.fPathRef->fIsOval) || path.isRect(&tmp); 27:04.15 ~^~~~~~~~~~~~~~~~~~~~~~~~~~~~~~~~~~~~~~~~~~~~~~~~~ 27:04.16 || 27:04.16 /tmp/B.qx2tm3hd/BUILD/firefox-105.0/gfx/skia/skia/src/core/SkPathPriv.h:272:17: note: cast one or both operands to int to silence this warning 27:04.67 1 warning generated. 27:12.77 /tmp/B.qx2tm3hd/BUILD/firefox-105.0/gfx/skia/skia/src/core/SkXfermode.cpp:138:12: warning: 'return' will never be executed [-Wunreachable-code-return] 27:12.77 return false; 27:12.77 ^~~~~ 27:12.99 1 warning generated. 27:20.54 gfx/webrender_bindings 27:49.54 In file included from Unified_cpp_gfx_thebes1.cpp:29: 27:49.54 In file included from /tmp/B.qx2tm3hd/BUILD/firefox-105.0/gfx/thebes/gfxGraphiteShaper.cpp:20: 27:49.54 In file included from /tmp/B.qx2tm3hd/BUILD/firefox-105.0/gfx/thebes/ThebesRLBox.h:25: 27:49.54 In file included from /tmp/B.qx2tm3hd/BUILD/firefox-105.0/obj-i686/dist/include/mozilla/rlbox/rlbox.hpp:15: 27:49.54 /tmp/B.qx2tm3hd/BUILD/firefox-105.0/obj-i686/dist/include/mozilla/rlbox/rlbox_stdlib.hpp:231:29: warning: result of comparison 'size_t' (aka 'unsigned int') <= 4294967295 is always true [-Wtautological-type-limit-compare] 27:49.54 detail::dynamic_check(num <= std::numeric_limits<uint32_t>::max(), 27:49.54 ~~~ ^ ~~~~~~~~~~~~~~~~~~~~~~~~~~~~~~~~~~~~ 28:00.37 In file included from Unified_cpp_gfx_thebes0.cpp:92: 28:00.37 In file included from /tmp/B.qx2tm3hd/BUILD/firefox-105.0/gfx/thebes/gfxFont.cpp:51: 28:00.37 In file included from /tmp/B.qx2tm3hd/BUILD/firefox-105.0/gfx/thebes/ThebesRLBox.h:25: 28:00.37 In file included from /tmp/B.qx2tm3hd/BUILD/firefox-105.0/obj-i686/dist/include/mozilla/rlbox/rlbox.hpp:15: 28:00.37 /tmp/B.qx2tm3hd/BUILD/firefox-105.0/obj-i686/dist/include/mozilla/rlbox/rlbox_stdlib.hpp:231:29: warning: result of comparison 'size_t' (aka 'unsigned int') <= 4294967295 is always true [-Wtautological-type-limit-compare] 28:00.37 detail::dynamic_check(num <= std::numeric_limits<uint32_t>::max(), 28:00.37 ~~~ ^ ~~~~~~~~~~~~~~~~~~~~~~~~~~~~~~~~~~~~ 28:02.57 In file included from Unified_cpp_gfx_skia10.cpp:101: 28:02.57 In file included from /tmp/B.qx2tm3hd/BUILD/firefox-105.0/gfx/skia/skia/src/image/SkImage.cpp:34: 28:02.57 In file included from /tmp/B.qx2tm3hd/BUILD/firefox-105.0/gfx/skia/skia/include/gpu/GrBackendSurface.h:13: 28:02.57 In file included from /tmp/B.qx2tm3hd/BUILD/firefox-105.0/gfx/skia/skia/include/gpu/mock/GrMockTypes.h:12: 28:02.57 /tmp/B.qx2tm3hd/BUILD/firefox-105.0/gfx/skia/skia/include/private/GrTypesPriv.h:543:1: warning: non-void function does not return a value in all control paths [-Wreturn-type] 28:02.57 } 28:02.57 ^ 28:02.57 /tmp/B.qx2tm3hd/BUILD/firefox-105.0/gfx/skia/skia/include/private/GrTypesPriv.h:559:1: warning: non-void function does not return a value in all control paths [-Wreturn-type] 28:02.57 } 28:02.57 ^ 28:08.81 2 warnings generated. 28:09.00 gfx/ycbcr 28:10.31 In file included from Unified_cpp_gfx_skia11.cpp:92: 28:10.31 In file included from /tmp/B.qx2tm3hd/BUILD/firefox-105.0/gfx/skia/skia/src/pathops/SkOpBuilder.cpp:11: 28:10.31 /tmp/B.qx2tm3hd/BUILD/firefox-105.0/gfx/skia/skia/src/core/SkPathPriv.h:272:17: warning: use of bitwise '|' with boolean operands [-Wbitwise-instead-of-logical] 28:10.31 return (path.fPathRef->fIsRRect | path.fPathRef->fIsOval) || path.isRect(&tmp); 28:10.31 ~^~~~~~~~~~~~~~~~~~~~~~~~~~~~~~~~~~~~~~~~~~~~~~~~~ 28:10.31 || 28:10.31 /tmp/B.qx2tm3hd/BUILD/firefox-105.0/gfx/skia/skia/src/core/SkPathPriv.h:272:17: note: cast one or both operands to int to silence this warning 28:13.03 hal 28:14.93 1 warning generated. 28:16.22 In file included from Unified_cpp_gfx_skia12.cpp:101: 28:16.22 /tmp/B.qx2tm3hd/BUILD/firefox-105.0/gfx/skia/skia/src/pathops/SkPathOpsTSect.cpp:2048:14: warning: variable 'found' set but not used [-Wunused-but-set-variable] 28:16.23 bool found = false; 28:16.23 ^ 28:19.47 1 warning generated. 28:20.64 1 warning generated. 28:21.62 1 warning generated. 28:21.66 image/build 28:24.26 image/decoders/icon/gtk 28:24.85 In file included from Unified_cpp_gfx_skia14.cpp:2: 28:24.85 /tmp/B.qx2tm3hd/BUILD/firefox-105.0/gfx/skia/skia/src/shaders/SkImageShader.cpp:86:39: warning: implicit conversion from 'const int32_t' (aka 'const int') to 'float' changes value from 2147483647 to 2147483648 [-Wimplicit-const-int-float-conversion] 28:24.85 const SkScalar max_fixed32dot32 = SK_MaxS32 * 0.25f; 28:24.85 ^~~~~~~~~ ~ 28:28.00 image/decoders/icon 28:31.98 image/decoders 28:32.02 warning: unknown warning option '-Werror=trampolines' [-Wunknown-warning-option] 28:32.11 1 warning generated. 28:33.05 1 warning generated. 28:36.42 /tmp/B.qx2tm3hd/BUILD/firefox-105.0/image/decoders/icon/gtk/nsIconChannel.cpp:136:5: warning: 'gtk_widget_ensure_style' is deprecated [-Wdeprecated-declarations] 28:36.42 gtk_widget_ensure_style(gStockImageWidget); 28:36.42 ^ 28:36.42 /usr/include/gtk-3.0/gtk/deprecated/gtkstyle.h:739:1: note: 'gtk_widget_ensure_style' has been explicitly marked deprecated here 28:36.42 GDK_DEPRECATED_IN_3_0 28:36.42 ^ 28:36.42 /usr/include/gtk-3.0/gdk/gdkversionmacros.h:258:47: note: expanded from macro 'GDK_DEPRECATED_IN_3_0' 28:36.42 # define GDK_DEPRECATED_IN_3_0 GDK_DEPRECATED 28:36.42 ^ 28:36.42 /usr/include/gtk-3.0/gdk/gdkversionmacros.h:48:24: note: expanded from macro 'GDK_DEPRECATED' 28:36.42 #define GDK_DEPRECATED G_DEPRECATED _GDK_EXTERN 28:36.42 ^ 28:36.42 /usr/include/glib-2.0/glib/gmacros.h:1103:37: note: expanded from macro 'G_DEPRECATED' 28:36.42 #define G_DEPRECATED __attribute__((__deprecated__)) 28:36.42 ^ 28:36.42 /tmp/B.qx2tm3hd/BUILD/firefox-105.0/image/decoders/icon/gtk/nsIconChannel.cpp:279:3: warning: 'gtk_icon_info_free' is deprecated: Use 'g_object_unref' instead [-Wdeprecated-declarations] 28:36.42 gtk_icon_info_free(iconInfo); 28:36.42 ^ 28:36.42 /usr/include/gtk-3.0/gtk/gtkicontheme.h:283:1: note: 'gtk_icon_info_free' has been explicitly marked deprecated here 28:36.43 GDK_DEPRECATED_IN_3_8_FOR(g_object_unref) 28:36.43 ^ 28:36.43 /usr/include/gtk-3.0/gdk/gdkversionmacros.h:315:47: note: expanded from macro 'GDK_DEPRECATED_IN_3_8_FOR' 28:36.43 # define GDK_DEPRECATED_IN_3_8_FOR(f) GDK_DEPRECATED_FOR(f) 28:36.43 ^ 28:36.43 /usr/include/gtk-3.0/gdk/gdkversionmacros.h:49:31: note: expanded from macro 'GDK_DEPRECATED_FOR' 28:36.43 #define GDK_DEPRECATED_FOR(f) G_DEPRECATED_FOR(f) _GDK_EXTERN 28:36.43 ^ 28:36.43 /usr/include/glib-2.0/glib/gmacros.h:1113:44: note: expanded from macro 'G_DEPRECATED_FOR' 28:36.43 #define G_DEPRECATED_FOR(f) __attribute__((__deprecated__("Use '" #f "' instead"))) 28:36.43 ^ 28:36.44 /tmp/B.qx2tm3hd/BUILD/firefox-105.0/image/decoders/icon/gtk/nsIconChannel.cpp:356:9: warning: 'gtk_icon_info_free' is deprecated: Use 'g_object_unref' instead [-Wdeprecated-declarations] 28:36.44 gtk_icon_info_free(icon); 28:36.44 ^ 28:36.44 /usr/include/gtk-3.0/gtk/gtkicontheme.h:283:1: note: 'gtk_icon_info_free' has been explicitly marked deprecated here 28:36.44 GDK_DEPRECATED_IN_3_8_FOR(g_object_unref) 28:36.44 ^ 28:36.44 /usr/include/gtk-3.0/gdk/gdkversionmacros.h:315:47: note: expanded from macro 'GDK_DEPRECATED_IN_3_8_FOR' 28:36.44 # define GDK_DEPRECATED_IN_3_8_FOR(f) GDK_DEPRECATED_FOR(f) 28:36.44 ^ 28:36.44 /usr/include/gtk-3.0/gdk/gdkversionmacros.h:49:31: note: expanded from macro 'GDK_DEPRECATED_FOR' 28:36.44 #define GDK_DEPRECATED_FOR(f) G_DEPRECATED_FOR(f) _GDK_EXTERN 28:36.44 ^ 28:36.44 /usr/include/glib-2.0/glib/gmacros.h:1113:44: note: expanded from macro 'G_DEPRECATED_FOR' 28:36.44 #define G_DEPRECATED_FOR(f) __attribute__((__deprecated__("Use '" #f "' instead"))) 28:36.44 ^ 28:36.44 /tmp/B.qx2tm3hd/BUILD/firefox-105.0/image/decoders/icon/gtk/nsIconChannel.cpp:362:21: warning: 'gtk_widget_get_style' is deprecated: Use 'gtk_widget_get_style_context' instead [-Wdeprecated-declarations] 28:36.44 GtkStyle* style = gtk_widget_get_style(gStockImageWidget); 28:36.44 ^ 28:36.44 /usr/include/gtk-3.0/gtk/deprecated/gtkstyle.h:741:1: note: 'gtk_widget_get_style' has been explicitly marked deprecated here 28:36.44 GDK_DEPRECATED_IN_3_0_FOR(gtk_widget_get_style_context) 28:36.44 ^ 28:36.44 /usr/include/gtk-3.0/gdk/gdkversionmacros.h:259:47: note: expanded from macro 'GDK_DEPRECATED_IN_3_0_FOR' 28:36.44 # define GDK_DEPRECATED_IN_3_0_FOR(f) GDK_DEPRECATED_FOR(f) 28:36.44 ^ 28:36.44 /usr/include/gtk-3.0/gdk/gdkversionmacros.h:49:31: note: expanded from macro 'GDK_DEPRECATED_FOR' 28:36.44 #define GDK_DEPRECATED_FOR(f) G_DEPRECATED_FOR(f) _GDK_EXTERN 28:36.44 ^ 28:36.44 /usr/include/glib-2.0/glib/gmacros.h:1113:44: note: expanded from macro 'G_DEPRECATED_FOR' 28:36.44 #define G_DEPRECATED_FOR(f) __attribute__((__deprecated__("Use '" #f "' instead"))) 28:36.44 ^ 28:36.44 /tmp/B.qx2tm3hd/BUILD/firefox-105.0/image/decoders/icon/gtk/nsIconChannel.cpp:365:16: warning: 'gtk_style_lookup_icon_set' is deprecated: Use 'GtkStyleContext and a style class' instead [-Wdeprecated-declarations] 28:36.44 icon_set = gtk_style_lookup_icon_set(style, stockID.get()); 28:36.44 ^ 28:36.44 /usr/include/gtk-3.0/gtk/deprecated/gtkstyle.h:464:1: note: 'gtk_style_lookup_icon_set' has been explicitly marked deprecated here 28:36.44 GDK_DEPRECATED_IN_3_0_FOR(GtkStyleContext and a style class) 28:36.44 ^ 28:36.44 /usr/include/gtk-3.0/gdk/gdkversionmacros.h:259:47: note: expanded from macro 'GDK_DEPRECATED_IN_3_0_FOR' 28:36.44 # define GDK_DEPRECATED_IN_3_0_FOR(f) GDK_DEPRECATED_FOR(f) 28:36.44 ^ 28:36.44 /usr/include/gtk-3.0/gdk/gdkversionmacros.h:49:31: note: expanded from macro 'GDK_DEPRECATED_FOR' 28:36.44 #define GDK_DEPRECATED_FOR(f) G_DEPRECATED_FOR(f) _GDK_EXTERN 28:36.44 ^ 28:36.44 /usr/include/glib-2.0/glib/gmacros.h:1113:44: note: expanded from macro 'G_DEPRECATED_FOR' 28:36.44 #define G_DEPRECATED_FOR(f) __attribute__((__deprecated__("Use '" #f "' instead"))) 28:36.44 ^ 28:36.44 /tmp/B.qx2tm3hd/BUILD/firefox-105.0/image/decoders/icon/gtk/nsIconChannel.cpp:375:16: warning: 'gtk_icon_set_new' is deprecated [-Wdeprecated-declarations] 28:36.44 icon_set = gtk_icon_set_new(); 28:36.44 ^ 28:36.44 /usr/include/gtk-3.0/gtk/deprecated/gtkiconfactory.h:137:1: note: 'gtk_icon_set_new' has been explicitly marked deprecated here 28:36.44 GDK_DEPRECATED_IN_3_10 28:36.44 ^ 28:36.44 /usr/include/gtk-3.0/gdk/gdkversionmacros.h:328:47: note: expanded from macro 'GDK_DEPRECATED_IN_3_10' 28:36.44 # define GDK_DEPRECATED_IN_3_10 GDK_DEPRECATED 28:36.44 ^ 28:36.44 /usr/include/gtk-3.0/gdk/gdkversionmacros.h:48:24: note: expanded from macro 'GDK_DEPRECATED' 28:36.44 #define GDK_DEPRECATED G_DEPRECATED _GDK_EXTERN 28:36.44 ^ 28:36.44 /usr/include/glib-2.0/glib/gmacros.h:1103:37: note: expanded from macro 'G_DEPRECATED' 28:36.44 #define G_DEPRECATED __attribute__((__deprecated__)) 28:36.44 ^ 28:36.45 /tmp/B.qx2tm3hd/BUILD/firefox-105.0/image/decoders/icon/gtk/nsIconChannel.cpp:376:34: warning: 'gtk_icon_source_new' is deprecated [-Wdeprecated-declarations] 28:36.45 GtkIconSource* icon_source = gtk_icon_source_new(); 28:36.45 ^ 28:36.45 /usr/include/gtk-3.0/gtk/deprecated/gtkiconfactory.h:169:1: note: 'gtk_icon_source_new' has been explicitly marked deprecated here 28:36.45 GDK_DEPRECATED_IN_3_10 28:36.45 ^ 28:36.45 /usr/include/gtk-3.0/gdk/gdkversionmacros.h:328:47: note: expanded from macro 'GDK_DEPRECATED_IN_3_10' 28:36.45 # define GDK_DEPRECATED_IN_3_10 GDK_DEPRECATED 28:36.45 ^ 28:36.45 /usr/include/gtk-3.0/gdk/gdkversionmacros.h:48:24: note: expanded from macro 'GDK_DEPRECATED' 28:36.45 #define GDK_DEPRECATED G_DEPRECATED _GDK_EXTERN 28:36.45 ^ 28:36.45 /usr/include/glib-2.0/glib/gmacros.h:1103:37: note: expanded from macro 'G_DEPRECATED' 28:36.45 #define G_DEPRECATED __attribute__((__deprecated__)) 28:36.45 ^ 28:36.45 /tmp/B.qx2tm3hd/BUILD/firefox-105.0/image/decoders/icon/gtk/nsIconChannel.cpp:378:5: warning: 'gtk_icon_source_set_icon_name' is deprecated [-Wdeprecated-declarations] 28:36.45 gtk_icon_source_set_icon_name(icon_source, stockIcon.get()); 28:36.45 ^ 28:36.45 /usr/include/gtk-3.0/gtk/deprecated/gtkiconfactory.h:179:1: note: 'gtk_icon_source_set_icon_name' has been explicitly marked deprecated here 28:36.45 GDK_DEPRECATED_IN_3_10 28:36.45 ^ 28:36.45 /usr/include/gtk-3.0/gdk/gdkversionmacros.h:328:47: note: expanded from macro 'GDK_DEPRECATED_IN_3_10' 28:36.45 # define GDK_DEPRECATED_IN_3_10 GDK_DEPRECATED 28:36.45 ^ 28:36.45 /usr/include/gtk-3.0/gdk/gdkversionmacros.h:48:24: note: expanded from macro 'GDK_DEPRECATED' 28:36.45 #define GDK_DEPRECATED G_DEPRECATED _GDK_EXTERN 28:36.45 ^ 28:36.45 /usr/include/glib-2.0/glib/gmacros.h:1103:37: note: expanded from macro 'G_DEPRECATED' 28:36.45 #define G_DEPRECATED __attribute__((__deprecated__)) 28:36.45 ^ 28:36.45 /tmp/B.qx2tm3hd/BUILD/firefox-105.0/image/decoders/icon/gtk/nsIconChannel.cpp:379:5: warning: 'gtk_icon_set_add_source' is deprecated [-Wdeprecated-declarations] 28:36.45 gtk_icon_set_add_source(icon_set, icon_source); 28:36.45 ^ 28:36.45 /usr/include/gtk-3.0/gtk/deprecated/gtkiconfactory.h:158:1: note: 'gtk_icon_set_add_source' has been explicitly marked deprecated here 28:36.45 GDK_DEPRECATED_IN_3_10 28:36.45 ^ 28:36.45 /usr/include/gtk-3.0/gdk/gdkversionmacros.h:328:47: note: expanded from macro 'GDK_DEPRECATED_IN_3_10' 28:36.45 # define GDK_DEPRECATED_IN_3_10 GDK_DEPRECATED 28:36.45 ^ 28:36.45 /usr/include/gtk-3.0/gdk/gdkversionmacros.h:48:24: note: expanded from macro 'GDK_DEPRECATED' 28:36.45 #define GDK_DEPRECATED G_DEPRECATED _GDK_EXTERN 28:36.45 ^ 28:36.46 /usr/include/glib-2.0/glib/gmacros.h:1103:37: note: expanded from macro 'G_DEPRECATED' 28:36.46 #define G_DEPRECATED __attribute__((__deprecated__)) 28:36.46 ^ 28:36.46 /tmp/B.qx2tm3hd/BUILD/firefox-105.0/image/decoders/icon/gtk/nsIconChannel.cpp:380:5: warning: 'gtk_icon_source_free' is deprecated [-Wdeprecated-declarations] 28:36.46 gtk_icon_source_free(icon_source); 28:36.46 ^ 28:36.46 /usr/include/gtk-3.0/gtk/deprecated/gtkiconfactory.h:173:1: note: 'gtk_icon_source_free' has been explicitly marked deprecated here 28:36.46 GDK_DEPRECATED_IN_3_10 28:36.46 ^ 28:36.46 /usr/include/gtk-3.0/gdk/gdkversionmacros.h:328:47: note: expanded from macro 'GDK_DEPRECATED_IN_3_10' 28:36.46 # define GDK_DEPRECATED_IN_3_10 GDK_DEPRECATED 28:36.46 ^ 28:36.46 /usr/include/gtk-3.0/gdk/gdkversionmacros.h:48:24: note: expanded from macro 'GDK_DEPRECATED' 28:36.46 #define GDK_DEPRECATED G_DEPRECATED _GDK_EXTERN 28:36.46 ^ 28:36.46 /usr/include/glib-2.0/glib/gmacros.h:1103:37: note: expanded from macro 'G_DEPRECATED' 28:36.46 #define G_DEPRECATED __attribute__((__deprecated__)) 28:36.46 ^ 28:36.46 /tmp/B.qx2tm3hd/BUILD/firefox-105.0/image/decoders/icon/gtk/nsIconChannel.cpp:383:21: warning: 'gtk_icon_set_render_icon' is deprecated: Use 'gtk_icon_set_render_icon_pixbuf' instead [-Wdeprecated-declarations] 28:36.46 GdkPixbuf* icon = gtk_icon_set_render_icon( 28:36.46 ^ 28:36.46 /usr/include/gtk-3.0/gtk/deprecated/gtkiconfactory.h:149:1: note: 'gtk_icon_set_render_icon' has been explicitly marked deprecated here 28:36.46 GDK_DEPRECATED_IN_3_0_FOR(gtk_icon_set_render_icon_pixbuf) 28:36.46 ^ 28:36.46 /usr/include/gtk-3.0/gdk/gdkversionmacros.h:259:47: note: expanded from macro 'GDK_DEPRECATED_IN_3_0_FOR' 28:36.46 # define GDK_DEPRECATED_IN_3_0_FOR(f) GDK_DEPRECATED_FOR(f) 28:36.46 ^ 28:36.46 /usr/include/gtk-3.0/gdk/gdkversionmacros.h:49:31: note: expanded from macro 'GDK_DEPRECATED_FOR' 28:36.46 #define GDK_DEPRECATED_FOR(f) G_DEPRECATED_FOR(f) _GDK_EXTERN 28:36.46 ^ 28:36.46 /usr/include/glib-2.0/glib/gmacros.h:1113:44: note: expanded from macro 'G_DEPRECATED_FOR' 28:36.46 #define G_DEPRECATED_FOR(f) __attribute__((__deprecated__("Use '" #f "' instead"))) 28:36.46 ^ 28:36.46 /tmp/B.qx2tm3hd/BUILD/firefox-105.0/image/decoders/icon/gtk/nsIconChannel.cpp:386:5: warning: 'gtk_icon_set_unref' is deprecated [-Wdeprecated-declarations] 28:36.46 gtk_icon_set_unref(icon_set); 28:36.46 ^ 28:36.46 /usr/include/gtk-3.0/gtk/deprecated/gtkiconfactory.h:144:1: note: 'gtk_icon_set_unref' has been explicitly marked deprecated here 28:36.46 GDK_DEPRECATED_IN_3_10 28:36.46 ^ 28:36.46 /usr/include/gtk-3.0/gdk/gdkversionmacros.h:328:47: note: expanded from macro 'GDK_DEPRECATED_IN_3_10' 28:36.46 # define GDK_DEPRECATED_IN_3_10 GDK_DEPRECATED 28:36.46 ^ 28:36.46 /usr/include/gtk-3.0/gdk/gdkversionmacros.h:48:24: note: expanded from macro 'GDK_DEPRECATED' 28:36.46 #define GDK_DEPRECATED G_DEPRECATED _GDK_EXTERN 28:36.46 ^ 28:36.46 /usr/include/glib-2.0/glib/gmacros.h:1103:37: note: expanded from macro 'G_DEPRECATED' 28:36.46 #define G_DEPRECATED __attribute__((__deprecated__)) 28:36.46 ^ 28:39.39 12 warnings generated. 28:39.43 image/encoders/bmp 28:41.62 image/encoders/ico 28:43.68 image/encoders/jpeg 28:45.74 image/encoders/png 28:51.29 image/encoders/webp 28:53.52 image 28:53.92 intl/components 28:54.57 In file included from Unified_cpp_gfx_skia16.cpp:47: 28:54.57 In file included from /tmp/B.qx2tm3hd/BUILD/firefox-105.0/gfx/skia/skia/src/utils/SkShadowUtils.cpp:21: 28:54.57 /tmp/B.qx2tm3hd/BUILD/firefox-105.0/gfx/skia/skia/src/core/SkPathPriv.h:272:17: warning: use of bitwise '|' with boolean operands [-Wbitwise-instead-of-logical] 28:54.57 return (path.fPathRef->fIsRRect | path.fPathRef->fIsOval) || path.isRect(&tmp); 28:54.58 ~^~~~~~~~~~~~~~~~~~~~~~~~~~~~~~~~~~~~~~~~~~~~~~~~~ 28:54.58 || 28:54.58 /tmp/B.qx2tm3hd/BUILD/firefox-105.0/gfx/skia/skia/src/core/SkPathPriv.h:272:17: note: cast one or both operands to int to silence this warning 28:56.23 intl/hyphenation/glue 28:56.91 1 warning generated. 28:57.96 intl/l10n 28:58.99 In file included from Unified_cpp_gfx_skia2.cpp:65: 28:58.99 In file included from /tmp/B.qx2tm3hd/BUILD/firefox-105.0/gfx/skia/skia/src/core/SkDevice.cpp:25: 28:58.99 /tmp/B.qx2tm3hd/BUILD/firefox-105.0/gfx/skia/skia/src/core/SkPathPriv.h:272:17: warning: use of bitwise '|' with boolean operands [-Wbitwise-instead-of-logical] 28:58.99 return (path.fPathRef->fIsRRect | path.fPathRef->fIsOval) || path.isRect(&tmp); 28:58.99 ~^~~~~~~~~~~~~~~~~~~~~~~~~~~~~~~~~~~~~~~~~~~~~~~~~ 28:58.99 || 28:58.99 /tmp/B.qx2tm3hd/BUILD/firefox-105.0/gfx/skia/skia/src/core/SkPathPriv.h:272:17: note: cast one or both operands to int to silence this warning 29:01.74 1 warning generated. 29:02.92 In file included from Unified_cpp_gfx_skia3.cpp:20: 29:02.92 In file included from /tmp/B.qx2tm3hd/BUILD/firefox-105.0/gfx/skia/skia/src/core/SkEdgeBuilder.cpp:16: 29:02.92 /tmp/B.qx2tm3hd/BUILD/firefox-105.0/gfx/skia/skia/src/core/SkPathPriv.h:272:17: warning: use of bitwise '|' with boolean operands [-Wbitwise-instead-of-logical] 29:02.92 return (path.fPathRef->fIsRRect | path.fPathRef->fIsOval) || path.isRect(&tmp); 29:02.93 ~^~~~~~~~~~~~~~~~~~~~~~~~~~~~~~~~~~~~~~~~~~~~~~~~~ 29:02.93 || 29:02.93 /tmp/B.qx2tm3hd/BUILD/firefox-105.0/gfx/skia/skia/src/core/SkPathPriv.h:272:17: note: cast one or both operands to int to silence this warning 29:04.07 In file included from Unified_cpp_gfx_skia3.cpp:56: 29:04.07 /tmp/B.qx2tm3hd/BUILD/firefox-105.0/gfx/skia/skia/src/core/SkFont.cpp:180:17: warning: variable 'uni' is used uninitialized whenever 'if' condition is false [-Wsometimes-uninitialized] 29:04.07 SK_ABORT("unexpected enum"); 29:04.07 ^~~~~~~~~~~~~~~~~~~~~~~~~~~ 29:04.07 /tmp/B.qx2tm3hd/BUILD/firefox-105.0/gfx/skia/skia/include/core/SkPostConfig.h:131:14: note: expanded from macro 'SK_ABORT' 29:04.07 do { if (sk_abort_is_enabled()) { \ 29:04.07 ^~~~~~~~~~~~~~~~~~~~~ 29:04.07 /tmp/B.qx2tm3hd/BUILD/firefox-105.0/gfx/skia/skia/src/core/SkFont.cpp:182:16: note: uninitialized use occurs here 29:04.07 return uni; 29:04.07 ^~~ 29:04.07 /tmp/B.qx2tm3hd/BUILD/firefox-105.0/gfx/skia/skia/src/core/SkFont.cpp:180:17: note: remove the 'if' if its condition is always true 29:04.07 SK_ABORT("unexpected enum"); 29:04.07 ^ 29:04.07 /tmp/B.qx2tm3hd/BUILD/firefox-105.0/gfx/skia/skia/include/core/SkPostConfig.h:131:10: note: expanded from macro 'SK_ABORT' 29:04.07 do { if (sk_abort_is_enabled()) { \ 29:04.07 ^ 29:04.07 /tmp/B.qx2tm3hd/BUILD/firefox-105.0/gfx/skia/skia/src/core/SkFont.cpp:158:29: note: initialize the variable 'uni' to silence this warning 29:04.07 const SkUnichar* uni; 29:04.07 ^ 29:04.07 = nullptr 29:07.86 2 warnings generated. 29:11.15 intl/locale/gtk 29:13.44 intl/locale 29:14.49 intl/lwbrk 29:15.13 In file included from Unified_cpp_gfx_skia5.cpp:29: 29:15.13 In file included from /tmp/B.qx2tm3hd/BUILD/firefox-105.0/gfx/skia/skia/src/core/SkMaskFilter.cpp:18: 29:15.13 /tmp/B.qx2tm3hd/BUILD/firefox-105.0/gfx/skia/skia/src/core/SkPathPriv.h:272:17: warning: use of bitwise '|' with boolean operands [-Wbitwise-instead-of-logical] 29:15.13 return (path.fPathRef->fIsRRect | path.fPathRef->fIsOval) || path.isRect(&tmp); 29:15.13 ~^~~~~~~~~~~~~~~~~~~~~~~~~~~~~~~~~~~~~~~~~~~~~~~~~ 29:15.14 || 29:15.14 /tmp/B.qx2tm3hd/BUILD/firefox-105.0/gfx/skia/skia/src/core/SkPathPriv.h:272:17: note: cast one or both operands to int to silence this warning 29:15.62 In file included from Unified_cpp_gfx_skia5.cpp:119: 29:15.62 /tmp/B.qx2tm3hd/BUILD/firefox-105.0/gfx/skia/skia/src/core/SkPathEffect.cpp:162:16: warning: use of bitwise '|' with boolean operands [-Wbitwise-instead-of-logical] 29:15.62 return fPE0->filterPath(dst, src, rec, cullRect) | 29:15.62 ^~~~~~~~~~~~~~~~~~~~~~~~~~~~~~~~~~~~~~~~~~~ 29:15.62 || 29:15.62 /tmp/B.qx2tm3hd/BUILD/firefox-105.0/gfx/skia/skia/src/core/SkPathEffect.cpp:162:16: note: cast one or both operands to int to silence this warning 29:15.89 intl/strres 29:20.82 intl/uconv 29:21.87 intl/unicharutil/util 29:21.91 2 warnings generated. 29:22.74 In file included from Unified_cpp_gfx_skia6.cpp:2: 29:22.74 In file included from /tmp/B.qx2tm3hd/BUILD/firefox-105.0/gfx/skia/skia/src/core/SkPath_serial.cpp:13: 29:22.74 /tmp/B.qx2tm3hd/BUILD/firefox-105.0/gfx/skia/skia/src/core/SkPathPriv.h:272:17: warning: use of bitwise '|' with boolean operands [-Wbitwise-instead-of-logical] 29:22.74 return (path.fPathRef->fIsRRect | path.fPathRef->fIsOval) || path.isRect(&tmp); 29:22.74 ~^~~~~~~~~~~~~~~~~~~~~~~~~~~~~~~~~~~~~~~~~~~~~~~~~ 29:22.74 || 29:22.74 /tmp/B.qx2tm3hd/BUILD/firefox-105.0/gfx/skia/skia/src/core/SkPathPriv.h:272:17: note: cast one or both operands to int to silence this warning 29:23.73 ipc/app 29:24.53 In file included from Unified_cpp_gfx_skia6.cpp:101: 29:24.53 In file included from /tmp/B.qx2tm3hd/BUILD/firefox-105.0/gfx/skia/skia/src/core/SkPromiseImageTexture.cpp:8: 29:24.53 In file included from /tmp/B.qx2tm3hd/BUILD/firefox-105.0/gfx/skia/skia/include/core/SkPromiseImageTexture.h:12: 29:24.53 In file included from /tmp/B.qx2tm3hd/BUILD/firefox-105.0/gfx/skia/skia/include/gpu/GrBackendSurface.h:13: 29:24.53 In file included from /tmp/B.qx2tm3hd/BUILD/firefox-105.0/gfx/skia/skia/include/gpu/mock/GrMockTypes.h:12: 29:24.53 /tmp/B.qx2tm3hd/BUILD/firefox-105.0/gfx/skia/skia/include/private/GrTypesPriv.h:543:1: warning: non-void function does not return a value in all control paths [-Wreturn-type] 29:24.53 } 29:24.53 ^ 29:24.53 /tmp/B.qx2tm3hd/BUILD/firefox-105.0/gfx/skia/skia/include/private/GrTypesPriv.h:559:1: warning: non-void function does not return a value in all control paths [-Wreturn-type] 29:24.53 } 29:24.53 ^ 29:25.00 toolkit/library/build/symverscript.stub 29:25.22 media/libsoundtouch/src 29:26.22 In file included from Unified_cpp_libsoundtouch_src0.cpp:20: 29:26.22 /tmp/B.qx2tm3hd/BUILD/firefox-105.0/media/libsoundtouch/src/FIRFilter.cpp:81:12: warning: unused variable 'dScaler' [-Wunused-variable] 29:26.22 double dScaler = 1.0 / (double)resultDivider; 29:26.22 ^ 29:26.22 /tmp/B.qx2tm3hd/BUILD/firefox-105.0/media/libsoundtouch/src/FIRFilter.cpp:127:12: warning: unused variable 'dScaler' [-Wunused-variable] 29:26.22 double dScaler = 1.0 / (double)resultDivider; 29:26.22 ^ 29:26.22 /tmp/B.qx2tm3hd/BUILD/firefox-105.0/media/libsoundtouch/src/FIRFilter.cpp:166:12: warning: unused variable 'dScaler' [-Wunused-variable] 29:26.22 double dScaler = 1.0 / (double)resultDivider; 29:26.22 ^ 29:26.24 In file included from Unified_cpp_libsoundtouch_src0.cpp:47: 29:26.24 /tmp/B.qx2tm3hd/BUILD/firefox-105.0/media/libsoundtouch/src/InterpolateShannon.cpp:71:9: warning: 'PI' macro redefined [-Wmacro-redefined] 29:26.24 #define PI 3.1415926536 29:26.24 ^ 29:26.24 /tmp/B.qx2tm3hd/BUILD/firefox-105.0/media/libsoundtouch/src/AAFilter.cpp:45:9: note: previous definition is here 29:26.24 #define PI M_PI 29:26.24 ^ 29:26.25 In file included from Unified_cpp_libsoundtouch_src0.cpp:56: 29:26.25 /tmp/B.qx2tm3hd/BUILD/firefox-105.0/media/libsoundtouch/src/RateTransposer.cpp:134:10: warning: variable 'count' set but not used [-Wunused-but-set-variable] 29:26.25 uint count; 29:26.25 ^ 29:26.29 In file included from Unified_cpp_libsoundtouch_src0.cpp:92: 29:26.29 /tmp/B.qx2tm3hd/BUILD/firefox-105.0/media/libsoundtouch/src/cpu_detect_x86.cpp:48:12: warning: 'bit_MMX' macro redefined [-Wmacro-redefined] 29:26.29 #define bit_MMX (1 << 23) 29:26.29 ^ 29:26.29 /usr/lib/clang/14.0.6/include/cpuid.h:133:9: note: previous definition is here 29:26.29 #define bit_MMX 0x00800000 29:26.30 ^ 29:26.30 In file included from Unified_cpp_libsoundtouch_src0.cpp:92: 29:26.30 /tmp/B.qx2tm3hd/BUILD/firefox-105.0/media/libsoundtouch/src/cpu_detect_x86.cpp:49:12: warning: 'bit_SSE' macro redefined [-Wmacro-redefined] 29:26.30 #define bit_SSE (1 << 25) 29:26.30 ^ 29:26.30 /usr/lib/clang/14.0.6/include/cpuid.h:136:9: note: previous definition is here 29:26.30 #define bit_SSE 0x02000000 29:26.30 ^ 29:26.30 In file included from Unified_cpp_libsoundtouch_src0.cpp:92: 29:26.30 /tmp/B.qx2tm3hd/BUILD/firefox-105.0/media/libsoundtouch/src/cpu_detect_x86.cpp:50:12: warning: 'bit_SSE2' macro redefined [-Wmacro-redefined] 29:26.30 #define bit_SSE2 (1 << 26) 29:26.30 ^ 29:26.30 /usr/lib/clang/14.0.6/include/cpuid.h:137:9: note: previous definition is here 29:26.30 #define bit_SSE2 0x04000000 29:26.30 ^ 29:27.05 8 warnings generated. 29:27.06 config/external/sqlite/libmozsqlite3.so.symbols.stub 29:27.30 third_party/sqlite3/src 29:27.33 warning: unknown warning option '-Werror=trampolines' [-Wunknown-warning-option] 29:28.25 /tmp/B.qx2tm3hd/BUILD/firefox-105.0/third_party/sqlite3/src/sqlite3.c:83786:3: warning: 'return' will never be executed [-Wunreachable-code-return] 29:28.25 return; 29:28.25 ^~~~~~ 29:28.25 3 warnings generated. 29:29.29 /tmp/B.qx2tm3hd/BUILD/firefox-105.0/third_party/sqlite3/src/sqlite3.c:164962:9: warning: code will never be executed [-Wunreachable-code] 29:29.29 YYMINORTYPE yylhsminor; 29:29.29 ^~~~~~~~~~~~~~~~~~~~~~~ 29:30.14 ipc/chromium 29:30.23 In file included from Unified_cpp_gfx_skia7.cpp:74: 29:30.23 In file included from /tmp/B.qx2tm3hd/BUILD/firefox-105.0/gfx/skia/skia/src/core/SkRecords.cpp:8: 29:30.23 /tmp/B.qx2tm3hd/BUILD/firefox-105.0/gfx/skia/skia/src/core/SkPathPriv.h:272:17: warning: use of bitwise '|' with boolean operands [-Wbitwise-instead-of-logical] 29:30.23 return (path.fPathRef->fIsRRect | path.fPathRef->fIsOval) || path.isRect(&tmp); 29:30.23 ~^~~~~~~~~~~~~~~~~~~~~~~~~~~~~~~~~~~~~~~~~~~~~~~~~ 29:30.23 || 29:30.23 /tmp/B.qx2tm3hd/BUILD/firefox-105.0/gfx/skia/skia/src/core/SkPathPriv.h:272:17: note: cast one or both operands to int to silence this warning 29:30.77 ipc/glue 29:30.90 In file included from Unified_cpp_gfx_skia7.cpp:110: 29:30.90 In file included from /tmp/B.qx2tm3hd/BUILD/firefox-105.0/gfx/skia/skia/src/core/SkRemoteGlyphCache.cpp:23: 29:30.90 /tmp/B.qx2tm3hd/BUILD/firefox-105.0/gfx/skia/skia/src/core/SkTypeface_remote.h:66:75: warning: non-void function does not return a value in all control paths [-Wreturn-type] 29:30.90 int onGetUPEM() const override { SK_ABORT("Should never be called."); } 29:30.90 ^ 29:30.90 /tmp/B.qx2tm3hd/BUILD/firefox-105.0/gfx/skia/skia/src/core/SkTypeface_remote.h:69:5: warning: non-void function does not return a value in all control paths [-Wreturn-type] 29:30.90 } 29:30.90 ^ 29:30.90 /tmp/B.qx2tm3hd/BUILD/firefox-105.0/gfx/skia/skia/src/core/SkTypeface_remote.h:72:5: warning: non-void function does not return a value in all control paths [-Wreturn-type] 29:30.90 } 29:30.90 ^ 29:30.90 /tmp/B.qx2tm3hd/BUILD/firefox-105.0/gfx/skia/skia/src/core/SkTypeface_remote.h:75:5: warning: non-void function does not return a value in all control paths [-Wreturn-type] 29:30.90 } 29:30.90 ^ 29:30.90 /tmp/B.qx2tm3hd/BUILD/firefox-105.0/gfx/skia/skia/src/core/SkTypeface_remote.h:79:5: warning: non-void function does not return a value in all control paths [-Wreturn-type] 29:30.90 } 29:30.90 ^ 29:30.90 /tmp/B.qx2tm3hd/BUILD/firefox-105.0/gfx/skia/skia/src/core/SkTypeface_remote.h:83:5: warning: non-void function does not return a value in all control paths [-Wreturn-type] 29:30.90 } 29:30.90 ^ 29:30.90 /tmp/B.qx2tm3hd/BUILD/firefox-105.0/gfx/skia/skia/src/core/SkTypeface_remote.h:90:5: warning: non-void function does not return a value in all control paths [-Wreturn-type] 29:30.90 } 29:30.90 ^ 29:30.90 /tmp/B.qx2tm3hd/BUILD/firefox-105.0/gfx/skia/skia/src/core/SkTypeface_remote.h:93:5: warning: non-void function does not return a value in all control paths [-Wreturn-type] 29:30.90 } 29:30.90 ^ 29:30.90 /tmp/B.qx2tm3hd/BUILD/firefox-105.0/gfx/skia/skia/src/core/SkTypeface_remote.h:96:5: warning: non-void function does not return a value in all control paths [-Wreturn-type] 29:30.91 } 29:30.91 ^ 29:30.92 /tmp/B.qx2tm3hd/BUILD/firefox-105.0/gfx/skia/skia/src/core/SkTypeface_remote.h:119:5: warning: non-void function does not return a value in all control paths [-Wreturn-type] 29:30.92 } 29:30.92 ^ 29:30.92 /tmp/B.qx2tm3hd/BUILD/firefox-105.0/gfx/skia/skia/src/core/SkTypeface_remote.h:129:5: warning: non-void function does not return a value in all control paths [-Wreturn-type] 29:30.92 } 29:30.92 ^ 29:39.23 In file included from /tmp/B.qx2tm3hd/BUILD/firefox-105.0/ipc/glue/BackgroundChildImpl.cpp:24: 29:39.23 In file included from /tmp/B.qx2tm3hd/BUILD/firefox-105.0/obj-i686/ipc/ipdl/_ipdlheaders/mozilla/dom/PMediaTransportChild.h:18: 29:39.23 In file included from /tmp/B.qx2tm3hd/BUILD/firefox-105.0/obj-i686/dist/include/mozilla/dom/RTCConfigurationBinding.h:13: 29:39.23 In file included from /tmp/B.qx2tm3hd/BUILD/firefox-105.0/obj-i686/dist/include/mozilla/dom/RTCCertificate.h:11: 29:39.23 /tmp/B.qx2tm3hd/BUILD/firefox-105.0/obj-i686/dist/include/ScopedNSSTypes.h:282:22: warning: result of comparison 'mozilla::Span::index_type' (aka 'unsigned int') > 4294967295 is always false [-Wtautological-type-limit-compare] 29:39.23 if (key.Length() > std::numeric_limits<unsigned int>::max()) { 29:39.23 ~~~~~~~~~~~~ ^ ~~~~~~~~~~~~~~~~~~~~~~~~~~~~~~~~~~~~~~~~ 29:39.71 12 warnings generated. 29:42.89 1 warning generated. 29:44.62 ipc/ipdl 29:48.87 In file included from Unified_cpp_gfx_skia9.cpp:2: 29:48.87 In file included from /tmp/B.qx2tm3hd/BUILD/firefox-105.0/gfx/skia/skia/src/core/SkStroke.cpp:13: 29:48.87 /tmp/B.qx2tm3hd/BUILD/firefox-105.0/gfx/skia/skia/src/core/SkPathPriv.h:272:17: warning: use of bitwise '|' with boolean operands [-Wbitwise-instead-of-logical] 29:48.87 return (path.fPathRef->fIsRRect | path.fPathRef->fIsOval) || path.isRect(&tmp); 29:48.87 ~^~~~~~~~~~~~~~~~~~~~~~~~~~~~~~~~~~~~~~~~~~~~~~~~~ 29:48.87 || 29:48.87 /tmp/B.qx2tm3hd/BUILD/firefox-105.0/gfx/skia/skia/src/core/SkPathPriv.h:272:17: note: cast one or both operands to int to silence this warning 29:49.65 ipc/testshell 29:49.96 In file included from Unified_cpp_gfx_skia9.cpp:74: 29:49.96 /tmp/B.qx2tm3hd/BUILD/firefox-105.0/gfx/skia/skia/src/core/SkTextBlob.cpp:204:1: warning: non-void function does not return a value in all control paths [-Wreturn-type] 29:49.96 } 29:49.97 ^ 29:50.00 /tmp/B.qx2tm3hd/BUILD/firefox-105.0/gfx/skia/skia/src/core/SkTextBlob.cpp:881:14: warning: variable 'xPos' set but not used [-Wunused-but-set-variable] 29:50.00 SkScalar xPos = xOffset; 29:50.00 ^ 29:50.39 In file included from Unified_cpp_gfx_skia9.cpp:119: 29:50.39 In file included from /tmp/B.qx2tm3hd/BUILD/firefox-105.0/gfx/skia/skia/src/core/SkTypeface_remote.cpp:13: 29:50.39 /tmp/B.qx2tm3hd/BUILD/firefox-105.0/gfx/skia/skia/src/core/SkTypeface_remote.h:66:75: warning: non-void function does not return a value in all control paths [-Wreturn-type] 29:50.39 int onGetUPEM() const override { SK_ABORT("Should never be called."); } 29:50.39 ^ 29:50.39 /tmp/B.qx2tm3hd/BUILD/firefox-105.0/gfx/skia/skia/src/core/SkTypeface_remote.h:69:5: warning: non-void function does not return a value in all control paths [-Wreturn-type] 29:50.39 } 29:50.39 ^ 29:50.40 /tmp/B.qx2tm3hd/BUILD/firefox-105.0/gfx/skia/skia/src/core/SkTypeface_remote.h:72:5: warning: non-void function does not return a value in all control paths [-Wreturn-type] 29:50.40 } 29:50.40 ^ 29:50.40 /tmp/B.qx2tm3hd/BUILD/firefox-105.0/gfx/skia/skia/src/core/SkTypeface_remote.h:75:5: warning: non-void function does not return a value in all control paths [-Wreturn-type] 29:50.40 } 29:50.40 ^ 29:50.40 /tmp/B.qx2tm3hd/BUILD/firefox-105.0/gfx/skia/skia/src/core/SkTypeface_remote.h:79:5: warning: non-void function does not return a value in all control paths [-Wreturn-type] 29:50.40 } 29:50.40 ^ 29:50.40 /tmp/B.qx2tm3hd/BUILD/firefox-105.0/gfx/skia/skia/src/core/SkTypeface_remote.h:83:5: warning: non-void function does not return a value in all control paths [-Wreturn-type] 29:50.40 } 29:50.40 ^ 29:50.40 /tmp/B.qx2tm3hd/BUILD/firefox-105.0/gfx/skia/skia/src/core/SkTypeface_remote.h:90:5: warning: non-void function does not return a value in all control paths [-Wreturn-type] 29:50.40 } 29:50.40 ^ 29:50.40 /tmp/B.qx2tm3hd/BUILD/firefox-105.0/gfx/skia/skia/src/core/SkTypeface_remote.h:93:5: warning: non-void function does not return a value in all control paths [-Wreturn-type] 29:50.40 } 29:50.40 ^ 29:50.40 /tmp/B.qx2tm3hd/BUILD/firefox-105.0/gfx/skia/skia/src/core/SkTypeface_remote.h:96:5: warning: non-void function does not return a value in all control paths [-Wreturn-type] 29:50.40 } 29:50.40 ^ 29:50.40 /tmp/B.qx2tm3hd/BUILD/firefox-105.0/gfx/skia/skia/src/core/SkTypeface_remote.h:119:5: warning: non-void function does not return a value in all control paths [-Wreturn-type] 29:50.40 } 29:50.40 ^ 29:50.40 /tmp/B.qx2tm3hd/BUILD/firefox-105.0/gfx/skia/skia/src/core/SkTypeface_remote.h:129:5: warning: non-void function does not return a value in all control paths [-Wreturn-type] 29:50.40 } 29:50.40 ^ 29:50.41 In file included from Unified_cpp_gfx_skia9.cpp:119: 29:50.41 /tmp/B.qx2tm3hd/BUILD/firefox-105.0/gfx/skia/skia/src/core/SkTypeface_remote.cpp:32:1: warning: non-void function does not return a value in all control paths [-Wreturn-type] 29:50.41 } 29:50.41 ^ 29:52.65 15 warnings generated. 29:52.67 js/ductwork/debugger 29:54.95 js/loader 29:56.50 In file included from /tmp/B.qx2tm3hd/BUILD/firefox-105.0/ipc/glue/BackgroundParentImpl.cpp:30: 29:56.50 In file included from /tmp/B.qx2tm3hd/BUILD/firefox-105.0/obj-i686/dist/include/mozilla/dom/MediaTransportParent.h:8: 29:56.50 In file included from /tmp/B.qx2tm3hd/BUILD/firefox-105.0/obj-i686/ipc/ipdl/_ipdlheaders/mozilla/dom/PMediaTransportParent.h:18: 29:56.50 In file included from /tmp/B.qx2tm3hd/BUILD/firefox-105.0/obj-i686/dist/include/mozilla/dom/RTCConfigurationBinding.h:13: 29:56.50 In file included from /tmp/B.qx2tm3hd/BUILD/firefox-105.0/obj-i686/dist/include/mozilla/dom/RTCCertificate.h:11: 29:56.50 /tmp/B.qx2tm3hd/BUILD/firefox-105.0/obj-i686/dist/include/ScopedNSSTypes.h:282:22: warning: result of comparison 'mozilla::Span::index_type' (aka 'unsigned int') > 4294967295 is always false [-Wtautological-type-limit-compare] 29:56.50 if (key.Length() > std::numeric_limits<unsigned int>::max()) { 29:56.50 ~~~~~~~~~~~~ ^ ~~~~~~~~~~~~~~~~~~~~~~~~~~~~~~~~~~~~~~~~ 30:00.43 js/src/debugger 30:03.15 1 warning generated. 30:07.17 js/src/frontend 30:12.11 js/src/gc/StatsPhasesGenerated.inc.stub 30:12.36 js/src/irregexp 30:20.46 js/src/jit 30:22.66 3 warnings generated. 30:22.68 js/src 30:37.14 js/src/util 30:39.22 In file included from Unified_cpp_ipc_glue1.cpp:47: 30:39.22 In file included from /tmp/B.qx2tm3hd/BUILD/firefox-105.0/ipc/glue/InputStreamUtils.cpp:14: 30:39.22 In file included from /tmp/B.qx2tm3hd/BUILD/firefox-105.0/obj-i686/dist/include/mozilla/dom/quota/IPCStreamCipherStrategy.h:10: 30:39.22 In file included from /tmp/B.qx2tm3hd/BUILD/firefox-105.0/obj-i686/dist/include/mozilla/dom/quota/NSSCipherStrategy.h:20: 30:39.22 /tmp/B.qx2tm3hd/BUILD/firefox-105.0/obj-i686/dist/include/ScopedNSSTypes.h:282:22: warning: result of comparison 'mozilla::Span::index_type' (aka 'unsigned int') > 4294967295 is always false [-Wtautological-type-limit-compare] 30:39.22 if (key.Length() > std::numeric_limits<unsigned int>::max()) { 30:39.22 ~~~~~~~~~~~~ ^ ~~~~~~~~~~~~~~~~~~~~~~~~~~~~~~~~~~~~~~~~ 30:48.63 js/src/wasm 30:49.36 1 warning generated. 30:53.25 In file included from Unified_cpp_ipc_glue2.cpp:65: 30:53.25 In file included from /tmp/B.qx2tm3hd/BUILD/firefox-105.0/ipc/glue/TransportSecurityInfoUtils.cpp:8: 30:53.25 In file included from /tmp/B.qx2tm3hd/BUILD/firefox-105.0/obj-i686/dist/include/mozilla/psm/TransportSecurityInfo.h:10: 30:53.25 In file included from /tmp/B.qx2tm3hd/BUILD/firefox-105.0/obj-i686/dist/include/CertVerifier.h:15: 30:53.25 /tmp/B.qx2tm3hd/BUILD/firefox-105.0/obj-i686/dist/include/ScopedNSSTypes.h:282:22: warning: result of comparison 'mozilla::Span::index_type' (aka 'unsigned int') > 4294967295 is always false [-Wtautological-type-limit-compare] 30:53.25 if (key.Length() > std::numeric_limits<unsigned int>::max()) { 30:53.26 ~~~~~~~~~~~~ ^ ~~~~~~~~~~~~~~~~~~~~~~~~~~~~~~~~~~~~~~~~ 30:53.58 modules/fdlibm/src 30:53.69 js/xpconnect/loader 30:54.00 In file included from /tmp/B.qx2tm3hd/BUILD/firefox-105.0/modules/fdlibm/src/e_acos.cpp:44: 30:54.00 /tmp/B.qx2tm3hd/BUILD/firefox-105.0/modules/fdlibm/src/math_private.h:34:21: error: typedef redefinition with different types ('__double_t' (aka 'double') vs 'long double') 30:54.00 typedef __double_t double_t; 30:54.00 ^ 30:54.00 /usr/include/math.h:170:21: note: previous definition is here 30:54.00 typedef long double double_t; 30:54.00 ^ 30:54.00 In file included from /tmp/B.qx2tm3hd/BUILD/firefox-105.0/modules/fdlibm/src/e_acos.cpp:44: 30:54.00 /tmp/B.qx2tm3hd/BUILD/firefox-105.0/modules/fdlibm/src/math_private.h:36:21: error: typedef redefinition with different types ('__float_t' (aka 'float') vs 'long double') 30:54.01 typedef __float_t float_t; 30:54.01 ^ 30:54.01 /usr/include/math.h:169:21: note: previous definition is here 30:54.01 typedef long double float_t; 30:54.01 ^ 30:54.09 2 errors generated. 30:54.10 gmake[4]: *** [/tmp/B.qx2tm3hd/BUILD/firefox-105.0/config/rules.mk:667: e_acos.o] Error 1 30:54.10 gmake[3]: *** [/tmp/B.qx2tm3hd/BUILD/firefox-105.0/config/recurse.mk:72: modules/fdlibm/src/target-objects] Error 2 30:54.10 gmake[3]: *** Waiting for unfinished jobs.... 31:09.12 1 warning generated. 31:20.92 In file included from Unified_cpp_ipc_glue3.cpp:20: 31:20.92 In file included from /tmp/B.qx2tm3hd/BUILD/firefox-105.0/obj-i686/ipc/ipdl/PBackground.cpp:63: 31:20.92 In file included from /tmp/B.qx2tm3hd/BUILD/firefox-105.0/obj-i686/ipc/ipdl/_ipdlheaders/mozilla/dom/PMediaTransportParent.h:18: 31:20.92 In file included from /tmp/B.qx2tm3hd/BUILD/firefox-105.0/obj-i686/dist/include/mozilla/dom/RTCConfigurationBinding.h:13: 31:20.92 In file included from /tmp/B.qx2tm3hd/BUILD/firefox-105.0/obj-i686/dist/include/mozilla/dom/RTCCertificate.h:11: 31:20.92 /tmp/B.qx2tm3hd/BUILD/firefox-105.0/obj-i686/dist/include/ScopedNSSTypes.h:282:22: warning: result of comparison 'mozilla::Span::index_type' (aka 'unsigned int') > 4294967295 is always false [-Wtautological-type-limit-compare] 31:20.93 if (key.Length() > std::numeric_limits<unsigned int>::max()) { 31:20.93 ~~~~~~~~~~~~ ^ ~~~~~~~~~~~~~~~~~~~~~~~~~~~~~~~~~~~~~~~~ 31:53.57 1 warning generated. 32:29.33 Compiling webrender_bindings v0.1.0 (/tmp/B.qx2tm3hd/BUILD/firefox-105.0/gfx/webrender_bindings) 33:11.03 Compiling gkrust-shared v0.1.0 (/tmp/B.qx2tm3hd/BUILD/firefox-105.0/toolkit/library/rust/shared) 37:46.72 Compiling gkrust v0.1.0 (/tmp/B.qx2tm3hd/BUILD/firefox-105.0/toolkit/library/rust) 46:20.26 Finished release [optimized] target(s) in 45m 01s 46:23.25 gmake[2]: *** [/tmp/B.qx2tm3hd/BUILD/firefox-105.0/config/recurse.mk:34: compile] Error 2 46:23.25 gmake[1]: *** [/tmp/B.qx2tm3hd/BUILD/firefox-105.0/config/rules.mk:361: default] Error 2 46:23.25 gmake: *** [client.mk:63: build] Error 2 46:23.27 68 compiler warnings present. 46:23.45 /usr/bin/notify-send --app-name=Mozilla Build System Mozilla Build System Build failed Config object not found by mach. Configure complete! Be sure to run |mach build| to pick up any changes error: Bad exit status from /tmp/B.qx2tm3hd/BUILD/tmp/rpm-tmp.vD8ieZ (%build) RPM build warnings: Macro expanded in comment on line 2468: %{_datadir}/%{name}/browser/extensions/langpack-csb@firefox.mozilla.org.xpi Macro expanded in comment on line 2640: %{_datadir}/%{name}/browser/extensions/langpack-ku@firefox.mozilla.org.xpi Macro expanded in comment on line 2808: %{_datadir}/%{name}/browser/extensions/langpack-zu@firefox.mozilla.org.xpi Could not canonicalize hostname: nereid RPM build errors: Bad exit status from /tmp/B.qx2tm3hd/BUILD/tmp/rpm-tmp.vD8ieZ (%build) ended at: Wed Sep 21 00:31:17 2022, done in 0:47:44.630208 error: No files produced. + chmod -R u+rwX /tmp/B.qx2tm3hd/BUILD + rm -rf /tmp/B.qx2tm3hd/tmp /tmp/B.qx2tm3hd/BUILD + rm -rf /tmp/B.qx2tm3hd Begin-PLD-Builder-Info Build-Time: user:15943.63s sys:410.52s real:2932.12s (faults io:82537 non-io:55828433) End-PLD-Builder-Info
[Back to list of logs] [View rpm -qa of builder]