FailedOk

th/SRPMS[OK]
th/x32[OK]
th/i686[OK]
th/x86_64[OK]

ac/SRPMS[OK]
ac/i386[OK]
ac/i586[OK]
ac/i686[OK]
ac/alpha[OK]
ac/amd64[OK]
ac/athlon[OK]
ac/ppc[OK]
ac/sparc[OK]
ac/sparc64[OK]

Advanced Search
main()
Powered by PLD Linux
(c) 2002-2022 PLD Team
$Revision: 1.37 $
Powered by Neo.
Your IP: 34.229.63.215

firefox a4fad8ff-bb48-4fe7-b0af-8b3c490df604

Status:Failed
Source URL:https://buildlogs.pld-linux.org/pld/th/i686/FAIL/firefox,a4fad8ff-bb48-4fe7-b0af-8b3c490df604.bz2
text/plain URL:View!
full text:View!
rpm -qa of builder:View!
Date:2022/09/21 00:31:38
Runtime:0:47:44.630208

Toc:

  • error 1
  • 30:54.00 /tmp/B.qx2tm3hd/BUILD/firefox-105.0/modules/fdlibm/src/math_private.h:34:21: error: typedef redefinition with different types ('__double_t' (aka 'double') vs 'long double')
  • error 2
  • 30:54.00 /tmp/B.qx2tm3hd/BUILD/firefox-105.0/modules/fdlibm/src/math_private.h:36:21: error: typedef redefinition with different types ('__float_t' (aka 'float') vs 'long double')
  • error 3
  • 30:54.10 gmake[4]: *** [/tmp/B.qx2tm3hd/BUILD/firefox-105.0/config/rules.mk:667: e_acos.o] Error 1
  • error 4
  • 30:54.10 gmake[3]: *** [/tmp/B.qx2tm3hd/BUILD/firefox-105.0/config/recurse.mk:72: modules/fdlibm/src/target-objects] Error 2
  • error 5
  • 46:23.25 gmake[2]: *** [/tmp/B.qx2tm3hd/BUILD/firefox-105.0/config/recurse.mk:34: compile] Error 2
  • error 6
  • 46:23.25 gmake[1]: *** [/tmp/B.qx2tm3hd/BUILD/firefox-105.0/config/rules.mk:361: default] Error 2
  • error 7
  • error: Bad exit status from /tmp/B.qx2tm3hd/BUILD/tmp/rpm-tmp.vD8ieZ (%build)
  • error 8
  • RPM build errors:
  • error 9
  • error: No files produced.

Content:

29:39.23 /tmp/B.qx2tm3hd/BUILD/firefox-105.0/obj-i686/dist/include/ScopedNSSTypes.h:282:22: warning: result of comparison 'mozilla::Span::index_type' (aka 'unsigned int') > 4294967295 is always false [-Wtautological-type-limit-compare]
29:39.23     if (key.Length() > std::numeric_limits<unsigned int>::max()) {
29:39.23         ~~~~~~~~~~~~ ^ ~~~~~~~~~~~~~~~~~~~~~~~~~~~~~~~~~~~~~~~~
29:39.71 12 warnings generated.
29:42.89 1 warning generated.
29:44.62 ipc/ipdl
29:48.87 In file included from Unified_cpp_gfx_skia9.cpp:2:
29:48.87 In file included from /tmp/B.qx2tm3hd/BUILD/firefox-105.0/gfx/skia/skia/src/core/SkStroke.cpp:13:
29:48.87 /tmp/B.qx2tm3hd/BUILD/firefox-105.0/gfx/skia/skia/src/core/SkPathPriv.h:272:17: warning: use of bitwise '|' with boolean operands [-Wbitwise-instead-of-logical]
29:48.87         return (path.fPathRef->fIsRRect | path.fPathRef->fIsOval) || path.isRect(&tmp);
29:48.87                ~^~~~~~~~~~~~~~~~~~~~~~~~~~~~~~~~~~~~~~~~~~~~~~~~~
29:48.87                                         ||
29:48.87 /tmp/B.qx2tm3hd/BUILD/firefox-105.0/gfx/skia/skia/src/core/SkPathPriv.h:272:17: note: cast one or both operands to int to silence this warning
29:49.65 ipc/testshell
29:49.96 In file included from Unified_cpp_gfx_skia9.cpp:74:
29:49.96 /tmp/B.qx2tm3hd/BUILD/firefox-105.0/gfx/skia/skia/src/core/SkTextBlob.cpp:204:1: warning: non-void function does not return a value in all control paths [-Wreturn-type]
29:49.96 }
29:49.97 ^
29:50.00 /tmp/B.qx2tm3hd/BUILD/firefox-105.0/gfx/skia/skia/src/core/SkTextBlob.cpp:881:14: warning: variable 'xPos' set but not used [-Wunused-but-set-variable]
29:50.00     SkScalar xPos = xOffset;
29:50.00              ^
29:50.39 In file included from Unified_cpp_gfx_skia9.cpp:119:
29:50.39 In file included from /tmp/B.qx2tm3hd/BUILD/firefox-105.0/gfx/skia/skia/src/core/SkTypeface_remote.cpp:13:
29:50.39 /tmp/B.qx2tm3hd/BUILD/firefox-105.0/gfx/skia/skia/src/core/SkTypeface_remote.h:66:75: warning: non-void function does not return a value in all control paths [-Wreturn-type]
29:50.39     int onGetUPEM() const override { SK_ABORT("Should never be called."); }
29:50.39                                                                           ^
29:50.39 /tmp/B.qx2tm3hd/BUILD/firefox-105.0/gfx/skia/skia/src/core/SkTypeface_remote.h:69:5: warning: non-void function does not return a value in all control paths [-Wreturn-type]
29:50.39     }
29:50.39     ^
29:50.40 /tmp/B.qx2tm3hd/BUILD/firefox-105.0/gfx/skia/skia/src/core/SkTypeface_remote.h:72:5: warning: non-void function does not return a value in all control paths [-Wreturn-type]
29:50.40     }
29:50.40     ^
29:50.40 /tmp/B.qx2tm3hd/BUILD/firefox-105.0/gfx/skia/skia/src/core/SkTypeface_remote.h:75:5: warning: non-void function does not return a value in all control paths [-Wreturn-type]
29:50.40     }
29:50.40     ^
29:50.40 /tmp/B.qx2tm3hd/BUILD/firefox-105.0/gfx/skia/skia/src/core/SkTypeface_remote.h:79:5: warning: non-void function does not return a value in all control paths [-Wreturn-type]
29:50.40     }
29:50.40     ^
29:50.40 /tmp/B.qx2tm3hd/BUILD/firefox-105.0/gfx/skia/skia/src/core/SkTypeface_remote.h:83:5: warning: non-void function does not return a value in all control paths [-Wreturn-type]
29:50.40     }
29:50.40     ^
29:50.40 /tmp/B.qx2tm3hd/BUILD/firefox-105.0/gfx/skia/skia/src/core/SkTypeface_remote.h:90:5: warning: non-void function does not return a value in all control paths [-Wreturn-type]
29:50.40     }
29:50.40     ^
29:50.40 /tmp/B.qx2tm3hd/BUILD/firefox-105.0/gfx/skia/skia/src/core/SkTypeface_remote.h:93:5: warning: non-void function does not return a value in all control paths [-Wreturn-type]
29:50.40     }
29:50.40     ^
29:50.40 /tmp/B.qx2tm3hd/BUILD/firefox-105.0/gfx/skia/skia/src/core/SkTypeface_remote.h:96:5: warning: non-void function does not return a value in all control paths [-Wreturn-type]
29:50.40     }
29:50.40     ^
29:50.40 /tmp/B.qx2tm3hd/BUILD/firefox-105.0/gfx/skia/skia/src/core/SkTypeface_remote.h:119:5: warning: non-void function does not return a value in all control paths [-Wreturn-type]
29:50.40     }
29:50.40     ^
29:50.40 /tmp/B.qx2tm3hd/BUILD/firefox-105.0/gfx/skia/skia/src/core/SkTypeface_remote.h:129:5: warning: non-void function does not return a value in all control paths [-Wreturn-type]
29:50.40     }
29:50.40     ^
29:50.41 In file included from Unified_cpp_gfx_skia9.cpp:119:
29:50.41 /tmp/B.qx2tm3hd/BUILD/firefox-105.0/gfx/skia/skia/src/core/SkTypeface_remote.cpp:32:1: warning: non-void function does not return a value in all control paths [-Wreturn-type]
29:50.41 }
29:50.41 ^
29:52.65 15 warnings generated.
29:52.67 js/ductwork/debugger
29:54.95 js/loader
29:56.50 In file included from /tmp/B.qx2tm3hd/BUILD/firefox-105.0/ipc/glue/BackgroundParentImpl.cpp:30:
29:56.50 In file included from /tmp/B.qx2tm3hd/BUILD/firefox-105.0/obj-i686/dist/include/mozilla/dom/MediaTransportParent.h:8:
29:56.50 In file included from /tmp/B.qx2tm3hd/BUILD/firefox-105.0/obj-i686/ipc/ipdl/_ipdlheaders/mozilla/dom/PMediaTransportParent.h:18:
29:56.50 In file included from /tmp/B.qx2tm3hd/BUILD/firefox-105.0/obj-i686/dist/include/mozilla/dom/RTCConfigurationBinding.h:13:
29:56.50 In file included from /tmp/B.qx2tm3hd/BUILD/firefox-105.0/obj-i686/dist/include/mozilla/dom/RTCCertificate.h:11:
29:56.50 /tmp/B.qx2tm3hd/BUILD/firefox-105.0/obj-i686/dist/include/ScopedNSSTypes.h:282:22: warning: result of comparison 'mozilla::Span::index_type' (aka 'unsigned int') > 4294967295 is always false [-Wtautological-type-limit-compare]
29:56.50     if (key.Length() > std::numeric_limits<unsigned int>::max()) {
29:56.50         ~~~~~~~~~~~~ ^ ~~~~~~~~~~~~~~~~~~~~~~~~~~~~~~~~~~~~~~~~
30:00.43 js/src/debugger
30:03.15 1 warning generated.
30:07.17 js/src/frontend
30:12.11 js/src/gc/StatsPhasesGenerated.inc.stub
30:12.36 js/src/irregexp
30:20.46 js/src/jit
30:22.66 3 warnings generated.
30:22.68 js/src
30:37.14 js/src/util
30:39.22 In file included from Unified_cpp_ipc_glue1.cpp:47:
30:39.22 In file included from /tmp/B.qx2tm3hd/BUILD/firefox-105.0/ipc/glue/InputStreamUtils.cpp:14:
30:39.22 In file included from /tmp/B.qx2tm3hd/BUILD/firefox-105.0/obj-i686/dist/include/mozilla/dom/quota/IPCStreamCipherStrategy.h:10:
30:39.22 In file included from /tmp/B.qx2tm3hd/BUILD/firefox-105.0/obj-i686/dist/include/mozilla/dom/quota/NSSCipherStrategy.h:20:
30:39.22 /tmp/B.qx2tm3hd/BUILD/firefox-105.0/obj-i686/dist/include/ScopedNSSTypes.h:282:22: warning: result of comparison 'mozilla::Span::index_type' (aka 'unsigned int') > 4294967295 is always false [-Wtautological-type-limit-compare]
30:39.22     if (key.Length() > std::numeric_limits<unsigned int>::max()) {
30:39.22         ~~~~~~~~~~~~ ^ ~~~~~~~~~~~~~~~~~~~~~~~~~~~~~~~~~~~~~~~~
30:48.63 js/src/wasm
30:49.36 1 warning generated.
30:53.25 In file included from Unified_cpp_ipc_glue2.cpp:65:
30:53.25 In file included from /tmp/B.qx2tm3hd/BUILD/firefox-105.0/ipc/glue/TransportSecurityInfoUtils.cpp:8:
30:53.25 In file included from /tmp/B.qx2tm3hd/BUILD/firefox-105.0/obj-i686/dist/include/mozilla/psm/TransportSecurityInfo.h:10:
30:53.25 In file included from /tmp/B.qx2tm3hd/BUILD/firefox-105.0/obj-i686/dist/include/CertVerifier.h:15:
30:53.25 /tmp/B.qx2tm3hd/BUILD/firefox-105.0/obj-i686/dist/include/ScopedNSSTypes.h:282:22: warning: result of comparison 'mozilla::Span::index_type' (aka 'unsigned int') > 4294967295 is always false [-Wtautological-type-limit-compare]
30:53.25     if (key.Length() > std::numeric_limits<unsigned int>::max()) {
30:53.26         ~~~~~~~~~~~~ ^ ~~~~~~~~~~~~~~~~~~~~~~~~~~~~~~~~~~~~~~~~
30:53.58 modules/fdlibm/src
30:53.69 js/xpconnect/loader
30:54.00 In file included from /tmp/B.qx2tm3hd/BUILD/firefox-105.0/modules/fdlibm/src/e_acos.cpp:44:
30:54.00 /tmp/B.qx2tm3hd/BUILD/firefox-105.0/modules/fdlibm/src/math_private.h:34:21: error: typedef redefinition with different types ('__double_t' (aka 'double') vs 'long double')
30:54.00 typedef __double_t  double_t;
30:54.00                     ^
30:54.00 /usr/include/math.h:170:21: note: previous definition is here
30:54.00 typedef long double double_t;
30:54.00                     ^
30:54.00 In file included from /tmp/B.qx2tm3hd/BUILD/firefox-105.0/modules/fdlibm/src/e_acos.cpp:44:
30:54.00 /tmp/B.qx2tm3hd/BUILD/firefox-105.0/modules/fdlibm/src/math_private.h:36:21: error: typedef redefinition with different types ('__float_t' (aka 'float') vs 'long double')
30:54.01 typedef __float_t   float_t;
30:54.01                     ^
30:54.01 /usr/include/math.h:169:21: note: previous definition is here
30:54.01 typedef long double float_t;
30:54.01                     ^
30:54.09 2 errors generated.
30:54.10 gmake[4]: *** [/tmp/B.qx2tm3hd/BUILD/firefox-105.0/config/rules.mk:667: e_acos.o] Error 1
30:54.10 gmake[3]: *** [/tmp/B.qx2tm3hd/BUILD/firefox-105.0/config/recurse.mk:72: modules/fdlibm/src/target-objects] Error 2
30:54.10 gmake[3]: *** Waiting for unfinished jobs....
31:09.12 1 warning generated.
31:20.92 In file included from Unified_cpp_ipc_glue3.cpp:20:
31:20.92 In file included from /tmp/B.qx2tm3hd/BUILD/firefox-105.0/obj-i686/ipc/ipdl/PBackground.cpp:63:
31:20.92 In file included from /tmp/B.qx2tm3hd/BUILD/firefox-105.0/obj-i686/ipc/ipdl/_ipdlheaders/mozilla/dom/PMediaTransportParent.h:18:
31:20.92 In file included from /tmp/B.qx2tm3hd/BUILD/firefox-105.0/obj-i686/dist/include/mozilla/dom/RTCConfigurationBinding.h:13:
31:20.92 In file included from /tmp/B.qx2tm3hd/BUILD/firefox-105.0/obj-i686/dist/include/mozilla/dom/RTCCertificate.h:11:
31:20.92 /tmp/B.qx2tm3hd/BUILD/firefox-105.0/obj-i686/dist/include/ScopedNSSTypes.h:282:22: warning: result of comparison 'mozilla::Span::index_type' (aka 'unsigned int') > 4294967295 is always false [-Wtautological-type-limit-compare]
31:20.93     if (key.Length() > std::numeric_limits<unsigned int>::max()) {
31:20.93         ~~~~~~~~~~~~ ^ ~~~~~~~~~~~~~~~~~~~~~~~~~~~~~~~~~~~~~~~~
31:53.57 1 warning generated.
32:29.33    Compiling webrender_bindings v0.1.0 (/tmp/B.qx2tm3hd/BUILD/firefox-105.0/gfx/webrender_bindings)
33:11.03    Compiling gkrust-shared v0.1.0 (/tmp/B.qx2tm3hd/BUILD/firefox-105.0/toolkit/library/rust/shared)
37:46.72    Compiling gkrust v0.1.0 (/tmp/B.qx2tm3hd/BUILD/firefox-105.0/toolkit/library/rust)
46:20.26     Finished release [optimized] target(s) in 45m 01s
46:23.25 gmake[2]: *** [/tmp/B.qx2tm3hd/BUILD/firefox-105.0/config/recurse.mk:34: compile] Error 2
46:23.25 gmake[1]: *** [/tmp/B.qx2tm3hd/BUILD/firefox-105.0/config/rules.mk:361: default] Error 2
46:23.25 gmake: *** [client.mk:63: build] Error 2
46:23.27 68 compiler warnings present.
46:23.45 /usr/bin/notify-send --app-name=Mozilla Build System Mozilla Build System Build failed
 Config object not found by mach.
Configure complete!
Be sure to run |mach build| to pick up any changes
error: Bad exit status from /tmp/B.qx2tm3hd/BUILD/tmp/rpm-tmp.vD8ieZ (%build)

RPM build warnings:
    Macro expanded in comment on line 2468: %{_datadir}/%{name}/browser/extensions/langpack-csb@firefox.mozilla.org.xpi

    Macro expanded in comment on line 2640: %{_datadir}/%{name}/browser/extensions/langpack-ku@firefox.mozilla.org.xpi

    Macro expanded in comment on line 2808: %{_datadir}/%{name}/browser/extensions/langpack-zu@firefox.mozilla.org.xpi

    Could not canonicalize hostname: nereid

RPM build errors:
    Bad exit status from /tmp/B.qx2tm3hd/BUILD/tmp/rpm-tmp.vD8ieZ (%build)
ended at: Wed Sep 21 00:31:17 2022, done in 0:47:44.630208
error: No files produced.
+ chmod -R u+rwX /tmp/B.qx2tm3hd/BUILD
+ rm -rf /tmp/B.qx2tm3hd/tmp /tmp/B.qx2tm3hd/BUILD
+ rm -rf /tmp/B.qx2tm3hd
Begin-PLD-Builder-Info
Build-Time: user:15943.63s sys:410.52s real:2932.12s (faults io:82537 non-io:55828433)

End-PLD-Builder-Info
[Back to list of logs] [View rpm -qa of builder]