FailedOk

th/SRPMS[OK]
th/x32[OK]
th/i686[OK]
th/x86_64[OK]

ac/SRPMS[OK]
ac/i386[OK]
ac/i586[OK]
ac/i686[OK]
ac/alpha[OK]
ac/amd64[OK]
ac/athlon[OK]
ac/ppc[OK]
ac/sparc[OK]
ac/sparc64[OK]

Advanced Search
main()
Powered by PLD Linux
(c) 2002-2021 PLD Team
$Revision: 1.37 $
Powered by Real Computer.
Your IP: 3.234.211.61

firefox d871e1f7-f313-4a89-ad48-c84360585cd2

Status:Failed
Source URL:https://buildlogs.pld-linux.org/pld/th/i686/FAIL/firefox,d871e1f7-f313-4a89-ad48-c84360585cd2.bz2
text/plain URL:View!
rpm -qa of builder:View!
Date:2021/10/05 23:48:19
Runtime:1:09:12.198345

Toc:

  • prep
  • Executing(%prep): /bin/sh -e /tmp/B.13_9mzto/BUILD/tmp/rpm-tmp.nvcID4
  • build
  • Executing(%build): /bin/sh -e /tmp/B.13_9mzto/BUILD/tmp/rpm-tmp.hGow1U
  • error 1
  • 64:09.20 /tmp/B.13_9mzto/BUILD/firefox-93.0/modules/fdlibm/src/math_private.h:34:21: error: typedef redefinition with different types ('__double_t' (aka 'double') vs 'long double')
  • error 2
  • 64:09.32 gmake[4]: *** [/tmp/B.13_9mzto/BUILD/firefox-93.0/config/rules.mk:676: e_acos.o] Error 1
  • error 3
  • 64:09.32 gmake[3]: *** [/tmp/B.13_9mzto/BUILD/firefox-93.0/config/recurse.mk:72: modules/fdlibm/src/target-objects] Error 2
  • error 4
  • 68:14.74 gmake[2]: *** [/tmp/B.13_9mzto/BUILD/firefox-93.0/config/recurse.mk:34: compile] Error 2
  • error 5
  • 68:14.74 gmake[1]: *** [/tmp/B.13_9mzto/BUILD/firefox-93.0/config/rules.mk:358: default] Error 2
  • error 6
  • error: Bad exit status from /tmp/B.13_9mzto/BUILD/tmp/rpm-tmp.hGow1U (%build)
  • error 7
  • RPM build errors:
  • error 8
  • error: No files produced.

Content:

request from: baggins
checking if we should skip the build
started at: Tue Oct  5 22:38:21 2021
killing old processes on a builder
sending signal 9 to pid -1
cleaning up /tmp
fetching https://srcbuilder.pld-linux.org/th//srpms/d871e1f7-f313-4a89-ad48-c84360585cd2/firefox-93.0-1.src.rpm
fetched 428358775 bytes, 24253.4 K/s
installing srpm: firefox-93.0-1.src.rpm
+ install -d /tmp/B.13_9mzto/BUILD /tmp/B.13_9mzto/RPMS
+ LC_ALL=en_US.UTF-8
+ rpm -qp --changelog firefox-93.0-1.src.rpm
* Tue Oct 05 2021 PLD Linux Team <feedback@pld-linux.org>
- For complete changelog see: http://git.pld-linux.org/?p=packages/firefox.git;a=log;h=master
* Tue Oct 05 2021 Jan Rękorajski <baggins@pld-linux.org> f2c2bc9
- rel 1 * Tue Oct 05 2021 Jan Rękorajski <baggins@pld-linux.org> 27f5f13
- fetch 93.0 sources * Sat Sep 25 2021 Jan Rękorajski <baggins@pld-linux.org> d220f00
- up to 92.0.1 * Thu Sep 16 2021 Jakub Bogusz <qboosh@pld-linux.org> 5e39d8e
- new langpacks: sco, szl * Tue Sep 07 2021 Jan Palus <atler@pld-linux.org> e610d9b
- up to 92.0 * Thu Aug 26 2021 Jan Palus <atler@pld-linux.org> 61a7f93
- up to 91.0.2 * Wed Aug 18 2021 Jan Palus <atler@pld-linux.org> c71d7e8
- fix build with glibc 2.34; rel 2 * Wed Aug 18 2021 Jan Palus <atler@pld-linux.org> d9fc28f
- up to 91.0.1 * Tue Aug 10 2021 Jan Palus <atler@pld-linux.org> 48896cb
- up to 91.0 * Fri Jul 23 2021 Jan Palus <atler@pld-linux.org> 551c9ea
- up to 90.0.2 * Wed Jul 21 2021 Jan Palus <atler@pld-linux.org> fecdec5
- up to 90.0.1 * Tue Jul 13 2021 Jan Palus <atler@pld-linux.org> 65479bc
- add rust_simd bcond (disabled by default) * Tue Jul 13 2021 Jan Palus <atler@pld-linux.org> 38a1e97
- use explicit lto value * Tue Jul 13 2021 Jan Palus <atler@pld-linux.org> fafb570
- use toolkit value which ensures wayland support * Tue Jul 13 2021 Jan Palus <atler@pld-linux.org> 685e4cb
- up to 90.0 * Fri Jun 25 2021 Jan Palus <atler@pld-linux.org> d269681
- up to 89.0.2 * Thu Jun 17 2021 Jan Palus <atler@pld-linux.org> 459a16c
- up to 89.0.1 * Tue Jun 01 2021 Jan Palus <atler@pld-linux.org> 544da27
- up to 89.0 * Fri May 07 2021 Jan Palus <atler@pld-linux.org> 3a36f44
- up to 88.0.1 * Thu Apr 22 2021 Jan Palus <atler@pld-linux.org> 2e3ae2e
- require nss/nspr firefox was built against + rpm -Uhv --nodeps --define '_topdir /tmp/B.13_9mzto' --define '_specdir %{_topdir}' --define '_sourcedir %{_specdir}' --define '_rpmdir %{_topdir}/RPMS' --define '_builddir %{_topdir}/BUILD' firefox-93.0-1.src.rpm Updating / installing... firefox-93.0-1 ######################################## + rm -f firefox-93.0-1.src.rpm + install -m 700 -d /tmp/B.13_9mzto/BUILD/tmp + TMPDIR=/tmp/B.13_9mzto/BUILD/tmp + exec nice -n 0 rpmbuild -bp --short-circuit --nodeps --define '_topdir /tmp/B.13_9mzto' --define '_specdir %{_topdir}' --define '_sourcedir %{_specdir}' --define '_rpmdir %{_topdir}/RPMS' --define '_builddir %{_topdir}/BUILD' --target i686-pld-linux --define 'prep exit 0' /tmp/B.13_9mzto/firefox.spec warning: line 562: It's not recommended to have unversioned Obsoletes: Obsoletes: firefox-lang-bn_IN warning: Macro expanded in comment on line 2449: %{_datadir}/%{name}/browser/extensions/langpack-csb@firefox.mozilla.org.xpi warning: Macro expanded in comment on line 2621: %{_datadir}/%{name}/browser/extensions/langpack-ku@firefox.mozilla.org.xpi warning: Macro expanded in comment on line 2789: %{_datadir}/%{name}/browser/extensions/langpack-zu@firefox.mozilla.org.xpi warning: Could not canonicalize hostname: nereid Building target platforms: i686-pld-linux Building for target i686-pld-linux checking BuildConflict-ing packages rpm: warning: line 562: It's not recommended to have unversioned Obsoletes: Obsoletes: firefox-lang-bn_IN rpm: warning: Macro expanded in comment on line 2449: %{_datadir}/%{name}/browser/extensions/langpack-csb@firefox.mozilla.org.xpi rpm: rpm: warning: Macro expanded in comment on line 2621: %{_datadir}/%{name}/browser/extensions/langpack-ku@firefox.mozilla.org.xpi rpm: rpm: warning: Macro expanded in comment on line 2789: %{_datadir}/%{name}/browser/extensions/langpack-zu@firefox.mozilla.org.xpi rpm: rpm: warning: Could not canonicalize hostname: nereid rpm: Building target platforms: i686-pld-linux rpm: Building for target i686-pld-linux no BuildConflicts found checking BR rpm: warning: line 562: It's not recommended to have unversioned Obsoletes: Obsoletes: firefox-lang-bn_IN rpm: warning: Macro expanded in comment on line 2449: %{_datadir}/%{name}/browser/extensions/langpack-csb@firefox.mozilla.org.xpi rpm: rpm: warning: Macro expanded in comment on line 2621: %{_datadir}/%{name}/browser/extensions/langpack-ku@firefox.mozilla.org.xpi rpm: rpm: warning: Macro expanded in comment on line 2789: %{_datadir}/%{name}/browser/extensions/langpack-zu@firefox.mozilla.org.xpi rpm: rpm: warning: Could not canonicalize hostname: nereid rpm: Building target platforms: i686-pld-linux rpm: Building for target i686-pld-linux no BR needed building RPM using: set -ex; : build-id: d871e1f7-f313-4a89-ad48-c84360585cd2; TMPDIR=/tmp/B.13_9mzto/BUILD/tmp exec nice -n 0 rpmbuild -bb --define '_smp_mflags -j9' --define '_make_opts -Otarget' --define '_pld_builder 1' --define '_topdir /tmp/B.13_9mzto' --define '_specdir %{_topdir}' --define '_sourcedir %{_specdir}' --define '_rpmdir %{_topdir}/RPMS' --define '_builddir %{_topdir}/BUILD' --target i686-pld-linux /tmp/B.13_9mzto/firefox.spec + : build-id: d871e1f7-f313-4a89-ad48-c84360585cd2 + TMPDIR=/tmp/B.13_9mzto/BUILD/tmp + exec nice -n 0 rpmbuild -bb --define '_smp_mflags -j9' --define '_make_opts -Otarget' --define '_pld_builder 1' --define '_topdir /tmp/B.13_9mzto' --define '_specdir %{_topdir}' --define '_sourcedir %{_specdir}' --define '_rpmdir %{_topdir}/RPMS' --define '_builddir %{_topdir}/BUILD' --target i686-pld-linux /tmp/B.13_9mzto/firefox.spec warning: line 562: It's not recommended to have unversioned Obsoletes: Obsoletes: firefox-lang-bn_IN warning: Macro expanded in comment on line 2449: %{_datadir}/%{name}/browser/extensions/langpack-csb@firefox.mozilla.org.xpi warning: Macro expanded in comment on line 2621: %{_datadir}/%{name}/browser/extensions/langpack-ku@firefox.mozilla.org.xpi warning: Macro expanded in comment on line 2789: %{_datadir}/%{name}/browser/extensions/langpack-zu@firefox.mozilla.org.xpi warning: Could not canonicalize hostname: nereid Building target platforms: i686-pld-linux Building for target i686-pld-linux Executing(%prep): /bin/sh -e /tmp/B.13_9mzto/BUILD/tmp/rpm-tmp.nvcID4 + umask 022 + cd /tmp/B.13_9mzto/BUILD + cd /tmp/B.13_9mzto/BUILD + rm -rf firefox-93.0 + /usr/bin/xz -dc /tmp/B.13_9mzto/firefox-93.0.source.tar.xz + /bin/tar -xof - + STATUS=0 + '[' 0 -ne 0 ']' + cd firefox-93.0 + unpack -qq /tmp/B.13_9mzto/ach.xpi + typeset 'args=-qq' 'file=/tmp/B.13_9mzto/ach.xpi' + cp -p /tmp/B.13_9mzto/ach.xpi . + STATUS=0 + '[' 0 -ne 0 ']' + unpack -qq /tmp/B.13_9mzto/af.xpi + typeset 'args=-qq' 'file=/tmp/B.13_9mzto/af.xpi' + cp -p /tmp/B.13_9mzto/af.xpi . + STATUS=0 + '[' 0 -ne 0 ']' + unpack -qq /tmp/B.13_9mzto/an.xpi + typeset 'args=-qq' 'file=/tmp/B.13_9mzto/an.xpi' + cp -p /tmp/B.13_9mzto/an.xpi . + STATUS=0 + '[' 0 -ne 0 ']' + unpack -qq /tmp/B.13_9mzto/ar.xpi + typeset 'args=-qq' 'file=/tmp/B.13_9mzto/ar.xpi' + cp -p /tmp/B.13_9mzto/ar.xpi . + STATUS=0 + '[' 0 -ne 0 ']' + unpack -qq /tmp/B.13_9mzto/ast.xpi + typeset 'args=-qq' 'file=/tmp/B.13_9mzto/ast.xpi' + cp -p /tmp/B.13_9mzto/ast.xpi . + STATUS=0 + '[' 0 -ne 0 ']' + unpack -qq /tmp/B.13_9mzto/az.xpi + typeset 'args=-qq' 'file=/tmp/B.13_9mzto/az.xpi' + cp -p /tmp/B.13_9mzto/az.xpi . + STATUS=0 + '[' 0 -ne 0 ']' + unpack -qq /tmp/B.13_9mzto/be.xpi + typeset 'args=-qq' 'file=/tmp/B.13_9mzto/be.xpi' + cp -p /tmp/B.13_9mzto/be.xpi . + STATUS=0 + '[' 0 -ne 0 ']' + unpack -qq /tmp/B.13_9mzto/bg.xpi + typeset 'args=-qq' 'file=/tmp/B.13_9mzto/bg.xpi' + cp -p /tmp/B.13_9mzto/bg.xpi . + STATUS=0 + '[' 0 -ne 0 ']' + unpack -qq /tmp/B.13_9mzto/bn.xpi + typeset 'args=-qq' 'file=/tmp/B.13_9mzto/bn.xpi' + cp -p /tmp/B.13_9mzto/bn.xpi . + STATUS=0 + '[' 0 -ne 0 ']' + unpack -qq /tmp/B.13_9mzto/br.xpi + typeset 'args=-qq' 'file=/tmp/B.13_9mzto/br.xpi' + cp -p /tmp/B.13_9mzto/br.xpi . + STATUS=0 + '[' 0 -ne 0 ']' + unpack -qq /tmp/B.13_9mzto/bs.xpi + typeset 'args=-qq' 'file=/tmp/B.13_9mzto/bs.xpi' + cp -p /tmp/B.13_9mzto/bs.xpi . + STATUS=0 + '[' 0 -ne 0 ']' + unpack -qq /tmp/B.13_9mzto/ca.xpi + typeset 'args=-qq' 'file=/tmp/B.13_9mzto/ca.xpi' + cp -p /tmp/B.13_9mzto/ca.xpi . + STATUS=0 + '[' 0 -ne 0 ']' + unpack -qq /tmp/B.13_9mzto/ca-valencia.xpi + typeset 'args=-qq' 'file=/tmp/B.13_9mzto/ca-valencia.xpi' + cp -p /tmp/B.13_9mzto/ca-valencia.xpi . + STATUS=0 + '[' 0 -ne 0 ']' + unpack -qq /tmp/B.13_9mzto/cak.xpi + typeset 'args=-qq' 'file=/tmp/B.13_9mzto/cak.xpi' + cp -p /tmp/B.13_9mzto/cak.xpi . + STATUS=0 + '[' 0 -ne 0 ']' + unpack -qq /tmp/B.13_9mzto/cs.xpi + typeset 'args=-qq' 'file=/tmp/B.13_9mzto/cs.xpi' + cp -p /tmp/B.13_9mzto/cs.xpi . + STATUS=0 + '[' 0 -ne 0 ']' + unpack -qq /tmp/B.13_9mzto/cy.xpi + typeset 'args=-qq' 'file=/tmp/B.13_9mzto/cy.xpi' + cp -p /tmp/B.13_9mzto/cy.xpi . + STATUS=0 + '[' 0 -ne 0 ']' + unpack -qq /tmp/B.13_9mzto/da.xpi + typeset 'args=-qq' 'file=/tmp/B.13_9mzto/da.xpi' + cp -p /tmp/B.13_9mzto/da.xpi . + STATUS=0 + '[' 0 -ne 0 ']' + unpack -qq /tmp/B.13_9mzto/de.xpi + typeset 'args=-qq' 'file=/tmp/B.13_9mzto/de.xpi' + cp -p /tmp/B.13_9mzto/de.xpi . + STATUS=0 + '[' 0 -ne 0 ']' + unpack -qq /tmp/B.13_9mzto/dsb.xpi + typeset 'args=-qq' 'file=/tmp/B.13_9mzto/dsb.xpi' + cp -p /tmp/B.13_9mzto/dsb.xpi . + STATUS=0 + '[' 0 -ne 0 ']' + unpack -qq /tmp/B.13_9mzto/el.xpi + typeset 'args=-qq' 'file=/tmp/B.13_9mzto/el.xpi' + cp -p /tmp/B.13_9mzto/el.xpi . + STATUS=0 + '[' 0 -ne 0 ']' + unpack -qq /tmp/B.13_9mzto/en-CA.xpi + typeset 'args=-qq' 'file=/tmp/B.13_9mzto/en-CA.xpi' + cp -p /tmp/B.13_9mzto/en-CA.xpi . + STATUS=0 + '[' 0 -ne 0 ']' + unpack -qq /tmp/B.13_9mzto/en-GB.xpi + typeset 'args=-qq' 'file=/tmp/B.13_9mzto/en-GB.xpi' + cp -p /tmp/B.13_9mzto/en-GB.xpi . + STATUS=0 + '[' 0 -ne 0 ']' + unpack -qq /tmp/B.13_9mzto/en-US.xpi + typeset 'args=-qq' 'file=/tmp/B.13_9mzto/en-US.xpi' + cp -p /tmp/B.13_9mzto/en-US.xpi . + STATUS=0 + '[' 0 -ne 0 ']' + unpack -qq /tmp/B.13_9mzto/eo.xpi + typeset 'args=-qq' 'file=/tmp/B.13_9mzto/eo.xpi' + cp -p /tmp/B.13_9mzto/eo.xpi . + STATUS=0 + '[' 0 -ne 0 ']' + unpack -qq /tmp/B.13_9mzto/es-AR.xpi + typeset 'args=-qq' 'file=/tmp/B.13_9mzto/es-AR.xpi' + cp -p /tmp/B.13_9mzto/es-AR.xpi . + STATUS=0 + '[' 0 -ne 0 ']' + unpack -qq /tmp/B.13_9mzto/es-CL.xpi + typeset 'args=-qq' 'file=/tmp/B.13_9mzto/es-CL.xpi' + cp -p /tmp/B.13_9mzto/es-CL.xpi . + STATUS=0 + '[' 0 -ne 0 ']' + unpack -qq /tmp/B.13_9mzto/es-ES.xpi + typeset 'args=-qq' 'file=/tmp/B.13_9mzto/es-ES.xpi' + cp -p /tmp/B.13_9mzto/es-ES.xpi . + STATUS=0 + '[' 0 -ne 0 ']' + unpack -qq /tmp/B.13_9mzto/es-MX.xpi + typeset 'args=-qq' 'file=/tmp/B.13_9mzto/es-MX.xpi' + cp -p /tmp/B.13_9mzto/es-MX.xpi . + STATUS=0 + '[' 0 -ne 0 ']' + unpack -qq /tmp/B.13_9mzto/et.xpi + typeset 'args=-qq' 'file=/tmp/B.13_9mzto/et.xpi' + cp -p /tmp/B.13_9mzto/et.xpi . + STATUS=0 + '[' 0 -ne 0 ']' + unpack -qq /tmp/B.13_9mzto/eu.xpi + typeset 'args=-qq' 'file=/tmp/B.13_9mzto/eu.xpi' + cp -p /tmp/B.13_9mzto/eu.xpi . + STATUS=0 + '[' 0 -ne 0 ']' + unpack -qq /tmp/B.13_9mzto/fa.xpi + typeset 'args=-qq' 'file=/tmp/B.13_9mzto/fa.xpi' + cp -p /tmp/B.13_9mzto/fa.xpi . + STATUS=0 + '[' 0 -ne 0 ']' + unpack -qq /tmp/B.13_9mzto/ff.xpi + typeset 'args=-qq' 'file=/tmp/B.13_9mzto/ff.xpi' + cp -p /tmp/B.13_9mzto/ff.xpi . + STATUS=0 + '[' 0 -ne 0 ']' + unpack -qq /tmp/B.13_9mzto/fi.xpi + typeset 'args=-qq' 'file=/tmp/B.13_9mzto/fi.xpi' + cp -p /tmp/B.13_9mzto/fi.xpi . + STATUS=0 + '[' 0 -ne 0 ']' + unpack -qq /tmp/B.13_9mzto/fr.xpi + typeset 'args=-qq' 'file=/tmp/B.13_9mzto/fr.xpi' + cp -p /tmp/B.13_9mzto/fr.xpi . + STATUS=0 + '[' 0 -ne 0 ']' + unpack -qq /tmp/B.13_9mzto/fy-NL.xpi + typeset 'args=-qq' 'file=/tmp/B.13_9mzto/fy-NL.xpi' + cp -p /tmp/B.13_9mzto/fy-NL.xpi . + STATUS=0 + '[' 0 -ne 0 ']' + unpack -qq /tmp/B.13_9mzto/ga-IE.xpi + typeset 'args=-qq' 'file=/tmp/B.13_9mzto/ga-IE.xpi' + cp -p /tmp/B.13_9mzto/ga-IE.xpi . + STATUS=0 + '[' 0 -ne 0 ']' + unpack -qq /tmp/B.13_9mzto/gd.xpi + typeset 'args=-qq' 'file=/tmp/B.13_9mzto/gd.xpi' + cp -p /tmp/B.13_9mzto/gd.xpi . + STATUS=0 + '[' 0 -ne 0 ']' + unpack -qq /tmp/B.13_9mzto/gl.xpi + typeset 'args=-qq' 'file=/tmp/B.13_9mzto/gl.xpi' + cp -p /tmp/B.13_9mzto/gl.xpi . + STATUS=0 + '[' 0 -ne 0 ']' + unpack -qq /tmp/B.13_9mzto/gn.xpi + typeset 'args=-qq' 'file=/tmp/B.13_9mzto/gn.xpi' + cp -p /tmp/B.13_9mzto/gn.xpi . + STATUS=0 + '[' 0 -ne 0 ']' + unpack -qq /tmp/B.13_9mzto/gu-IN.xpi + typeset 'args=-qq' 'file=/tmp/B.13_9mzto/gu-IN.xpi' + cp -p /tmp/B.13_9mzto/gu-IN.xpi . + STATUS=0 + '[' 0 -ne 0 ']' + unpack -qq /tmp/B.13_9mzto/he.xpi + typeset 'args=-qq' 'file=/tmp/B.13_9mzto/he.xpi' + cp -p /tmp/B.13_9mzto/he.xpi . + STATUS=0 + '[' 0 -ne 0 ']' + unpack -qq /tmp/B.13_9mzto/hi-IN.xpi + typeset 'args=-qq' 'file=/tmp/B.13_9mzto/hi-IN.xpi' + cp -p /tmp/B.13_9mzto/hi-IN.xpi . + STATUS=0 + '[' 0 -ne 0 ']' + unpack -qq /tmp/B.13_9mzto/hr.xpi + typeset 'args=-qq' 'file=/tmp/B.13_9mzto/hr.xpi' + cp -p /tmp/B.13_9mzto/hr.xpi . + STATUS=0 + '[' 0 -ne 0 ']' + unpack -qq /tmp/B.13_9mzto/hsb.xpi + typeset 'args=-qq' 'file=/tmp/B.13_9mzto/hsb.xpi' + cp -p /tmp/B.13_9mzto/hsb.xpi . + STATUS=0 + '[' 0 -ne 0 ']' + unpack -qq /tmp/B.13_9mzto/hu.xpi + typeset 'args=-qq' 'file=/tmp/B.13_9mzto/hu.xpi' + cp -p /tmp/B.13_9mzto/hu.xpi . + STATUS=0 + '[' 0 -ne 0 ']' + unpack -qq /tmp/B.13_9mzto/hy-AM.xpi + typeset 'args=-qq' 'file=/tmp/B.13_9mzto/hy-AM.xpi' + cp -p /tmp/B.13_9mzto/hy-AM.xpi . + STATUS=0 + '[' 0 -ne 0 ']' + unpack -qq /tmp/B.13_9mzto/ia.xpi + typeset 'args=-qq' 'file=/tmp/B.13_9mzto/ia.xpi' + cp -p /tmp/B.13_9mzto/ia.xpi . + STATUS=0 + '[' 0 -ne 0 ']' + unpack -qq /tmp/B.13_9mzto/id.xpi + typeset 'args=-qq' 'file=/tmp/B.13_9mzto/id.xpi' + cp -p /tmp/B.13_9mzto/id.xpi . + STATUS=0 + '[' 0 -ne 0 ']' + unpack -qq /tmp/B.13_9mzto/is.xpi + typeset 'args=-qq' 'file=/tmp/B.13_9mzto/is.xpi' + cp -p /tmp/B.13_9mzto/is.xpi . + STATUS=0 + '[' 0 -ne 0 ']' + unpack -qq /tmp/B.13_9mzto/it.xpi + typeset 'args=-qq' 'file=/tmp/B.13_9mzto/it.xpi' + cp -p /tmp/B.13_9mzto/it.xpi . + STATUS=0 + '[' 0 -ne 0 ']' + unpack -qq /tmp/B.13_9mzto/ja.xpi + typeset 'args=-qq' 'file=/tmp/B.13_9mzto/ja.xpi' + cp -p /tmp/B.13_9mzto/ja.xpi . + STATUS=0 + '[' 0 -ne 0 ']' + unpack -qq /tmp/B.13_9mzto/ka.xpi + typeset 'args=-qq' 'file=/tmp/B.13_9mzto/ka.xpi' + cp -p /tmp/B.13_9mzto/ka.xpi . + STATUS=0 + '[' 0 -ne 0 ']' + unpack -qq /tmp/B.13_9mzto/kab.xpi + typeset 'args=-qq' 'file=/tmp/B.13_9mzto/kab.xpi' + cp -p /tmp/B.13_9mzto/kab.xpi . + STATUS=0 + '[' 0 -ne 0 ']' + unpack -qq /tmp/B.13_9mzto/kk.xpi + typeset 'args=-qq' 'file=/tmp/B.13_9mzto/kk.xpi' + cp -p /tmp/B.13_9mzto/kk.xpi . + STATUS=0 + '[' 0 -ne 0 ']' + unpack -qq /tmp/B.13_9mzto/km.xpi + typeset 'args=-qq' 'file=/tmp/B.13_9mzto/km.xpi' + cp -p /tmp/B.13_9mzto/km.xpi . + STATUS=0 + '[' 0 -ne 0 ']' + unpack -qq /tmp/B.13_9mzto/kn.xpi + typeset 'args=-qq' 'file=/tmp/B.13_9mzto/kn.xpi' + cp -p /tmp/B.13_9mzto/kn.xpi . + STATUS=0 + '[' 0 -ne 0 ']' + unpack -qq /tmp/B.13_9mzto/ko.xpi + typeset 'args=-qq' 'file=/tmp/B.13_9mzto/ko.xpi' + cp -p /tmp/B.13_9mzto/ko.xpi . + STATUS=0 + '[' 0 -ne 0 ']' + unpack -qq /tmp/B.13_9mzto/lij.xpi + typeset 'args=-qq' 'file=/tmp/B.13_9mzto/lij.xpi' + cp -p /tmp/B.13_9mzto/lij.xpi . + STATUS=0 + '[' 0 -ne 0 ']' + unpack -qq /tmp/B.13_9mzto/lt.xpi + typeset 'args=-qq' 'file=/tmp/B.13_9mzto/lt.xpi' + cp -p /tmp/B.13_9mzto/lt.xpi . + STATUS=0 + '[' 0 -ne 0 ']' + unpack -qq /tmp/B.13_9mzto/lv.xpi + typeset 'args=-qq' 'file=/tmp/B.13_9mzto/lv.xpi' + cp -p /tmp/B.13_9mzto/lv.xpi . + STATUS=0 + '[' 0 -ne 0 ']' + unpack -qq /tmp/B.13_9mzto/mk.xpi + typeset 'args=-qq' 'file=/tmp/B.13_9mzto/mk.xpi' + cp -p /tmp/B.13_9mzto/mk.xpi . + STATUS=0 + '[' 0 -ne 0 ']' + unpack -qq /tmp/B.13_9mzto/mr.xpi + typeset 'args=-qq' 'file=/tmp/B.13_9mzto/mr.xpi' + cp -p /tmp/B.13_9mzto/mr.xpi . + STATUS=0 + '[' 0 -ne 0 ']' + unpack -qq /tmp/B.13_9mzto/ms.xpi + typeset 'args=-qq' 'file=/tmp/B.13_9mzto/ms.xpi' + cp -p /tmp/B.13_9mzto/ms.xpi . + STATUS=0 + '[' 0 -ne 0 ']' + unpack -qq /tmp/B.13_9mzto/my.xpi + typeset 'args=-qq' 'file=/tmp/B.13_9mzto/my.xpi' + cp -p /tmp/B.13_9mzto/my.xpi . + STATUS=0 + '[' 0 -ne 0 ']' + unpack -qq /tmp/B.13_9mzto/nb-NO.xpi + typeset 'args=-qq' 'file=/tmp/B.13_9mzto/nb-NO.xpi' + cp -p /tmp/B.13_9mzto/nb-NO.xpi . + STATUS=0 + '[' 0 -ne 0 ']' + unpack -qq /tmp/B.13_9mzto/ne-NP.xpi + typeset 'args=-qq' 'file=/tmp/B.13_9mzto/ne-NP.xpi' + cp -p /tmp/B.13_9mzto/ne-NP.xpi . + STATUS=0 + '[' 0 -ne 0 ']' + unpack -qq /tmp/B.13_9mzto/nl.xpi + typeset 'args=-qq' 'file=/tmp/B.13_9mzto/nl.xpi' + cp -p /tmp/B.13_9mzto/nl.xpi . + STATUS=0 + '[' 0 -ne 0 ']' + unpack -qq /tmp/B.13_9mzto/nn-NO.xpi + typeset 'args=-qq' 'file=/tmp/B.13_9mzto/nn-NO.xpi' + cp -p /tmp/B.13_9mzto/nn-NO.xpi . + STATUS=0 + '[' 0 -ne 0 ']' + unpack -qq /tmp/B.13_9mzto/oc.xpi + typeset 'args=-qq' 'file=/tmp/B.13_9mzto/oc.xpi' + cp -p /tmp/B.13_9mzto/oc.xpi . + STATUS=0 + '[' 0 -ne 0 ']' + unpack -qq /tmp/B.13_9mzto/pa-IN.xpi + typeset 'args=-qq' 'file=/tmp/B.13_9mzto/pa-IN.xpi' + cp -p /tmp/B.13_9mzto/pa-IN.xpi . + STATUS=0 + '[' 0 -ne 0 ']' + unpack -qq /tmp/B.13_9mzto/pl.xpi + typeset 'args=-qq' 'file=/tmp/B.13_9mzto/pl.xpi' + cp -p /tmp/B.13_9mzto/pl.xpi . + STATUS=0 + '[' 0 -ne 0 ']' + unpack -qq /tmp/B.13_9mzto/pt-BR.xpi + typeset 'args=-qq' 'file=/tmp/B.13_9mzto/pt-BR.xpi' + cp -p /tmp/B.13_9mzto/pt-BR.xpi . + STATUS=0 + '[' 0 -ne 0 ']' + unpack -qq /tmp/B.13_9mzto/pt-PT.xpi + typeset 'args=-qq' 'file=/tmp/B.13_9mzto/pt-PT.xpi' + cp -p /tmp/B.13_9mzto/pt-PT.xpi . + STATUS=0 + '[' 0 -ne 0 ']' + unpack -qq /tmp/B.13_9mzto/rm.xpi + typeset 'args=-qq' 'file=/tmp/B.13_9mzto/rm.xpi' + cp -p /tmp/B.13_9mzto/rm.xpi . + STATUS=0 + '[' 0 -ne 0 ']' + unpack -qq /tmp/B.13_9mzto/ro.xpi + typeset 'args=-qq' 'file=/tmp/B.13_9mzto/ro.xpi' + cp -p /tmp/B.13_9mzto/ro.xpi . + STATUS=0 + '[' 0 -ne 0 ']' + unpack -qq /tmp/B.13_9mzto/ru.xpi + typeset 'args=-qq' 'file=/tmp/B.13_9mzto/ru.xpi' + cp -p /tmp/B.13_9mzto/ru.xpi . + STATUS=0 + '[' 0 -ne 0 ']' + unpack -qq /tmp/B.13_9mzto/sco.xpi + typeset 'args=-qq' 'file=/tmp/B.13_9mzto/sco.xpi' + cp -p /tmp/B.13_9mzto/sco.xpi . + STATUS=0 + '[' 0 -ne 0 ']' + unpack -qq /tmp/B.13_9mzto/si.xpi + typeset 'args=-qq' 'file=/tmp/B.13_9mzto/si.xpi' + cp -p /tmp/B.13_9mzto/si.xpi . + STATUS=0 + '[' 0 -ne 0 ']' + unpack -qq /tmp/B.13_9mzto/sk.xpi + typeset 'args=-qq' 'file=/tmp/B.13_9mzto/sk.xpi' + cp -p /tmp/B.13_9mzto/sk.xpi . + STATUS=0 + '[' 0 -ne 0 ']' + unpack -qq /tmp/B.13_9mzto/sl.xpi + typeset 'args=-qq' 'file=/tmp/B.13_9mzto/sl.xpi' + cp -p /tmp/B.13_9mzto/sl.xpi . + STATUS=0 + '[' 0 -ne 0 ']' + unpack -qq /tmp/B.13_9mzto/son.xpi + typeset 'args=-qq' 'file=/tmp/B.13_9mzto/son.xpi' + cp -p /tmp/B.13_9mzto/son.xpi . + STATUS=0 + '[' 0 -ne 0 ']' + unpack -qq /tmp/B.13_9mzto/sq.xpi + typeset 'args=-qq' 'file=/tmp/B.13_9mzto/sq.xpi' + cp -p /tmp/B.13_9mzto/sq.xpi . + STATUS=0 + '[' 0 -ne 0 ']' + unpack -qq /tmp/B.13_9mzto/sr.xpi + typeset 'args=-qq' 'file=/tmp/B.13_9mzto/sr.xpi' + cp -p /tmp/B.13_9mzto/sr.xpi . + STATUS=0 + '[' 0 -ne 0 ']' + unpack -qq /tmp/B.13_9mzto/sv-SE.xpi + typeset 'args=-qq' 'file=/tmp/B.13_9mzto/sv-SE.xpi' + cp -p /tmp/B.13_9mzto/sv-SE.xpi . + STATUS=0 + '[' 0 -ne 0 ']' + unpack -qq /tmp/B.13_9mzto/szl.xpi + typeset 'args=-qq' 'file=/tmp/B.13_9mzto/szl.xpi' + cp -p /tmp/B.13_9mzto/szl.xpi . + STATUS=0 + '[' 0 -ne 0 ']' + unpack -qq /tmp/B.13_9mzto/ta.xpi + typeset 'args=-qq' 'file=/tmp/B.13_9mzto/ta.xpi' + cp -p /tmp/B.13_9mzto/ta.xpi . + STATUS=0 + '[' 0 -ne 0 ']' + unpack -qq /tmp/B.13_9mzto/te.xpi + typeset 'args=-qq' 'file=/tmp/B.13_9mzto/te.xpi' + cp -p /tmp/B.13_9mzto/te.xpi . + STATUS=0 + '[' 0 -ne 0 ']' + unpack -qq /tmp/B.13_9mzto/th.xpi + typeset 'args=-qq' 'file=/tmp/B.13_9mzto/th.xpi' + cp -p /tmp/B.13_9mzto/th.xpi . + STATUS=0 + '[' 0 -ne 0 ']' + unpack -qq /tmp/B.13_9mzto/tl.xpi + typeset 'args=-qq' 'file=/tmp/B.13_9mzto/tl.xpi' + cp -p /tmp/B.13_9mzto/tl.xpi . + STATUS=0 + '[' 0 -ne 0 ']' + unpack -qq /tmp/B.13_9mzto/tr.xpi + typeset 'args=-qq' 'file=/tmp/B.13_9mzto/tr.xpi' + cp -p /tmp/B.13_9mzto/tr.xpi . + STATUS=0 + '[' 0 -ne 0 ']' + unpack -qq /tmp/B.13_9mzto/trs.xpi + typeset 'args=-qq' 'file=/tmp/B.13_9mzto/trs.xpi' + cp -p /tmp/B.13_9mzto/trs.xpi . + STATUS=0 + '[' 0 -ne 0 ']' + unpack -qq /tmp/B.13_9mzto/uk.xpi + typeset 'args=-qq' 'file=/tmp/B.13_9mzto/uk.xpi' + cp -p /tmp/B.13_9mzto/uk.xpi . + STATUS=0 + '[' 0 -ne 0 ']' + unpack -qq /tmp/B.13_9mzto/ur.xpi + typeset 'args=-qq' 'file=/tmp/B.13_9mzto/ur.xpi' + cp -p /tmp/B.13_9mzto/ur.xpi . + STATUS=0 + '[' 0 -ne 0 ']' + unpack -qq /tmp/B.13_9mzto/uz.xpi + typeset 'args=-qq' 'file=/tmp/B.13_9mzto/uz.xpi' + cp -p /tmp/B.13_9mzto/uz.xpi . + STATUS=0 + '[' 0 -ne 0 ']' + unpack -qq /tmp/B.13_9mzto/vi.xpi + typeset 'args=-qq' 'file=/tmp/B.13_9mzto/vi.xpi' + cp -p /tmp/B.13_9mzto/vi.xpi . + STATUS=0 + '[' 0 -ne 0 ']' + unpack -qq /tmp/B.13_9mzto/xh.xpi + typeset 'args=-qq' 'file=/tmp/B.13_9mzto/xh.xpi' + cp -p /tmp/B.13_9mzto/xh.xpi . + STATUS=0 + '[' 0 -ne 0 ']' + unpack -qq /tmp/B.13_9mzto/zh-CN.xpi + typeset 'args=-qq' 'file=/tmp/B.13_9mzto/zh-CN.xpi' + cp -p /tmp/B.13_9mzto/zh-CN.xpi . + STATUS=0 + '[' 0 -ne 0 ']' + unpack -qq /tmp/B.13_9mzto/zh-TW.xpi + typeset 'args=-qq' 'file=/tmp/B.13_9mzto/zh-TW.xpi' + cp -p /tmp/B.13_9mzto/zh-TW.xpi . + STATUS=0 + '[' 0 -ne 0 ']' + /bin/chmod -Rf a+rX,u+w,g-w,o-w . + echo 'Patch #4 (firefox-prefs.patch):' Patch #4 (firefox-prefs.patch): + </tmp/B.13_9mzto/firefox-prefs.patch + /usr/bin/patch -s -p1 '--fuzz=0' + echo 'Patch #5 (firefox-pld-bookmarks.patch):' Patch #5 (firefox-pld-bookmarks.patch): + </tmp/B.13_9mzto/firefox-pld-bookmarks.patch + /usr/bin/patch -s -p1 '--fuzz=0' + echo 'Patch #6 (firefox-no-subshell.patch):' Patch #6 (firefox-no-subshell.patch): + </tmp/B.13_9mzto/firefox-no-subshell.patch + /usr/bin/patch -s -p2 '--fuzz=0' + echo 'Patch #7 (firefox-middle_click_paste.patch):' Patch #7 (firefox-middle_click_paste.patch): + </tmp/B.13_9mzto/firefox-middle_click_paste.patch + /usr/bin/patch -s -p1 '--fuzz=0' + echo 'Patch #8 (firefox-system-virtualenv.patch):' Patch #8 (firefox-system-virtualenv.patch): + </tmp/B.13_9mzto/firefox-system-virtualenv.patch + /usr/bin/patch -s -p2 '--fuzz=0' + echo 'Patch #9 (firefox-Disable-Firefox-Health-Report.patch):' Patch #9 (firefox-Disable-Firefox-Health-Report.patch): + </tmp/B.13_9mzto/firefox-Disable-Firefox-Health-Report.patch + /usr/bin/patch -s -p1 '--fuzz=0' + RPM_EC=0 + jobs -p + exit 0 Executing(%build): /bin/sh -e /tmp/B.13_9mzto/BUILD/tmp/rpm-tmp.hGow1U TMP=/home/users/builder/tmp HOME=/home/users/builder PATH=/home/users/builder/GNUstep/Tools:/bin:/usr/bin:/usr/local/bin:/home/users/builder/bin TMPDIR=/tmp/B.13_9mzto/BUILD/tmp + umask 022 + cd /tmp/B.13_9mzto/BUILD + cd firefox-93.0 + cp -p /usr/share/automake/config.guess /usr/share/automake/config.sub build/autoconf + <<"EOF" . $topsrcdir/browser/config/mozconfig export CC="clang" export CXX="clang++" export LLVM_PROFDATA="llvm-profdata" export AR="llvm-ar" export NM="llvm-nm" export RANLIB="llvm-ranlib" export CFLAGS="-O2 -fwrapv -pipe -Wformat -Werror=format-security -Wp,-D_FORTIFY_SOURCE=2 -fstack-protector-strong --param=ssp-buffer-size=4 -Werror=trampolines -fomit-frame-pointer -march=i686 -fasynchronous-unwind-tables -mtune=pentium4 -D_FILE_OFFSET_BITS=64" export CXXFLAGS="-O2 -fwrapv -pipe -Wformat -Werror=format-security -Wp,-D_FORTIFY_SOURCE=2 -fstack-protector-strong --param=ssp-buffer-size=4 -Werror=trampolines -fomit-frame-pointer -march=i686 -fasynchronous-unwind-tables -mtune=pentium4 -mmmx -D_FILE_OFFSET_BITS=64" export CFLAGS="$CFLAGS -g0" export CXXFLAGS="$CXXFLAGS -g0" export MOZ_DEBUG_FLAGS=" " export LLVM_USE_SPLIT_DWARF=1 export LLVM_PARALLEL_LINK_JOBS=1 export MOZ_LINK_FLAGS="-Wl,--no-keep-memory -Wl,--reduce-memory-overheads" export RUSTFLAGS="-Cdebuginfo=0" mk_add_options MOZ_OBJDIR=@TOPSRCDIR@/obj-i686 # Options for 'configure' (same as command-line options). ac_add_options --host=i686-pld-linux ac_add_options --prefix=/usr ac_add_options --disable-debug ac_add_options --disable-strip ac_add_options --disable-install-strip ac_add_options --disable-tests ac_add_options --disable-crashreporter ac_add_options --disable-necko-wifi ac_add_options --disable-updater ac_add_options --enable-alsa ac_add_options --enable-chrome-format=omni ac_add_options --enable-default-toolkit=cairo-gtk3-wayland ac_add_options --enable-extensions=default ac_add_options --enable-geckodriver ac_add_options --enable-linker=gold ac_add_options --disable-elf-hack ac_add_options --enable-linker=lld ac_add_options --enable-system-ffi ac_add_options --enable-official-branding ac_add_options --with-distribution-id=org.pld-linux ac_add_options --with-system-icu ac_add_options --with-system-jpeg ac_add_options --with-system-libevent ac_add_options --with-system-libvpx ac_add_options --with-system-nspr ac_add_options --with-system-nss ac_add_options --with-system-pixman ac_add_options --with-system-png ac_add_options --with-system-webp ac_add_options --with-system-zlib # Workaround for mozbz#1341234 ac_add_options BINDGEN_CFLAGS="$(pkg-config nspr pixman-1 --cflags)" EOF + >.mozconfig + cat + export 'MOZ_PARALLEL_BUILD=4' + export 'MOZ_SERVICES_SYNC=1' + AUTOCONF=/usr/bin/autoconf2_13 MACH_USE_SYSTEM_PYTHON=1 ./mach build Mach and the build system store shared state in a common directory on the filesystem. The following directory will be created: /home/users/builder/.mozbuild If you would like to use a different directory, hit CTRL+c, set the MOZBUILD_STATE_PATH environment variable to the directory you'd like to use, and run Mach again. Press ENTER/RETURN to continue or CTRL+c to abort. Creating default state directory: /home/users/builder/.mozbuild 0:00.95 Clobber not needed. 0:00.96 /usr/bin/python3 /tmp/B.13_9mzto/BUILD/firefox-93.0/configure.py 0:01.19 Creating Python 3 environment 0:01.65 Using base prefix '/usr' 0:01.67 New python executable in /tmp/B.13_9mzto/BUILD/firefox-93.0/obj-i686/_virtualenvs/common/bin/python3 0:01.67 Also creating executable in /tmp/B.13_9mzto/BUILD/firefox-93.0/obj-i686/_virtualenvs/common/bin/python 0:05.72 Installing setuptools, pip, wheel...done. 0:07.36 Re-executing in the virtualenv 0:07.69 Adding configure options from /tmp/B.13_9mzto/BUILD/firefox-93.0/.mozconfig 0:07.69 --enable-application=browser 0:07.69 --host=i686-pld-linux 0:07.69 --prefix=/usr 0:07.69 --disable-debug 0:07.69 --disable-strip 0:07.69 --disable-install-strip 0:07.69 --disable-tests 0:07.69 --disable-crashreporter 0:07.69 --disable-necko-wifi 0:07.69 --disable-updater 0:07.69 --enable-alsa 0:07.69 --enable-chrome-format=omni 0:07.69 --enable-default-toolkit=cairo-gtk3-wayland 0:07.69 --enable-extensions=default 0:07.69 --enable-geckodriver 0:07.69 --enable-linker=gold 0:07.69 --disable-elf-hack 0:07.69 --enable-linker=lld 0:07.69 --enable-system-ffi 0:07.69 --enable-official-branding 0:07.69 --with-distribution-id=org.pld-linux 0:07.69 --with-system-icu 0:07.69 --with-system-jpeg 0:07.69 --with-system-libevent 0:07.69 --with-system-libvpx 0:07.69 --with-system-nspr 0:07.69 --with-system-nss 0:07.69 --with-system-pixman 0:07.69 --with-system-png 0:07.69 --with-system-webp 0:07.69 --with-system-zlib 0:07.69 BINDGEN_CFLAGS=-I/usr/include/nspr -I/usr/include/pixman-1 0:07.69 CXXFLAGS=-O2 -fwrapv -pipe -Wformat -Werror=format-security -Wp,-D_FORTIFY_SOURCE=2 -fstack-protector-strong --param=ssp-buffer-size=4 -Werror=trampolines -fomit-frame-pointer -march=i686 -fasynchronous-unwind-tables -mtune=pentium4 -mmmx -D_FILE_OFFSET_BITS=64 -g0 0:07.69 CFLAGS=-O2 -fwrapv -pipe -Wformat -Werror=format-security -Wp,-D_FORTIFY_SOURCE=2 -fstack-protector-strong --param=ssp-buffer-size=4 -Werror=trampolines -fomit-frame-pointer -march=i686 -fasynchronous-unwind-tables -mtune=pentium4 -D_FILE_OFFSET_BITS=64 -g0 0:07.69 CXX=clang++ 0:07.69 LLVM_PARALLEL_LINK_JOBS=1 0:07.69 AR=llvm-ar 0:07.69 RUSTFLAGS=-Cdebuginfo=0 0:07.69 CC=clang 0:07.69 MOZ_LINK_FLAGS=-Wl,--no-keep-memory -Wl,--reduce-memory-overheads 0:07.69 LLVM_PROFDATA=llvm-profdata 0:07.69 RANLIB=llvm-ranlib 0:07.69 LLVM_USE_SPLIT_DWARF=1 0:07.69 MOZ_DEBUG_FLAGS= 0:07.69 NM=llvm-nm 0:07.69 EPOCHREALTIME=1633466394.109571 0:07.69 RANDOM=4093 0:07.69 checking for vcs source checkout... no 0:07.77 checking for a shell... /bin/sh 0:07.78 checking for host system type... i686-pld-linux-gnu 0:07.78 checking for target system type... i686-pld-linux-gnu 0:08.48 checking whether cross compiling... no 0:08.68 checking for Python 3... /tmp/B.13_9mzto/BUILD/firefox-93.0/obj-i686/_virtualenvs/common/bin/python (3.9.7) 0:08.71 checking for wget... /usr/bin/wget 0:08.72 checking for ccache... not found 0:08.72 checking for the target C compiler... /usr/bin/clang 0:08.81 checking whether the target C compiler can be used... yes 0:08.81 checking the target C compiler version... 12.0.1 0:08.85 checking the target C compiler works... yes 0:08.85 checking for the target C++ compiler... /usr/bin/clang++ 0:08.94 checking whether the target C++ compiler can be used... yes 0:08.94 checking the target C++ compiler version... 12.0.1 0:08.98 checking the target C++ compiler works... yes 0:08.98 checking for the host C compiler... /usr/bin/clang 0:09.06 checking whether the host C compiler can be used... yes 0:09.06 checking the host C compiler version... 12.0.1 0:09.11 checking the host C compiler works... yes 0:09.11 checking for the host C++ compiler... /usr/bin/clang++ 0:09.19 checking whether the host C++ compiler can be used... yes 0:09.19 checking the host C++ compiler version... 12.0.1 0:09.24 checking the host C++ compiler works... yes 0:09.28 checking for 64-bit OS... no 0:09.33 checking for new enough STL headers from libstdc++... yes 0:09.39 checking for linker... lld 0:09.39 checking for the assembler... /usr/bin/clang 0:09.43 checking for ar... /usr/bin/llvm-ar 0:09.46 checking for nm... /usr/bin/llvm-nm 0:09.46 checking for pkg_config... /usr/bin/pkg-config 0:09.47 checking for pkg-config version... 0.29.2 0:09.52 checking for stdint.h... yes 0:09.57 checking for inttypes.h... yes 0:09.63 checking for malloc.h... yes 0:09.67 checking for alloca.h... yes 0:09.71 checking for sys/byteorder.h... no 0:09.76 checking for getopt.h... yes 0:09.81 checking for unistd.h... yes 0:09.86 checking for nl_types.h... yes 0:09.91 checking for cpuid.h... yes 0:09.96 checking for fts.h... yes 0:10.00 checking for sys/statvfs.h... yes 0:10.05 checking for sys/statfs.h... yes 0:10.10 checking for sys/vfs.h... yes 0:10.15 checking for sys/mount.h... yes 0:10.20 checking for sys/quota.h... yes 0:10.26 checking for linux/quota.h... yes 0:10.32 checking for linux/if_addr.h... yes 0:10.38 checking for linux/rtnetlink.h... yes 0:10.43 checking for sys/queue.h... yes 0:10.48 checking for sys/types.h... yes 0:10.54 checking for netinet/in.h... yes 0:10.59 checking for byteswap.h... yes 0:10.64 checking for memfd_create in sys/mman.h... yes 0:10.69 checking for linux/perf_event.h... yes 0:10.74 checking for perf_event_open system call... yes 0:10.78 checking whether the C compiler supports -Wbitfield-enum-conversion... yes 0:10.82 checking whether the C++ compiler supports -Wbitfield-enum-conversion... yes 0:10.87 checking whether the C++ compiler supports -Wdeprecated-this-capture... yes 0:10.91 checking whether the C compiler supports -Wformat-type-confusion... yes 0:10.95 checking whether the C++ compiler supports -Wformat-type-confusion... yes 0:11.00 checking whether the C compiler supports -Wshadow-field-in-constructor-modified... yes 0:11.04 checking whether the C++ compiler supports -Wshadow-field-in-constructor-modified... yes 0:11.08 checking whether the C++ compiler supports -Wshadow-uncaptured-local... yes 0:11.13 checking whether the C compiler supports -Wno-error=tautological-type-limit-compare... yes 0:11.17 checking whether the C++ compiler supports -Wno-error=tautological-type-limit-compare... yes 0:11.21 checking whether the C compiler supports -Wunreachable-code-return... yes 0:11.25 checking whether the C++ compiler supports -Wunreachable-code-return... yes 0:11.30 checking whether the C compiler supports -Wclass-varargs... yes 0:11.34 checking whether the C++ compiler supports -Wclass-varargs... yes 0:11.38 checking whether the C++ compiler supports -Wempty-init-stmt... yes 0:11.43 checking whether the C compiler supports -Wfloat-overflow-conversion... yes 0:11.47 checking whether the C++ compiler supports -Wfloat-overflow-conversion... yes 0:11.51 checking whether the C compiler supports -Wfloat-zero-conversion... yes 0:11.56 checking whether the C++ compiler supports -Wfloat-zero-conversion... yes 0:11.60 checking whether the C compiler supports -Wloop-analysis... yes 0:11.64 checking whether the C++ compiler supports -Wloop-analysis... yes 0:11.68 checking whether the C compiler supports -Wno-range-loop-analysis... yes 0:11.73 checking whether the C++ compiler supports -Wno-range-loop-analysis... yes 0:11.77 checking whether the C++ compiler supports -Wc++2a-compat... yes 0:11.81 checking whether the C++ compiler supports -Wcomma... yes 0:11.85 checking whether the C compiler supports -Wduplicated-cond... no 0:11.88 checking whether the C++ compiler supports -Wduplicated-cond... no 0:11.93 checking whether the C compiler supports -Wenum-compare-conditional... yes 0:11.97 checking whether the C++ compiler supports -Wenum-compare-conditional... yes 0:12.01 checking whether the C++ compiler supports -Wimplicit-fallthrough... yes 0:12.06 checking whether the C compiler supports -Wstring-conversion... yes 0:12.10 checking whether the C++ compiler supports -Wstring-conversion... yes 0:12.14 checking whether the C++ compiler supports -Wno-inline-new-delete... yes 0:12.18 checking whether the C compiler supports -Wno-error=maybe-uninitialized... no 0:12.22 checking whether the C++ compiler supports -Wno-error=maybe-uninitialized... no 0:12.26 checking whether the C compiler supports -Wno-error=deprecated-declarations... yes 0:12.30 checking whether the C++ compiler supports -Wno-error=deprecated-declarations... yes 0:12.34 checking whether the C compiler supports -Wno-error=array-bounds... yes 0:12.39 checking whether the C++ compiler supports -Wno-error=array-bounds... yes 0:12.42 checking whether the C compiler supports -Wno-error=coverage-mismatch... no 0:12.46 checking whether the C++ compiler supports -Wno-error=coverage-mismatch... no 0:12.50 checking whether the C compiler supports -Wno-error=backend-plugin... yes 0:12.55 checking whether the C++ compiler supports -Wno-error=backend-plugin... yes 0:12.59 checking whether the C compiler supports -Wno-error=free-nonheap-object... yes 0:12.63 checking whether the C++ compiler supports -Wno-error=free-nonheap-object... yes 0:12.67 checking whether the C compiler supports -Wno-multistatement-macros... no 0:12.71 checking whether the C++ compiler supports -Wno-multistatement-macros... no 0:12.75 checking whether the C compiler supports -Wno-error=return-std-move... yes 0:12.79 checking whether the C++ compiler supports -Wno-error=return-std-move... yes 0:12.83 checking whether the C compiler supports -Wno-error=class-memaccess... no 0:12.86 checking whether the C++ compiler supports -Wno-error=class-memaccess... no 0:12.91 checking whether the C compiler supports -Wno-error=atomic-alignment... yes 0:12.95 checking whether the C++ compiler supports -Wno-error=atomic-alignment... yes 0:12.99 checking whether the C compiler supports -Wno-error=deprecated-copy... yes 0:13.04 checking whether the C++ compiler supports -Wno-error=deprecated-copy... yes 0:13.07 checking whether the C compiler supports -Wno-error=unused-but-set-variable... no 0:13.11 checking whether the C++ compiler supports -Wno-error=unused-but-set-variable... no 0:13.15 checking whether the C compiler supports -Wformat... yes 0:13.20 checking whether the C++ compiler supports -Wformat... yes 0:13.24 checking whether the C compiler supports -Wformat-security... yes 0:13.28 checking whether the C++ compiler supports -Wformat-security... yes 0:13.32 checking whether the C compiler supports -Wformat-overflow=2... no 0:13.36 checking whether the C++ compiler supports -Wformat-overflow=2... no 0:13.41 checking whether the C compiler supports -Wno-gnu-zero-variadic-macro-arguments... yes 0:13.45 checking whether the C++ compiler supports -Wno-gnu-zero-variadic-macro-arguments... yes 0:13.49 checking whether the C compiler supports -Werror=implicit-function-declaration... yes 0:13.54 checking whether the C compiler supports -Wno-psabi... yes 0:13.58 checking whether the C++ compiler supports -Wno-psabi... yes 0:13.63 checking whether the C++ compiler supports -fno-sized-deallocation... yes 0:13.67 checking whether the C++ compiler supports -fno-aligned-new... yes 0:13.67 checking for llvm_profdata... /usr/bin/llvm-profdata 0:13.70 checking for alsa... yes 0:13.70 checking MOZ_ALSA_CFLAGS... 0:13.71 checking MOZ_ALSA_LIBS... -lasound 0:13.71 checking for libpulse... yes 0:13.72 checking MOZ_PULSEAUDIO_CFLAGS... -D_REENTRANT 0:13.72 checking MOZ_PULSEAUDIO_LIBS... -lpulse -pthread 0:13.73 checking for nspr >= 4.32... yes 0:13.73 checking NSPR_CFLAGS... -I/usr/include/nspr 0:13.74 checking NSPR_LIBS... -lplds4 -lplc4 -lnspr4 0:13.74 checking for rustc... /usr/bin/rustc 0:13.74 checking for cargo... /usr/bin/cargo 0:13.95 checking rustc version... 1.55.0 0:13.96 checking cargo version... 1.55.0 0:14.10 checking for rust host triplet... i686-unknown-linux-gnu 0:14.19 checking for rust target triplet... i686-unknown-linux-gnu 0:14.19 checking for rustdoc... /usr/bin/rustdoc 0:14.20 checking for cbindgen... /usr/bin/cbindgen 0:14.20 checking for rustfmt... /usr/bin/rustfmt 0:14.20 checking for clang for bindgen... /usr/bin/clang++ 0:14.23 checking for libclang for bindgen... /usr/lib/libclang.so 0:14.26 checking that libclang is new enough... yes 0:14.26 checking bindgen cflags... -x c++ -fno-sized-deallocation -fno-aligned-new -DTRACING=1 -DIMPL_LIBXUL -DMOZILLA_INTERNAL_API -DRUST_BINDGEN -DOS_POSIX=1 -DOS_LINUX=1 -std=gnu++17 -I/usr/include/nspr -I/usr/include/pixman-1 0:14.27 checking for libffi > 3.0.9... yes 0:14.28 checking MOZ_FFI_CFLAGS... 0:14.28 checking MOZ_FFI_LIBS... -lffi 0:14.29 checking for icu-i18n >= 69.1... yes 0:14.29 checking MOZ_ICU_CFLAGS... 0:14.30 checking MOZ_ICU_LIBS... -licui18n -licuuc -licudata 0:14.33 checking for nodejs... /usr/bin/node (16.10.0) 0:14.34 checking for gtk+-wayland-3.0 >= 3.14 xkbcommon >= 0.4.1 libdrm >= 2.4... yes 0:14.35 checking MOZ_WAYLAND_CFLAGS... -pthread -I/usr/include/gtk-3.0 -I/usr/include/at-spi2-atk/2.0 -I/usr/include/at-spi-2.0 -I/usr/include/dbus-1.0 -I/usr/lib/dbus-1.0/include -I/usr/include/gtk-3.0 -I/usr/include/gio-unix-2.0 -I/usr/include/cairo -I/usr/include/pango-1.0 -I/usr/include/harfbuzz -I/usr/include/pango-1.0 -I/usr/include/fribidi -I/usr/include/atk-1.0 -I/usr/include/cairo -I/usr/include/pixman-1 -I/usr/include/uuid -I/usr/include/freetype2 -I/usr/include/harfbuzz -I/usr/include/libpng16 -I/usr/include/gdk-pixbuf-2.0 -I/usr/include/libpng16 -I/usr/include/libmount -I/usr/include/blkid -I/usr/include/glib-2.0 -I/usr/lib/glib-2.0/include -I/usr/include/libdrm 0:14.36 checking MOZ_WAYLAND_LIBS... -lgtk-3 -lgdk-3 -lpangocairo-1.0 -lpango-1.0 -lharfbuzz -latk-1.0 -lcairo-gobject -lcairo -lgdk_pixbuf-2.0 -lgio-2.0 -lgobject-2.0 -lglib-2.0 -lxkbcommon -ldrm 0:14.37 checking for pango >= 1.22.0... yes 0:14.37 checking MOZ_PANGO_CFLAGS... -pthread -I/usr/include/pango-1.0 -I/usr/include/libmount -I/usr/include/blkid -I/usr/include/fribidi -I/usr/include/cairo -I/usr/include/pixman-1 -I/usr/include/uuid -I/usr/include/harfbuzz -I/usr/include/glib-2.0 -I/usr/lib/glib-2.0/include -I/usr/include/freetype2 -I/usr/include/libpng16 0:14.38 checking MOZ_PANGO_LIBS... -lpango-1.0 -lgobject-2.0 -lglib-2.0 -lharfbuzz 0:14.39 checking for fontconfig >= 2.7.0... yes 0:14.39 checking _FONTCONFIG_CFLAGS... -I/usr/include/uuid -I/usr/include/freetype2 -I/usr/include/libpng16 -I/usr/include/harfbuzz -I/usr/include/glib-2.0 -I/usr/lib/glib-2.0/include 0:14.40 checking _FONTCONFIG_LIBS... -lfontconfig -lfreetype 0:14.40 checking for freetype2 >= 6.1.0... yes 0:14.41 checking _FT2_CFLAGS... -I/usr/include/freetype2 -I/usr/include/libpng16 -I/usr/include/harfbuzz -I/usr/include/glib-2.0 -I/usr/lib/glib-2.0/include 0:14.41 checking _FT2_LIBS... -lfreetype 0:14.42 checking for tar... /usr/bin/gtar 0:14.42 checking for unzip... /usr/bin/unzip 0:14.42 checking for zip... /usr/bin/zip 0:14.42 checking for gn... not found 0:14.42 checking for the Mozilla API key... no 0:14.42 checking for the Google Location Service API key... no 0:14.42 checking for the Google Safebrowsing API key... no 0:14.42 checking for the Bing API key... no 0:14.42 checking for the Adjust SDK key... no 0:14.42 checking for the Leanplum SDK key... no 0:14.42 checking for the Pocket API key... no 0:14.43 checking for libwebp >= 1.0.2 libwebpdemux >= 1.0.2... yes 0:14.43 checking MOZ_WEBP_CFLAGS... 0:14.44 checking MOZ_WEBP_LIBS... -lwebpdemux -lwebp 0:14.44 checking for x11 xcb xcb-shm x11-xcb xext xrender xcomposite xcursor xdamage xfixes xi... yes 0:14.45 checking MOZ_X11_CFLAGS... 0:14.46 checking MOZ_X11_LIBS... -lxcb-shm -lX11-xcb -lxcb -lXext -lXrender -lX11 -lXcomposite -lXcursor -lXdamage -lXfixes -lXi 0:14.47 checking for vpx >= 1.8.0... yes 0:14.47 checking MOZ_LIBVPX_CFLAGS... 0:14.48 checking MOZ_LIBVPX_LIBS... -lvpx -lm 0:14.53 checking for vpx/vpx_decoder.h... yes 0:14.63 checking for vpx_codec_dec_init_ver... yes 0:14.72 checking for jpeg_destroy_compress... yes 0:14.78 checking for sufficient jpeg library version... yes 0:14.84 checking for sufficient libjpeg-turbo JCS_EXTENSIONS... yes 0:14.84 checking for nasm... /usr/bin/nasm 0:14.85 checking nasm version... 2.15.05 0:14.85 checking for dump_syms... not found 0:14.95 checking for getcontext... yes 0:14.95 checking for nss >= 3.70... yes 0:14.96 checking NSS_CFLAGS... -I/usr/include/nss -I/usr/include/nspr 0:14.97 checking NSS_LIBS... -lnss3 -lnssutil3 -lsmime3 -lssl3 -lsoftokn3 -lplds4 -lplc4 -lnspr4 0:14.97 checking for awk... /usr/bin/gawk 0:14.97 checking for perl... /usr/bin/perl 0:14.98 checking for minimum required perl version >= 5.006... 5.032001 0:14.99 checking for full perl installation... yes 0:14.99 checking for gmake... /usr/bin/gmake 0:14.99 checking for watchman... not found 0:14.99 checking for xargs... /bin/xargs 0:14.99 checking for rpmbuild... /usr/bin/rpmbuild 0:14.99 checking for NSIS version... no 0:15.02 checking for llvm-objdump... /usr/bin/llvm-objdump 0:15.03 checking for zlib >= 1.2.3... yes 0:15.03 checking MOZ_ZLIB_CFLAGS... 0:15.03 checking MOZ_ZLIB_LIBS... -lz 0:15.04 checking for m4... /usr/bin/m4 0:15.13 creating cache ./config.cache 0:15.16 checking host system type... i686-pld-linux-gnu 0:15.17 checking target system type... i686-pld-linux-gnu 0:15.18 checking build system type... i686-pld-linux-gnu 0:15.18 checking for objcopy... /usr/bin/objcopy 0:15.23 checking for Cygwin environment... no 0:15.27 checking for mingw32 environment... no 0:15.38 checking for executable suffix... no 0:15.38 checking for gcc... (cached) /usr/bin/clang -std=gnu99 0:15.38 checking whether the C compiler (/usr/bin/clang -std=gnu99 -O2 -fwrapv -pipe -Wformat -Werror=format-security -Wp,-D_FORTIFY_SOURCE=2 -fstack-protector-strong --param=ssp-buffer-size=4 -Werror=trampolines -fomit-frame-pointer -march=i686 -fasynchronous-unwind-tables -mtune=pentium4 -D_FILE_OFFSET_BITS=64 -g0 -fuse-ld=lld) works... (cached) yes 0:15.38 checking whether the C compiler (/usr/bin/clang -std=gnu99 -O2 -fwrapv -pipe -Wformat -Werror=format-security -Wp,-D_FORTIFY_SOURCE=2 -fstack-protector-strong --param=ssp-buffer-size=4 -Werror=trampolines -fomit-frame-pointer -march=i686 -fasynchronous-unwind-tables -mtune=pentium4 -D_FILE_OFFSET_BITS=64 -g0 -fuse-ld=lld) is a cross-compiler... no 0:15.38 checking whether we are using GNU C... (cached) yes 0:15.38 checking whether /usr/bin/clang -std=gnu99 accepts -g... (cached) yes 0:15.38 checking for c++... (cached) /usr/bin/clang++ -std=gnu++17 0:15.38 checking whether the C++ compiler (/usr/bin/clang++ -std=gnu++17 -O2 -fwrapv -pipe -Wformat -Werror=format-security -Wp,-D_FORTIFY_SOURCE=2 -fstack-protector-strong --param=ssp-buffer-size=4 -Werror=trampolines -fomit-frame-pointer -march=i686 -fasynchronous-unwind-tables -mtune=pentium4 -mmmx -D_FILE_OFFSET_BITS=64 -g0 -fuse-ld=lld) works... (cached) yes 0:15.38 checking whether the C++ compiler (/usr/bin/clang++ -std=gnu++17 -O2 -fwrapv -pipe -Wformat -Werror=format-security -Wp,-D_FORTIFY_SOURCE=2 -fstack-protector-strong --param=ssp-buffer-size=4 -Werror=trampolines -fomit-frame-pointer -march=i686 -fasynchronous-unwind-tables -mtune=pentium4 -mmmx -D_FILE_OFFSET_BITS=64 -g0 -fuse-ld=lld) is a cross-compiler... no 0:15.39 checking whether we are using GNU C++... (cached) yes 0:15.39 checking whether /usr/bin/clang++ -std=gnu++17 accepts -g... (cached) yes 0:15.39 checking for /usr/bin/clang... (cached) /usr/bin/clang -std=gnu99 0:15.39 checking for strip... strip 0:15.39 checking for otool... no 0:15.55 checking for --noexecstack option to as... yes 0:15.66 checking for -z noexecstack option to ld... yes 0:15.76 checking for -z text option to ld... yes 0:15.87 checking for -z relro option to ld... yes 0:15.98 checking for -z nocopyreloc option to ld... yes 0:16.09 checking for -Bsymbolic-functions option to ld... yes 0:16.20 checking for --build-id=sha1 option to ld... yes 0:16.30 checking for --ignore-unresolved-symbol option to ld... no 0:16.35 checking if toolchain supports -mssse3 option... yes 0:16.40 checking if toolchain supports -msse4.1 option... yes 0:16.45 checking for x86 AVX2 asm support in compiler... yes 0:16.57 checking whether the linker supports Identical Code Folding... no 0:16.91 checking whether removing dead symbols breaks debugging... yes 0:16.96 checking for working const... yes 0:17.00 checking for mode_t... yes 0:17.04 checking for off_t... yes 0:17.09 checking for pid_t... yes 0:17.13 checking for size_t... yes 0:17.13 checking whether 64-bits std::atomic requires -latomic... yes 0:17.19 checking for dirent.h that defines DIR... yes 0:17.30 checking for opendir in -ldir... no 0:17.36 checking for sockaddr_in.sin_len... false 0:17.41 checking for sockaddr_in6.sin6_len... false 0:17.47 checking for sockaddr.sa_len... false 0:17.57 checking for gethostbyname_r in -lc_r... no 0:17.69 checking for library containing dlopen... none required 0:17.75 checking for dlfcn.h... yes 0:17.86 checking for dladdr... yes 0:17.97 checking for memmem... yes 0:18.08 checking for socket in -lsocket... no 0:18.19 checking for pthread_create in -lpthreads... no 0:18.31 checking for pthread_create in -lpthread... yes 0:18.40 checking whether /usr/bin/clang -std=gnu99 accepts -pthread... yes 0:18.47 checking for pthread.h... yes 0:18.58 checking for stat64... yes 0:18.70 checking for lstat64... yes 0:18.82 checking for truncate64... yes 0:18.93 checking for statvfs64... yes 0:19.05 checking for statvfs... yes 0:19.17 checking for statfs64... yes 0:19.29 checking for statfs... yes 0:19.40 checking for getpagesize... yes 0:19.52 checking for gmtime_r... yes 0:19.64 checking for localtime_r... yes 0:19.76 checking for arc4random... no 0:20.26 checking for arc4random_buf... no 0:20.38 checking for mallinfo... yes 0:20.50 checking for gettid... yes 0:20.61 checking for lchown... yes 0:20.73 checking for setpriority... yes 0:20.85 checking for strerror... yes 0:20.96 checking for syscall... yes 0:21.09 checking for lutimes... yes 0:21.28 checking for clock_gettime(CLOCK_MONOTONIC)... 0:21.35 checking for pthread_cond_timedwait_monotonic_np... 0:21.49 checking for res_ninit()... yes 0:21.57 checking for an implementation of va_copy()... yes 0:21.64 checking whether va_list can be copied by value... yes 0:21.77 checking for __thread keyword for TLS variables... yes 0:21.88 checking for localeconv... yes 0:21.96 checking for malloc.h... yes 0:22.07 checking for strndup... yes 0:22.18 checking for posix_memalign... yes 0:22.30 checking for memalign... yes 0:22.42 checking for malloc_usable_size... yes 0:22.48 checking whether malloc_usable_size definition can use const argument... no 0:22.52 checking for valloc in malloc.h... yes 0:22.56 checking for valloc in unistd.h... no 0:22.60 checking for _aligned_malloc in malloc.h... no 0:22.61 checking for libevent... yes 0:22.61 checking MOZ_LIBEVENT_CFLAGS... 0:22.61 checking MOZ_LIBEVENT_LIBS... -levent 0:22.73 checking for png_get_valid in -lpng... yes 0:22.84 checking for png_get_acTL in -lpng... yes 0:22.93 checking if app-specific confvars.sh exists... /tmp/B.13_9mzto/BUILD/firefox-93.0/browser/confvars.sh 0:22.94 checking for gtk+-3.0 >= 3.14.0 gtk+-unix-print-3.0 glib-2.0 gobject-2.0 gio-unix-2.0 ... yes 0:22.95 checking MOZ_GTK3_CFLAGS... -pthread -I/usr/include/gtk-3.0/unix-print -I/usr/include/gtk-3.0 -I/usr/include/at-spi2-atk/2.0 -I/usr/include/at-spi-2.0 -I/usr/include/dbus-1.0 -I/usr/lib/dbus-1.0/include -I/usr/include/gtk-3.0 -I/usr/include/cairo -I/usr/include/libdrm -I/usr/include/pango-1.0 -I/usr/include/harfbuzz -I/usr/include/pango-1.0 -I/usr/include/fribidi -I/usr/include/atk-1.0 -I/usr/include/cairo -I/usr/include/pixman-1 -I/usr/include/uuid -I/usr/include/freetype2 -I/usr/include/harfbuzz -I/usr/include/libpng16 -I/usr/include/gdk-pixbuf-2.0 -I/usr/include/libpng16 -I/usr/include/gio-unix-2.0 -I/usr/include/libmount -I/usr/include/blkid -I/usr/include/glib-2.0 -I/usr/lib/glib-2.0/include 0:22.95 checking MOZ_GTK3_LIBS... -lgtk-3 -lgdk-3 -lpangocairo-1.0 -lpango-1.0 -lharfbuzz -latk-1.0 -lcairo-gobject -lcairo -lgdk_pixbuf-2.0 -lgio-2.0 -lgobject-2.0 -lglib-2.0 0:22.96 checking for dbus-1 >= 0.60... yes 0:22.96 checking MOZ_DBUS_CFLAGS... -I/usr/include/dbus-1.0 -I/usr/lib/dbus-1.0/include 0:22.96 checking MOZ_DBUS_LIBS... -ldbus-1 0:22.96 checking for dbus-glib-1 >= 0.60... yes 0:22.97 checking MOZ_DBUS_GLIB_CFLAGS... -I/usr/include/dbus-1.0 -I/usr/lib/dbus-1.0/include -I/usr/include/glib-2.0 -I/usr/lib/glib-2.0/include 0:22.97 checking MOZ_DBUS_GLIB_LIBS... -ldbus-glib-1 -ldbus-1 -lgobject-2.0 -lglib-2.0 0:23.10 checking for linux/joystick.h... yes 0:23.21 checking for fdatasync... yes 0:23.28 checking for valid C compiler optimization flags... yes 0:23.41 checking for __cxa_demangle... yes 0:23.47 checking for unwind.h... yes 0:23.59 checking for _Unwind_Backtrace... yes 0:23.60 checking for -pipe support... yes 0:23.71 checking what kind of list files are supported by the linker... linkerscript 0:23.71 checking for glib-2.0 >= 1.3.7 gobject-2.0... yes 0:23.72 checking GLIB_CFLAGS... -I/usr/include/glib-2.0 -I/usr/lib/glib-2.0/include 0:23.72 checking GLIB_LIBS... -lgobject-2.0 -lglib-2.0 0:23.82 checking for FT_Bitmap_Size.y_ppem... yes 0:23.93 checking for FT_GlyphSlot_Embolden... yes 0:24.05 checking for FT_Load_Sfnt_Table... yes 0:24.16 checking for fontconfig/fcfreetype.h... yes 0:24.17 checking for pixman-1 >= 0.36.0... yes 0:24.17 checking MOZ_PIXMAN_CFLAGS... -I/usr/include/pixman-1 0:24.17 checking MOZ_PIXMAN_LIBS... -lpixman-1 0:24.30 checking for posix_fadvise... yes 0:24.42 checking for posix_fallocate... yes 0:24.44 updating cache ./config.cache 0:24.44 creating ./config.data 0:24.45 js/src> Refreshing /tmp/B.13_9mzto/BUILD/firefox-93.0/js/src/old-configure with /tmp/B.13_9mzto/BUILD/firefox-93.0/build/autoconf/autoconf.sh 0:24.56 js/src> loading cache ./config.cache 0:24.59 js/src> checking host system type... i686-pld-linux-gnu 0:24.60 js/src> checking target system type... i686-pld-linux-gnu 0:24.61 js/src> checking build system type... i686-pld-linux-gnu 0:24.62 js/src> checking for Cygwin environment... (cached) no 0:24.62 js/src> checking for mingw32 environment... (cached) no 0:24.62 js/src> checking for executable suffix... (cached) no 0:24.62 js/src> checking for gcc... (cached) /usr/bin/clang -std=gnu99 0:24.62 js/src> checking whether the C compiler (/usr/bin/clang -std=gnu99 -O2 -fwrapv -pipe -Wformat -Werror=format-security -Wp,-D_FORTIFY_SOURCE=2 -fstack-protector-strong --param=ssp-buffer-size=4 -Werror=trampolines -fomit-frame-pointer -march=i686 -fasynchronous-unwind-tables -mtune=pentium4 -D_FILE_OFFSET_BITS=64 -g0 -fuse-ld=lld) works... (cached) yes 0:24.62 js/src> checking whether the C compiler (/usr/bin/clang -std=gnu99 -O2 -fwrapv -pipe -Wformat -Werror=format-security -Wp,-D_FORTIFY_SOURCE=2 -fstack-protector-strong --param=ssp-buffer-size=4 -Werror=trampolines -fomit-frame-pointer -march=i686 -fasynchronous-unwind-tables -mtune=pentium4 -D_FILE_OFFSET_BITS=64 -g0 -fuse-ld=lld) is a cross-compiler... no 0:24.62 js/src> checking whether we are using GNU C... (cached) yes 0:24.62 js/src> checking whether /usr/bin/clang -std=gnu99 accepts -g... (cached) yes 0:24.62 js/src> checking for c++... (cached) /usr/bin/clang++ -std=gnu++17 0:24.62 js/src> checking whether the C++ compiler (/usr/bin/clang++ -std=gnu++17 -O2 -fwrapv -pipe -Wformat -Werror=format-security -Wp,-D_FORTIFY_SOURCE=2 -fstack-protector-strong --param=ssp-buffer-size=4 -Werror=trampolines -fomit-frame-pointer -march=i686 -fasynchronous-unwind-tables -mtune=pentium4 -mmmx -D_FILE_OFFSET_BITS=64 -g0 -fuse-ld=lld) works... (cached) yes 0:24.62 js/src> checking whether the C++ compiler (/usr/bin/clang++ -std=gnu++17 -O2 -fwrapv -pipe -Wformat -Werror=format-security -Wp,-D_FORTIFY_SOURCE=2 -fstack-protector-strong --param=ssp-buffer-size=4 -Werror=trampolines -fomit-frame-pointer -march=i686 -fasynchronous-unwind-tables -mtune=pentium4 -mmmx -D_FILE_OFFSET_BITS=64 -g0 -fuse-ld=lld) is a cross-compiler... no 0:24.63 js/src> checking whether we are using GNU C++... (cached) yes 0:24.63 js/src> checking whether /usr/bin/clang++ -std=gnu++17 accepts -g... (cached) yes 0:24.63 js/src> checking for /usr/bin/clang... (cached) /usr/bin/clang -std=gnu99 0:24.63 js/src> checking for strip... (cached) strip 0:24.63 js/src> checking for sb-conf... no 0:24.63 js/src> checking for ve... no 0:24.79 js/src> checking for --noexecstack option to as... yes 0:24.90 js/src> checking for -z noexecstack option to ld... yes 0:25.01 js/src> checking for -z text option to ld... yes 0:25.12 js/src> checking for -z relro option to ld... yes 0:25.23 js/src> checking for -z nocopyreloc option to ld... yes 0:25.34 js/src> checking for -Bsymbolic-functions option to ld... yes 0:25.45 js/src> checking for --build-id=sha1 option to ld... yes 0:25.58 js/src> checking whether the linker supports Identical Code Folding... no 0:25.90 js/src> checking whether removing dead symbols breaks debugging... yes 0:25.91 js/src> checking for working const... (cached) yes 0:25.91 js/src> checking for mode_t... (cached) yes 0:25.91 js/src> checking for off_t... (cached) yes 0:25.91 js/src> checking for pid_t... (cached) yes 0:25.91 js/src> checking for size_t... (cached) yes 0:25.98 js/src> checking for ssize_t... yes 0:25.98 js/src> checking whether 64-bits std::atomic requires -latomic... (cached) yes 0:25.98 js/src> checking for dirent.h that defines DIR... (cached) yes 0:25.99 js/src> checking for opendir in -ldir... (cached) no 0:25.99 js/src> checking for gethostbyname_r in -lc_r... (cached) no 0:25.99 js/src> checking for library containing dlopen... (cached) none required 0:26.00 js/src> checking for dlfcn.h... (cached) yes 0:26.00 js/src> checking for socket in -lsocket... (cached) no 0:26.00 js/src> checking for pthread_create in -lpthreads... (cached) no 0:26.01 js/src> checking for pthread_create in -lpthread... (cached) yes 0:26.10 js/src> checking whether /usr/bin/clang -std=gnu99 accepts -pthread... yes 0:26.22 js/src> checking for getc_unlocked... yes 0:26.34 js/src> checking for _getc_nolock... no 0:26.34 js/src> checking for gmtime_r... (cached) yes 0:26.34 js/src> checking for localtime_r... (cached) yes 0:26.46 js/src> checking for pthread_getname_np... yes 0:26.58 js/src> checking for pthread_get_name_np... no 0:26.58 js/src> checking for clock_gettime(CLOCK_MONOTONIC)... (cached) 0:26.69 js/src> checking for sin in -lm... yes 0:26.70 js/src> checking for res_ninit()... (cached) yes 0:26.81 js/src> checking for nl_langinfo and CODESET... yes 0:26.81 js/src> checking for an implementation of va_copy()... (cached) yes 0:26.81 js/src> checking whether va_list can be copied by value... (cached) yes 0:26.82 js/src> checking for __thread keyword for TLS variables... (cached) yes 0:26.82 js/src> checking for localeconv... (cached) yes 0:26.89 js/src> checking for valid optimization flags... yes 0:26.89 js/src> checking for __cxa_demangle... (cached) yes 0:26.89 js/src> checking for -pipe support... yes 0:26.95 js/src> checking for tm_zone tm_gmtoff in struct tm... yes 0:27.07 js/src> checking what kind of list files are supported by the linker... linkerscript 0:27.08 js/src> checking for posix_fadvise... (cached) yes 0:27.08 js/src> checking for posix_fallocate... (cached) yes 0:27.09 js/src> checking for malloc.h... (cached) yes 0:27.09 js/src> checking for strndup... (cached) yes 0:27.09 js/src> checking for posix_memalign... (cached) yes 0:27.10 js/src> checking for memalign... (cached) yes 0:27.10 js/src> checking for malloc_usable_size... (cached) yes 0:27.16 js/src> checking whether malloc_usable_size definition can use const argument... no 0:27.20 js/src> checking for valloc in malloc.h... yes 0:27.24 js/src> checking for valloc in unistd.h... no 0:27.28 js/src> checking for _aligned_malloc in malloc.h... no 0:27.29 js/src> updating cache ./config.cache 0:27.31 js/src> creating ./config.data 0:27.32 Creating config.status 0:27.74 Reticulating splines... 0:28.36 0:00.67 File already read. Skipping: /tmp/B.13_9mzto/BUILD/firefox-93.0/intl/components/moz.build 0:28.78 0:01.09 File already read. Skipping: /tmp/B.13_9mzto/BUILD/firefox-93.0/gfx/angle/targets/angle_common/moz.build 0:39.99 Finished reading 1527 moz.build files in 3.44s 0:39.99 Read 13 gyp files in parallel contributing 0.00s to total wall time 0:39.99 Processed into 8945 build config descriptors in 3.18s 0:39.99 RecursiveMake backend executed in 4.61s 0:39.99 3144 total backend files; 3144 created; 0 updated; 0 unchanged; 0 deleted; 20 -> 1166 Makefile 0:39.99 FasterMake backend executed in 0.63s 0:39.99 13 total backend files; 13 created; 0 updated; 0 unchanged; 0 deleted 0:39.99 Total wall time: 12.29s; CPU time: 12.28s; Efficiency: 100%; Untracked: 0.43s 0:40.53 Adding make options from /tmp/B.13_9mzto/BUILD/firefox-93.0/.mozconfig MOZ_OBJDIR=/tmp/B.13_9mzto/BUILD/firefox-93.0/obj-i686 OBJDIR=/tmp/B.13_9mzto/BUILD/firefox-93.0/obj-i686 FOUND_MOZCONFIG=/tmp/B.13_9mzto/BUILD/firefox-93.0/.mozconfig export FOUND_MOZCONFIG 0:40.53 /usr/bin/gmake -f client.mk -s 0:40.73 Elapsed: 0.00s; From dist/public: Kept 0 existing; Added/updated 0; Removed 0 files and 0 directories. 0:40.73 Elapsed: 0.00s; From dist/private: Kept 0 existing; Added/updated 0; Removed 0 files and 0 directories. 0:40.73 Elapsed: 0.00s; From dist/xpi-stage: Kept 0 existing; Added/updated 5; Removed 0 files and 0 directories. 0:40.98 Elapsed: 0.11s; From _tests: Kept 13 existing; Added/updated 590; Removed 0 files and 0 directories. 0:41.06 Elapsed: 0.33s; From dist/include: Kept 1752 existing; Added/updated 4072; Removed 0 files and 0 directories. 0:41.10 Elapsed: 0.23s; From dist/bin: Kept 9 existing; Added/updated 2613; Removed 0 files and 0 directories. 0:41.31 ./mozilla-config.h.stub 0:41.31 ./buildid.h.stub 0:41.31 ./source-repo.h.stub 0:41.57 ./stl.sentinel.stub 0:41.57 ./application.ini.stub 0:41.57 ./UseCounterList.h.stub 0:41.57 ./UseCounterWorkerList.h.stub 0:41.58 config 0:41.74 ./ServoCSSPropList.py.stub 0:41.75 ./cbindgen-metadata.json.stub 0:41.75 ./encodingsgroups.properties.h.stub 0:41.92 ./BaseChars.h.stub 0:41.94 ./IsCombiningDiacritic.h.stub 0:42.09 ./js-confdefs.h.stub 0:43.01 ./js-config.h.stub 0:43.18 ./ProfilingCategoryList.h.stub 0:43.33 ./ReservedWordsGenerated.h.stub 0:43.35 ./StatsPhasesGenerated.h.stub 0:43.53 ./MIROpsGenerated.h.stub 0:43.58 ./LIROpsGenerated.h.stub 0:43.70 ./CacheIROpsGenerated.h.stub 0:44.22 ./WasmIntrinsicGenerated.h.stub 0:44.46 ./FrameIdList.h.stub 0:44.66 ./FrameTypeList.h.stub 0:44.85 ./CountedUnknownProperties.h.stub 0:44.95 ./metrics.rs.stub 0:45.00 ./GleanMetrics.h.stub 0:45.04 ./GleanJSMetricsLookup.h.stub 0:45.12 ./pings.rs.stub 0:46.61 ./GleanPings.h.stub 0:46.63 ./GleanJSPingsLookup.h.stub 0:46.67 ./EventGIFFTMap.h.stub 0:47.25 ./HistogramGIFFTMap.h.stub 0:47.40 ./ScalarGIFFTMap.h.stub 0:47.42 ./TelemetryScalarData.h.stub 0:47.45 ./TelemetryScalarEnums.h.stub 0:48.66 ./TelemetryEventData.h.stub 0:48.81 ./TelemetryEventEnums.h.stub 0:48.81 ./TelemetryProcessEnums.h.stub 0:48.95 ./TelemetryProcessData.h.stub 0:49.16 ./TelemetryUserInteractionData.h.stub 0:49.36 ./TelemetryUserInteractionNameMap.h.stub 0:49.58 ./CrashAnnotations.h.stub 0:49.67 ./profiling_categories.rs.stub 0:49.69 ./xpcom-config.h.stub 0:49.79 ./ErrorList.h.stub 0:49.94 ./ErrorNamesInternal.h.stub 0:49.96 ./error_list.rs.stub 0:50.00 ./Services.h.stub 0:50.12 ./services.rs.stub 0:50.12 ./nsGkAtomList.h.stub 0:50.15 ./nsGkAtomConsts.h.stub 0:50.18 ./xpidl.stub.stub 0:50.29 ./application.ini.h.stub 0:50.31 config/nsinstall_real 0:50.40 ./CSS2Properties.webidl.stub 0:50.40 ./audioipc_client_ffi_generated.h.stub 0:50.53 ./audioipc_server_ffi_generated.h.stub 0:50.57 ./webrender_ffi_generated.h.stub 0:50.57 ./wgpu_ffi_generated.h.stub 0:50.59 ./mapped_hyph.h.stub 0:50.81 ./fluent_ffi_generated.h.stub 0:50.84 ./l10nregistry_ffi_generated.h.stub 0:51.04 ./localization_ffi_generated.h.stub 0:51.10 ./fluent_langneg_ffi_generated.h.stub 0:51.33 ./unic_langid_ffi_generated.h.stub 0:51.36 ./selfhosted.out.h.stub 0:51.45 ./nsCSSPropertyID.h.stub 0:51.56 ./ServoCSSPropList.h.stub 0:51.61 /usr/bin/clang++ -std=gnu++17 -E -o self-hosting-preprocessed.pp -Qunused-arguments -DCROSS_COMPILE= -DXP_UNIX=1 -DXP_LINUX=1 -DMOZ_BUILD_APP=browser -DRELEASE_OR_BETA=1 -DMOZILLA_VERSION="93.0" -DMOZILLA_VERSION_U=93.0 -DMOZILLA_UAVERSION="93.0" -DMOZ_UPDATE_CHANNEL=default -DHAVE_VISIBILITY_HIDDEN_ATTRIBUTE=1 -DHAVE_VISIBILITY_ATTRIBUTE=1 -DMOZ_MEMORY=1 -DHAVE_STDINT_H=1 -DHAVE_INTTYPES_H=1 -DSTDC_HEADERS=1 -DHAVE_MALLOC_H=1 -DHAVE_ALLOCA_H=1 -DHAVE_GETOPT_H=1 -DHAVE_UNISTD_H=1 -DHAVE_NL_TYPES_H=1 -DHAVE_CPUID_H=1 -DHAVE_FTS_H=1 -DHAVE_SYS_STATVFS_H=1 -DHAVE_SYS_STATFS_H=1 -DHAVE_SYS_VFS_H=1 -DHAVE_SYS_MOUNT_H=1 -DHAVE_SYS_QUOTA_H=1 -DHAVE_LINUX_QUOTA_H=1 -DHAVE_LINUX_IF_ADDR_H=1 -DHAVE_LINUX_RTNETLINK_H=1 -DHAVE_SYS_QUEUE_H=1 -DHAVE_SYS_TYPES_H=1 -DHAVE_NETINET_IN_H=1 -DHAVE_BYTESWAP_H=1 -DHAVE_MEMFD_CREATE=1 -DHAVE_LINUX_PERF_EVENT_H=1 -DMOZ_DLL_PREFIX="lib" -DMOZ_DLL_SUFFIX=".so" -DMOZ_GECKO_PROFILER=1 -DMOZ_GECKO_PROFILER_PARSE_ELF=1 -DMOZ_PROFILER_MEMORY=1 -DMOZ_ALSA=1 -DMOZ_PULSEAUDIO=1 -DJS_NUNBOX32=1 -DSTATIC_JS_API=1 -DMOZ_STATIC_JS=1 -DJS_CODEGEN_X86=1 -DMOZ_AARCH64_JSCVT=0 -DBUILD_CTYPES=1 -DJS_HAS_CTYPES=1 -DENABLE_SHARED_MEMORY=1 -DENABLE_WASM_SIMD=1 -DENABLE_WASM_SIMD_WORMHOLE=1 -DJS_DEFAULT_JITREPORT_GRANULARITY=3 -DMOZ_SYSTEM_ICU=1 -DJS_HAS_INTL_API=1 -DU_USING_ICU_NAMESPACE=0 -DMOZ_WIDGET_GTK=1 -DMOZ_WAYLAND=1 -DGL_PROVIDER_EGL=1 -DMOZ_PDF_PRINTING=1 -DMOZ_INSTRUMENT_EVENT_LOOP=1 -DUSE_FC_FREETYPE=1 -DMOZ_HAVE_FREETYPE2=1 -DMOZ_FFMPEG=1 -DMOZ_DAV1D_ASM=1 -DMOZ_AV1=1 -DMOZ_FMP4=1 -DMOZ_SAMPLE_TYPE_FLOAT32=1 -DMOZ_VORBIS=1 -DMOZ_PLACES=1 -DMOZ_SERVICES_HEALTHREPORT=1 -DMOZ_NORMANDY=1 -DMOZ_DEDICATED_PROFILES=1 -DMOZ_BLOCK_PROFILE_DOWNGRADE=1 -DNS_PRINTING=1 -DNS_PRINT_PREVIEW=1 -DMOZ_WEBSPEECH=1 -DMOZ_WEBSPEECH_TEST_BACKEND=1 -DENABLE_WEBDRIVER=1 -DMOZ_WEBRTC=1 -DMOZ_SCTP=1 -DMOZ_SRTP=1 -DMOZ_WEBRTC_SIGNALING=1 -DMOZ_PEERCONNECTION=1 -DMOZ_WEBRTC_ASSERT_ALWAYS=1 -DMOZ_RAW=1 -DMOZ_X11=1 -DMOZ_PROXY_DIRECT_FAILOVER=1 -DACCESSIBILITY=1 -DMOZ_REQUIRE_SIGNING=1 -DMOZ_BUNDLED_FONTS=1 -DHAVE_VPX_VPX_DECODER_H=1 -DMOZ_FFVPX=1 -DMOZ_FFVPX_AUDIOONLY=1 -DMOZ_HAS_REMOTE=1 -DMOZ_ENABLE_FORKSERVER=1 -DHAVE_GETCONTEXT=1 -DMOZ_VERIFY_MAR_SIGNATURE=1 -DMOZ_OXIDIZED_BREAKPAD=1 -DHAVE_DIRENT_H=1 -DHAVE_DLOPEN=1 -DHAVE_DLADDR=1 -DHAVE_MEMMEM=1 -D_REENTRANT=1 -DHAVE_PTHREAD_H=1 -DHAVE_STAT64=1 -DHAVE_LSTAT64=1 -DHAVE_TRUNCATE64=1 -DHAVE_STATVFS64=1 -DHAVE_STATVFS=1 -DHAVE_STATFS64=1 -DHAVE_STATFS=1 -DHAVE_GETPAGESIZE=1 -DHAVE_GMTIME_R=1 -DHAVE_LOCALTIME_R=1 -DHAVE_MALLINFO=1 -DHAVE_GETTID=1 -DHAVE_LCHOWN=1 -DHAVE_SETPRIORITY=1 -DHAVE_STRERROR=1 -DHAVE_SYSCALL=1 -DHAVE_LUTIMES=1 -DHAVE_CLOCK_MONOTONIC=1 -DHAVE_RES_NINIT=1 -DVA_COPY=va_copy -DHAVE_VA_COPY=1 -DHAVE_THREAD_TLS_KEYWORD=1 -DHAVE_LOCALECONV=1 -DMALLOC_H=<malloc.h> -DHAVE_STRNDUP=1 -DHAVE_POSIX_MEMALIGN=1 -DHAVE_MEMALIGN=1 -DHAVE_MALLOC_USABLE_SIZE=1 -DMALLOC_USABLE_SIZE_CONST_PTR= -DHAVE_VALLOC=1 -DTARGET_XPCOM_ABI="x86-gcc3" -DHAVE_LIBPNG=1 -DGDK_VERSION_MAX_ALLOWED=GDK_VERSION_3_14 -DGLIB_VERSION_MIN_REQUIRED=GLIB_VERSION_2_42 -DGLIB_VERSION_MAX_ALLOWED=GLIB_VERSION_2_42 -DMOZ_OFFICIAL_BRANDING=1 -DMOZ_DISTRIBUTION_ID="org.pld-linux" -DMOZ_ENABLE_DBUS=1 -DMOZ_WEBM_ENCODER=1 -DENABLE_SYSTEM_EXTENSION_DIRS=1 -DMOZ_SANDBOX=1 -DMOZ_LOGGING=1 -DFORCE_PR_LOG=1 -DMOZ_GLUE_IN_PROGRAM=1 -DHAVE___CXA_DEMANGLE=1 -DHAVE__UNWIND_BACKTRACE=1 -DMOZ_USER_DIR=".mozilla" -DHAVE_FT_BITMAP_SIZE_Y_PPEM=1 -DHAVE_FT_GLYPHSLOT_EMBOLDEN=1 -DHAVE_FT_LOAD_SFNT_TABLE=1 -DHAVE_FONTCONFIG_FCFREETYPE_H=1 -DMOZ_XUL=1 -DMOZ_MACBUNDLE_ID=org.pld-linux.firefox -DMOZ_APP_UA_NAME="" -DMOZ_APP_UA_VERSION="93.0" -DBROWSER_CHROME_URL=chrome://browser/content/browser.xhtml -DBROWSER_CHROME_URL_QUOTED="chrome://browser/content/browser.xhtml" -DMOZ_DATA_REPORTING=1 -DHAVE_POSIX_FADVISE=1 -DHAVE_POSIX_FALLOCATE=1 -DMOZ_ACCESSIBILITY_ATK=1 -DATK_MAJOR_VERSION=2 -DATK_MINOR_VERSION=36 -DATK_REV_VERSION=0 -DNO_NSPR_10_SUPPORT=1 -DNDEBUG=1 -DTRIMMED=1 self-hosting-cpp-input.cpp 0:51.72 ./CompositorAnimatableProperties.h.stub 0:51.72 ./ServoStyleConsts.h.stub 0:51.75 ./mp4parse_ffi_generated.h.stub 0:51.92 ./MozURL_ffi.h.stub 0:51.92 ./rust_helper.h.stub 0:52.15 ./neqo_glue_ffi_generated.h.stub 0:52.18 ./fog_ffi_generated.h.stub 0:52.23 ./TelemetryHistogramEnums.h.stub 0:52.37 ./TelemetryHistogramNameMap.h.stub 0:52.41 ./gk_rust_utils_ffi_generated.h.stub 0:52.74 config/system-header.sentinel.stub 0:53.07 accessible/xpcom/xpcAccEvents.h.stub 0:53.91 modules/libpref/StaticPrefListAll.h.stub 0:55.90 WARNING: mkdir -dot- requested by /usr/bin/gmake -C /tmp/B.13_9mzto/BUILD/firefox-93.0/obj-i686/config/makefiles/xpidl xpidl 0:55.90 config/makefiles/xpidl/Bits.xpt 0:55.90 config/makefiles/xpidl/accessibility.xpt 0:56.20 config/makefiles/xpidl/alerts.xpt 0:57.13 config/makefiles/xpidl/appshell.xpt 0:57.40 xpcom/components/Components.h.stub 0:57.42 config/makefiles/xpidl/appstartup.xpt 0:57.79 config/makefiles/xpidl/autocomplete.xpt 0:57.98 config/makefiles/xpidl/autoplay.xpt 0:58.04 config/makefiles/xpidl/backgroundhangmonitor.xpt 0:58.29 config/makefiles/xpidl/browser-element.xpt 0:58.38 config/makefiles/xpidl/browser-newtab.xpt 0:58.54 config/makefiles/xpidl/browsercompsbase.xpt 0:58.63 config/makefiles/xpidl/caps.xpt 0:58.78 config/makefiles/xpidl/captivedetect.xpt 0:58.88 config/makefiles/xpidl/cascade_bindings.xpt 0:59.12 config/makefiles/xpidl/chrome.xpt 0:59.24 config/makefiles/xpidl/commandhandler.xpt 0:59.38 config/makefiles/xpidl/commandlines.xpt 0:59.51 config/makefiles/xpidl/composer.xpt 0:59.73 config/makefiles/xpidl/content_events.xpt 0:59.81 config/makefiles/xpidl/content_geckomediaplugins.xpt 0:59.99 config/makefiles/xpidl/content_html.xpt 1:00.08 config/makefiles/xpidl/docshell.xpt 1:00.30 config/makefiles/xpidl/dom.xpt 1:00.36 config/makefiles/xpidl/dom_audiochannel.xpt 1:00.95 config/makefiles/xpidl/dom_base.xpt 1:00.99 config/makefiles/xpidl/dom_bindings.xpt 1:01.21 config/makefiles/xpidl/dom_events.xpt 1:01.49 config/makefiles/xpidl/dom_geolocation.xpt 1:01.73 config/makefiles/xpidl/dom_html.xpt 1:01.92 config/makefiles/xpidl/dom_indexeddb.xpt 1:02.02 config/makefiles/xpidl/dom_localstorage.xpt 1:02.17 config/makefiles/xpidl/dom_media.xpt 1:02.28 config/makefiles/xpidl/dom_network.xpt 1:02.42 config/makefiles/xpidl/dom_notification.xpt 1:02.57 config/makefiles/xpidl/dom_payments.xpt 1:02.69 config/makefiles/xpidl/dom_power.xpt 1:02.83 config/makefiles/xpidl/dom_push.xpt 1:03.11 config/makefiles/xpidl/dom_quota.xpt 1:03.28 config/makefiles/xpidl/dom_security.xpt 1:03.41 config/makefiles/xpidl/dom_serializers.xpt 1:03.59 config/makefiles/xpidl/dom_sidebar.xpt 1:03.75 config/makefiles/xpidl/dom_simpledb.xpt 1:03.86 config/makefiles/xpidl/dom_storage.xpt 1:04.00 config/makefiles/xpidl/dom_system.xpt 1:04.15 config/makefiles/xpidl/dom_webauthn.xpt 1:04.27 config/makefiles/xpidl/dom_webspeechrecognition.xpt 1:04.40 config/makefiles/xpidl/dom_webspeechsynth.xpt 1:04.51 config/makefiles/xpidl/dom_workers.xpt 1:04.65 config/makefiles/xpidl/dom_xslt.xpt 1:04.79 config/makefiles/xpidl/dom_xul.xpt 1:04.92 config/makefiles/xpidl/downloads.xpt 1:05.04 config/makefiles/xpidl/editor.xpt 1:05.29 config/makefiles/xpidl/enterprisepolicies.xpt 1:05.32 config/makefiles/xpidl/extensions.xpt 1:05.58 config/makefiles/xpidl/exthandler.xpt 1:05.80 config/makefiles/xpidl/fastfind.xpt 1:05.84 config/makefiles/xpidl/fog.xpt 1:06.09 config/makefiles/xpidl/gfx.xpt 1:06.17 config/makefiles/xpidl/html5.xpt 1:06.41 config/makefiles/xpidl/htmlparser.xpt 1:06.44 config/makefiles/xpidl/http-sfv.xpt 1:06.66 config/makefiles/xpidl/imglib2.xpt 1:06.69 config/makefiles/xpidl/inspector.xpt 1:06.96 config/makefiles/xpidl/intl.xpt 1:07.20 config/makefiles/xpidl/jar.xpt 1:07.21 config/makefiles/xpidl/jsdebugger.xpt 1:07.46 config/makefiles/xpidl/jsinspector.xpt 1:07.62 config/makefiles/xpidl/kvstore.xpt 1:07.70 config/makefiles/xpidl/layout_base.xpt 1:07.87 config/makefiles/xpidl/layout_printing.xpt 1:08.00 config/makefiles/xpidl/layout_xul_tree.xpt 1:08.15 config/makefiles/xpidl/locale.xpt 1:08.27 config/makefiles/xpidl/loginmgr.xpt 1:08.44 config/makefiles/xpidl/migration.xpt 1:08.54 config/makefiles/xpidl/mimetype.xpt 1:08.79 config/makefiles/xpidl/mozfind.xpt 1:08.84 config/makefiles/xpidl/mozintl.xpt 1:09.11 config/makefiles/xpidl/necko.xpt 1:09.13 config/makefiles/xpidl/necko_about.xpt 1:09.37 config/makefiles/xpidl/necko_cache2.xpt 1:09.63 config/makefiles/xpidl/necko_cookie.xpt 1:10.00 config/makefiles/xpidl/necko_dns.xpt 1:10.35 config/makefiles/xpidl/necko_file.xpt 1:10.79 config/makefiles/xpidl/necko_http.xpt 1:11.07 config/makefiles/xpidl/necko_mdns.xpt 1:11.84 config/makefiles/xpidl/necko_res.xpt 1:12.10 config/makefiles/xpidl/necko_socket.xpt 1:12.11 config/makefiles/xpidl/necko_strconv.xpt 1:12.38 config/makefiles/xpidl/necko_viewsource.xpt 1:12.44 config/makefiles/xpidl/necko_websocket.xpt 1:12.73 config/makefiles/xpidl/parentalcontrols.xpt 1:12.80 config/makefiles/xpidl/peerconnection.xpt 1:13.05 config/makefiles/xpidl/pipnss.xpt 1:13.08 config/makefiles/xpidl/places.xpt 1:13.33 config/makefiles/xpidl/plugin.xpt 1:13.85 config/makefiles/xpidl/pref.xpt 1:13.93 config/makefiles/xpidl/prefetch.xpt 1:14.11 config/makefiles/xpidl/profiler.xpt 1:14.28 config/makefiles/xpidl/remote.xpt 1:14.36 config/makefiles/xpidl/reputationservice.xpt 1:14.54 config/makefiles/xpidl/sandbox.xpt 1:14.63 config/makefiles/xpidl/satchel.xpt 1:14.82 config/makefiles/xpidl/services.xpt 1:14.90 config/makefiles/xpidl/sessionstore.xpt 1:15.10 config/makefiles/xpidl/shellservice.xpt 1:15.22 config/makefiles/xpidl/shistory.xpt 1:15.39 config/makefiles/xpidl/spellchecker.xpt 1:15.50 config/makefiles/xpidl/startupcache.xpt 1:15.77 config/makefiles/xpidl/storage.xpt 1:15.77 config/makefiles/xpidl/telemetry.xpt 1:15.82 config/makefiles/xpidl/thumbnails.xpt 1:16.02 config/makefiles/xpidl/toolkit_antitracking.xpt 1:16.13 config/makefiles/xpidl/toolkit_asyncshutdown.xpt 1:16.26 config/makefiles/xpidl/toolkit_backgroundtasks.xpt 1:16.39 config/makefiles/xpidl/toolkit_cleardata.xpt 1:16.44 config/makefiles/xpidl/toolkit_crashservice.xpt 1:16.56 config/makefiles/xpidl/toolkit_filewatcher.xpt 1:16.65 config/makefiles/xpidl/toolkit_finalizationwitness.xpt 1:16.70 config/makefiles/xpidl/toolkit_modules.xpt 1:16.81 config/makefiles/xpidl/toolkit_osfile.xpt 1:16.90 config/makefiles/xpidl/toolkit_processtools.xpt 1:16.95 config/makefiles/xpidl/toolkit_search.xpt 1:17.08 config/makefiles/xpidl/toolkit_shell.xpt 1:17.16 config/makefiles/xpidl/toolkit_xulstore.xpt 1:17.20 config/makefiles/xpidl/toolkitprofile.xpt 1:17.37 config/makefiles/xpidl/txmgr.xpt 1:17.40 config/makefiles/xpidl/txtsvc.xpt 1:17.45 config/makefiles/xpidl/uconv.xpt 1:17.68 config/makefiles/xpidl/update.xpt 1:17.70 config/makefiles/xpidl/uriloader.xpt 1:17.71 config/makefiles/xpidl/url-classifier.xpt 1:17.94 config/makefiles/xpidl/urlformatter.xpt 1:17.95 config/makefiles/xpidl/viaduct.xpt 1:18.13 config/makefiles/xpidl/webBrowser_core.xpt 1:18.20 config/makefiles/xpidl/webbrowserpersist.xpt 1:18.38 config/makefiles/xpidl/webextensions.xpt 1:18.49 config/makefiles/xpidl/webextensions-storage.xpt 1:18.59 config/makefiles/xpidl/webvtt.xpt 1:18.70 config/makefiles/xpidl/widget.xpt 1:18.78 config/makefiles/xpidl/windowcreator.xpt 1:18.85 config/makefiles/xpidl/windowwatcher.xpt 1:18.96 config/makefiles/xpidl/xpcom_base.xpt 1:19.11 config/makefiles/xpidl/xpcom_components.xpt 1:19.37 config/makefiles/xpidl/xpcom_ds.xpt 1:19.67 config/makefiles/xpidl/xpcom_io.xpt 1:19.73 config/makefiles/xpidl/xpcom_system.xpt 1:19.88 config/makefiles/xpidl/xpcom_threads.xpt 1:20.33 config/makefiles/xpidl/xpconnect.xpt 1:20.34 config/makefiles/xpidl/xul.xpt 1:20.60 config/makefiles/xpidl/xulapp.xpt 1:20.74 config/makefiles/xpidl/zipwriter.xpt 1:21.12 config/makefiles/xpidl/xptdata.stub 1:23.76 testing/geckodriver/force-cargo-program-build 1:23.76 toolkit/library/rust/force-cargo-library-build 1:23.76 accessible/aom 1:23.77 accessible/atk 1:24.09 Blocking waiting for file lock on package cache 1:26.51 Blocking waiting for file lock on package cache 1:29.32 Compiling libc v0.2.97 1:30.56 Compiling proc-macro2 v1.0.27 1:31.03 Compiling autocfg v1.0.1 (/tmp/B.13_9mzto/BUILD/firefox-93.0/third_party/rust/autocfg) 1:32.34 Compiling unicode-xid v0.2.0 1:32.54 Compiling syn v1.0.73 1:34.11 Compiling libc v0.2.97 1:34.59 Compiling autocfg v1.0.1 (/tmp/B.13_9mzto/BUILD/firefox-93.0/third_party/rust/autocfg) 1:34.60 Compiling proc-macro2 v1.0.27 1:35.82 Compiling serde_derive v1.0.126 1:36.38 Compiling unicode-xid v0.2.0 1:36.57 Compiling syn v1.0.73 1:37.20 Compiling serde v1.0.126 1:38.16 Compiling cfg-if v0.1.10 1:38.22 Compiling cfg-if v1.0.0 1:38.28 Compiling serde_derive v1.0.126 1:38.68 Compiling bitflags v1.2.1 1:39.03 Compiling cfg-if v1.0.0 1:39.09 Compiling cfg-if v0.1.10 1:39.15 Compiling log v0.4.14 1:39.59 Compiling lazy_static v1.4.0 1:39.68 Compiling serde v1.0.126 1:39.71 Compiling cc v1.0.68 1:40.05 Compiling getrandom v0.1.14 1:40.82 Compiling byteorder v1.4.3 1:41.19 Compiling log v0.4.14 1:41.64 Compiling memchr v2.4.0 1:42.44 Compiling itoa v0.4.7 1:42.65 Compiling futures-core v0.3.15 1:43.07 Compiling version_check v0.9.3 1:43.16 Compiling getrandom v0.1.14 1:43.80 Compiling version_check v0.9.3 1:47.17 Compiling encoding_rs v0.8.22 1:47.42 Compiling pkg-config v0.3.19 1:47.90 Compiling bytes v0.5.6 1:49.62 Compiling fnv v1.0.7 1:49.72 Compiling typenum v1.13.0 1:53.53 Compiling ahash v0.4.7 1:53.57 Compiling memchr v2.4.0 1:53.66 Compiling byteorder v1.4.3 1:53.92 Compiling proc-macro-hack v0.5.19 1:54.17 Compiling futures-task v0.3.15 1:54.35 Compiling itoa v0.4.7 1:54.63 Compiling matches v0.1.8 1:54.67 Compiling futures-sink v0.3.15 1:54.77 Compiling ppv-lite86 v0.2.10 1:55.31 Compiling ppv-lite86 v0.2.10 1:55.36 Compiling hashbrown v0.9.1 1:55.50 Compiling thin-vec v0.2.2 1:55.91 Compiling ryu v1.0.5 1:56.10 Compiling serde_json v1.0.64 1:56.13 Compiling slab v0.4.3 1:56.34 Compiling byte-tools v0.3.1 1:56.41 Compiling matches v0.1.8 1:56.48 Compiling ryu v1.0.5 1:57.33 Compiling threadbound v0.1.2 1:57.44 Compiling crossbeam-utils v0.8.5 1:57.53 Compiling scopeguard v1.1.0 1:57.63 Compiling unicode-normalization v0.1.5 1:57.90 Compiling pin-project-lite v0.1.12 1:57.97 Compiling slab v0.4.3 1:57.97 Compiling lazy_static v1.4.0 1:58.09 Compiling pin-project-lite v0.2.6 1:58.18 Compiling pin-project-internal v0.4.28 1:58.19 Compiling glob v0.3.0 1:58.71 Compiling percent-encoding v2.1.0 1:59.33 Compiling stable_deref_trait v1.2.0 1:59.47 Compiling futures-task v0.3.15 1:59.58 Compiling bitflags v1.2.1 1:59.97 Compiling regex-syntax v0.6.25 2:00.93 Compiling futures-channel v0.3.15 2:01.43 Compiling pin-utils v0.1.0 2:01.49 Compiling httparse v1.4.1 2:02.84 Compiling termcolor v1.1.2 2:04.19 Compiling serde_json v1.0.64 2:04.35 Compiling bindgen v0.56.0 2:05.61 Compiling unicode-normalization v0.1.5 2:06.66 Compiling opaque-debug v0.2.1 2:06.73 Compiling regex-syntax v0.6.25 2:20.95 Compiling shlex v0.1.1 2:21.84 Compiling peeking_take_while v0.1.2 2:21.94 Compiling rustc-hash v1.1.0 2:22.06 Compiling futures v0.1.31 2:24.47 Compiling crc32fast v1.2.1 2:25.76 Compiling lazycell v1.3.0 2:25.83 Compiling try-lock v0.2.3 2:25.90 Compiling once_cell v1.8.0 2:25.94 Compiling mime v0.3.16 2:27.03 Compiling anyhow v1.0.41 2:27.42 Compiling dtoa v0.4.8 2:27.71 Compiling remove_dir_all v0.5.3 2:27.78 Compiling percent-encoding v2.1.0 2:28.39 Compiling fake-simd v0.1.2 2:28.49 Compiling tower-service v0.3.1 2:28.54 Compiling tinystr v0.3.4 2:28.58 Compiling base64 v0.12.3 2:29.11 Compiling siphasher v0.3.5 2:29.44 Compiling safemem v0.3.3 2:29.55 Compiling futures-io v0.3.15 2:29.61 Compiling adler v1.0.2 2:29.91 Compiling same-file v1.0.6 2:30.01 Compiling base64 v0.12.3 2:30.23 Compiling urlencoding v1.3.3 2:30.77 Compiling unix_str v1.0.0 2:30.88 Compiling humantime v2.1.0 2:31.76 Compiling scoped-tls v1.0.0 2:31.91 Compiling semver-parser v0.7.0 2:31.96 Compiling fnv v1.0.7 2:32.06 Compiling futures-core v0.3.15 2:32.34 Compiling ident_case v1.0.1 2:32.54 Compiling futures-channel v0.3.15 2:32.57 Compiling proc-macro-nested v0.1.7 2:33.05 Compiling maybe-uninit v2.0.0 2:33.75 Compiling once_cell v1.8.0 2:34.04 Compiling typenum v1.13.0 2:34.13 Compiling unicode-width v0.1.7 2:34.26 Compiling linked-hash-map v0.5.4 2:34.45 Compiling crossbeam-epoch v0.9.5 2:34.56 Compiling xml-rs v0.8.3 2:34.95 Compiling fallible-streaming-iterator v0.1.9 2:35.14 Compiling futures-sink v0.3.15 2:35.24 Compiling Inflector v0.11.4 2:38.00 Compiling arrayref v0.3.6 2:38.06 Compiling khronos_api v3.1.0 2:38.11 Compiling fallible-iterator v0.2.0 2:38.81 Compiling dtoa v0.4.8 2:39.11 Compiling pin-utils v0.1.0 2:39.11 Compiling pin-project-lite v0.2.6 2:39.17 Compiling crc32fast v1.2.1 2:39.21 Compiling arrayvec v0.5.2 2:39.75 Compiling id-arena v2.2.1 2:39.96 Compiling futures-io v0.3.15 2:40.39 Compiling atomic_refcell v0.1.7 2:40.53 Compiling rayon-core v1.9.1 2:40.55 Compiling smallbitvec v2.5.0 2:40.79 Compiling adler v1.0.2 2:41.09 Compiling xml-rs v0.8.3 2:41.21 Compiling neqo-common v0.4.32 (https://github.com/mozilla/neqo?tag=v0.4.32#dbb04a53) 2:41.86 Compiling byte-tools v0.3.1 2:41.93 Compiling either v1.6.1 2:42.12 Compiling thin-slice v0.1.1 2:42.26 Compiling semver-parser v0.7.0 2:42.34 Compiling geckodriver v0.29.1 (/tmp/B.13_9mzto/BUILD/firefox-93.0/testing/geckodriver) 2:44.79 Compiling rust-ini v0.10.3 2:46.17 Compiling interrupt-support v0.1.0 (https://github.com/mozilla/application-services?rev=8a576fbe79199fa8664f64285524017f74ebcc5f#8a576fbe) 2:46.30 Compiling khronos-egl v4.1.0 2:46.53 Compiling precomputed-hash v0.1.1 2:46.60 Compiling same-file v1.0.6 2:47.07 Compiling static_assertions v1.1.0 2:47.13 Compiling chunky-vec v0.1.0 2:47.47 Compiling podio v0.1.7 2:47.48 Compiling unicode-width v0.1.7 2:47.61 Compiling bit-vec v0.6.3 2:47.66 Compiling strsim v0.8.0 2:48.16 Compiling fixedbitset v0.2.0 2:48.86 Compiling nss_build_common v0.1.0 (https://github.com/mozilla/application-services?rev=8a576fbe79199fa8664f64285524017f74ebcc5f#8a576fbe) 2:49.54 Compiling unicode-segmentation v1.2.1 2:50.18 Compiling cfg_aliases v0.1.1 2:50.25 Compiling void v1.0.2 2:50.39 Compiling opaque-debug v0.2.1 2:50.45 Compiling replace_with v0.1.7 2:50.54 Compiling target-lexicon v0.9.0 2:50.59 Compiling indexmap v1.6.2 2:50.86 Compiling futures-util v0.3.15 2:51.26 Compiling num-traits v0.2.14 2:51.54 Compiling num-integer v0.1.44 2:51.82 Compiling miniz_oxide v0.4.4 2:52.27 Compiling unicase v2.6.0 2:52.40 Compiling fake-simd v0.1.2 2:52.49 Compiling encoding_c v0.9.7 2:52.56 Compiling http v0.2.2 2:52.91 Compiling svg_fmt v0.4.1 2:52.97 Compiling glow v0.11.0 2:55.49 Compiling plain v0.2.3 2:55.62 Compiling cose v0.1.4 2:56.01 Compiling murmurhash3 v0.0.5 2:56.26 Compiling error-chain v0.11.0 2:56.67 Compiling bytes v0.5.6 2:58.40 Compiling inplace_it v0.3.3 2:59.75 Compiling base64 v0.10.1 2:59.99 Compiling renderdoc-sys v0.7.1 3:00.35 Compiling binary-space-partition v0.1.2 3:00.48 Compiling static_prefs v0.1.0 (/tmp/B.13_9mzto/BUILD/firefox-93.0/modules/libpref/init/static_prefs) 3:00.55 Compiling block-padding v0.1.5 3:00.56 Compiling remove_dir_all v0.5.3 3:00.61 Compiling encoding_c_mem v0.2.5 3:00.62 Compiling profiling v1.0.2 3:00.69 Compiling tracy-rs v0.1.2 3:00.81 Compiling unicode-bidi v0.3.4 3:00.82 Compiling authenticator v0.3.1 3:01.06 Compiling new_debug_unreachable v1.0.4 3:01.09 Compiling cache-padded v1.1.1 3:01.13 Compiling quick-error v1.2.3 3:01.18 Compiling qcms v0.2.0 (/tmp/B.13_9mzto/BUILD/firefox-93.0/gfx/qcms) 3:01.24 Compiling unicode-segmentation v1.2.1 3:01.91 Compiling moz_cbor v0.1.2 3:02.24 Compiling copyless v0.1.5 3:02.36 Compiling data-encoding v2.3.2 3:03.75 Compiling runloop v0.1.0 3:04.09 Compiling line-wrap v0.1.1 3:04.10 Compiling mozilla-central-workspace-hack v0.1.0 (/tmp/B.13_9mzto/BUILD/firefox-93.0/build/workspace-hack) 3:04.16 Compiling rustc-demangle v0.1.19 3:04.25 Compiling walkdir v2.3.2 3:06.44 Compiling unix_path v1.0.1 3:06.75 Compiling prefs_parser v0.0.1 (/tmp/B.13_9mzto/BUILD/firefox-93.0/modules/libpref/parser) 3:07.82 Compiling semver v0.9.0 3:08.08 Compiling num-traits v0.2.14 3:08.35 Compiling indexmap v1.6.2 3:08.62 Compiling num-integer v0.1.44 3:08.90 Compiling futures-macro v0.3.15 3:09.20 Compiling memoffset v0.6.4 3:09.35 Compiling yaml-rust v0.4.5 3:09.48 Compiling memoffset v0.5.6 3:09.76 Compiling crossbeam-utils v0.7.2 3:10.02 Compiling crossbeam-epoch v0.8.2 3:10.29 Compiling futures-util v0.3.15 3:10.56 Compiling miniz_oxide v0.4.4 3:10.71 Compiling rayon v1.5.1 3:10.84 Compiling instant v0.1.9 3:10.92 Compiling libloading v0.7.0 3:10.99 Compiling bitreader v0.3.4 3:11.42 Compiling crossbeam-utils v0.6.6 3:11.66 Compiling cmake v0.1.45 3:12.89 Compiling fxhash v0.2.1 3:13.09 Compiling base64 v0.10.1 3:13.91 Compiling nom v5.1.2 3:14.18 Compiling proc-macro-error-attr v1.0.4 3:14.44 Compiling proc-macro-error v1.0.4 3:14.74 Compiling glslopt v0.1.9 3:14.86 Compiling whatsys v0.1.2 3:15.55 Compiling audioipc v0.2.5 (https://github.com/mozilla/audioipc-2?rev=7537bfadad2e981577eb75e4f13662fc517e1a09#7537bfad) 3:15.57 Compiling libsqlite3-sys v0.20.1 3:15.99 Compiling lmdb-rkv-sys v0.11.0 3:16.02 Compiling libdbus-sys v0.2.1 3:16.40 Compiling hashbrown v0.9.1 3:17.18 Compiling unicode-bidi v0.3.4 3:17.73 Compiling lock_api v0.4.4 3:18.11 Compiling servo_arc v0.1.1 (/tmp/B.13_9mzto/BUILD/firefox-93.0/servo/components/servo_arc) 3:18.56 Compiling owning_ref v0.4.1 3:18.81 Compiling clang-sys v1.2.0 3:20.17 Compiling unic-langid-impl v0.9.0 3:20.24 Compiling phf_shared v0.8.0 3:21.42 Compiling type-map v0.4.0 3:21.79 Compiling dtoa-short v0.3.3 3:22.07 Compiling uluru v1.1.1 3:22.29 Compiling block-padding v0.1.5 3:22.54 Compiling itertools v0.8.2 3:22.57 Compiling semver v0.9.0 3:24.45 Compiling walkdir v2.3.2 3:27.97 Compiling codespan-reporting v0.11.1 3:28.51 Compiling bit-set v0.5.2 3:28.75 Compiling webext-storage v0.1.0 (https://github.com/mozilla/application-services?rev=8a576fbe79199fa8664f64285524017f74ebcc5f#8a576fbe) 3:29.28 Compiling wgpu-core v0.10.0 (https://github.com/kvark/wgpu?branch=gecko-beta-solaris#5a3a555b) 3:31.32 Compiling ringbuf v0.2.5 3:31.71 Compiling headers-core v0.2.0 3:31.85 Compiling http-body v0.3.1 3:31.86 Compiling dns-parser v0.8.0 3:33.81 Compiling idna v0.2.0 3:36.69 Compiling ash v0.33.0+1.2.186 3:39.04 Compiling time v0.1.43 3:41.60 Compiling tokio-executor v0.1.9 3:42.13 Compiling iovec v0.1.4 3:42.30 Compiling crossbeam-queue v0.1.2 3:42.37 Compiling net2 v0.2.37 3:43.82 Compiling socket2 v0.3.19 3:45.66 Compiling term_size v0.3.2 3:52.42 Compiling quote v1.0.9 3:55.23 Compiling want v0.3.0 3:55.57 Compiling aho-corasick v0.7.18 3:59.22 Compiling cubeb-sys v0.9.0 4:00.68 Compiling generic-array v0.12.4 4:01.22 Compiling url v2.1.0 4:05.60 Compiling cookie v0.12.0 4:07.27 Compiling msdos_time v0.1.6 4:07.44 Compiling rand_core v0.5.1 4:07.89 Compiling mio v0.6.23 (/tmp/B.13_9mzto/BUILD/firefox-93.0/third_party/rust/mio) 4:08.46 Compiling textwrap v0.11.0 4:11.02 Compiling flate2 v1.0.20 4:12.43 Compiling regex v1.5.4 4:27.35 Compiling hashlink v0.6.0 4:27.91 Compiling fallible_collections v0.4.2 4:28.55 Compiling idna v0.2.0 4:38.91 Compiling mime_guess v2.0.3 4:44.61 Compiling digest v0.8.1 4:44.79 Compiling block-buffer v0.7.3 4:44.93 Compiling futures v0.3.15 4:45.00 Compiling rand_chacha v0.2.2 4:45.36 Compiling clap v2.33.3 4:50.66 Compiling unic-langid v0.9.0 4:53.39 Compiling rustc_version v0.2.3 4:57.87 Compiling quote v1.0.9 5:01.20 Compiling time v0.1.43 5:03.71 Compiling iovec v0.1.4 5:03.95 Compiling num_cpus v1.13.0 5:06.21 Compiling atty v0.2.14 5:06.34 Compiling net2 v0.2.37 5:07.79 Compiling hashglobe v0.1.0 (/tmp/B.13_9mzto/BUILD/firefox-93.0/servo/components/hashglobe) 5:08.80 Compiling zeitstempel v0.1.1 5:08.91 Compiling memmap2 v0.2.3 5:09.50 Compiling raw-window-handle v0.3.3 5:10.71 Compiling libudev-sys v0.1.3 (/tmp/B.13_9mzto/BUILD/firefox-93.0/dom/webauthn/libudev-sys) 5:13.32 Compiling freetype v0.7.0 5:14.80 Compiling dirs-sys v0.3.5 5:16.43 Compiling pulse-ffi v0.1.0 (https://github.com/mozilla/cubeb-pulse-rs?rev=0d168cc5be8865b21694b1b0c5a1c810de104e46#0d168cc5) 5:17.70 Compiling socket2 v0.3.19 5:19.52 Compiling memmap2 v0.3.0 5:20.01 Compiling memmap v0.7.0 5:23.86 Compiling tokio v0.2.18 5:31.98 Compiling chrono v0.4.19 5:36.03 Compiling ffi-support v0.4.3 5:37.04 Compiling dogear v0.4.0 5:38.44 Compiling zip v0.4.2 5:39.13 Compiling mozversion v0.4.1 (/tmp/B.13_9mzto/BUILD/firefox-93.0/testing/mozbase/rust/mozversion) 5:40.51 Compiling sha-1 v0.8.2 5:41.29 Compiling rand v0.7.3 5:41.96 Compiling tokio-util v0.3.1 5:45.69 Compiling gpu-descriptor-types v0.1.1 5:45.91 Compiling gpu-alloc-types v0.2.0 5:46.31 Compiling tokio-timer v0.2.11 5:48.19 Compiling tokio-current-thread v0.1.6 5:50.09 Compiling jobserver v0.1.22 5:53.57 Compiling nsstring v0.1.0 (/tmp/B.13_9mzto/BUILD/firefox-93.0/xpcom/rust/nsstring) 5:55.98 Compiling xmldecl v0.1.1 5:56.95 Compiling aho-corasick v0.7.18 5:58.15 Compiling chardetng v0.1.9 (https://github.com/hsivonen/chardetng?rev=302c995f91f44cf26e77dc4758ad56c3ff0153ad#302c995f) 6:00.61 Compiling paste-impl v0.1.18 6:06.53 Compiling crossbeam-channel v0.5.1 6:12.14 Compiling fluent-langneg v0.13.0 6:12.88 Compiling intl_pluralrules v7.0.1 6:15.16 Compiling intl-memoizer v0.5.1 6:16.47 Compiling generic-array v0.12.4 6:16.95 Compiling gl_generator v0.14.0 6:17.27 Compiling serde_repr v0.1.7 6:27.15 Compiling mozglue-static v0.1.0 (/tmp/B.13_9mzto/BUILD/firefox-93.0/mozglue/static/rust) 6:27.35 Compiling headers v0.3.2 6:28.13 Compiling cose-c v0.1.5 6:32.64 Compiling h2 v0.2.5 6:33.63 Compiling tempfile v3.1.0 6:36.14 Compiling pin-project v0.4.28 6:43.10 Compiling mozprofile v0.7.2 (/tmp/B.13_9mzto/BUILD/firefox-93.0/testing/mozbase/rust/mozprofile) 6:47.13 Compiling hyper v0.13.6 6:54.28 Compiling serde_urlencoded v0.6.1 6:54.88 Compiling plist v0.5.5 6:56.07 Compiling cstr v0.2.8 6:58.36 Compiling uuid v0.8.1 6:59.54 Compiling serde_yaml v0.8.17 7:01.31 Compiling marionette v0.1.0 (/tmp/B.13_9mzto/BUILD/firefox-93.0/testing/geckodriver/marionette) 7:01.99 Compiling rand_core v0.5.1 7:02.45 Compiling bytes v0.4.12 7:04.11 Compiling futures-cpupool v0.1.8 7:06.16 Compiling mio v0.6.23 (/tmp/B.13_9mzto/BUILD/firefox-93.0/third_party/rust/mio) 7:08.73 Compiling warp v0.2.2 7:10.55 Compiling mapped_hyph v0.4.3 (https://github.com/jfkthame/mapped_hyph.git?rev=746743227485a83123784df0c53227ab466612ed#74674322) 7:11.62 Compiling mozrunner v0.12.1 (/tmp/B.13_9mzto/BUILD/firefox-93.0/testing/mozbase/rust/mozrunner) 7:13.90 Compiling mozdevice v0.3.2 (/tmp/B.13_9mzto/BUILD/firefox-93.0/testing/mozbase/rust/mozdevice) 7:17.41 Compiling webdriver v0.43.1 (/tmp/B.13_9mzto/BUILD/firefox-93.0/testing/webdriver) 7:17.95 Compiling libudev v0.2.0 7:18.63 Compiling dirs v2.0.2 7:18.99 Compiling pulse v0.3.0 (https://github.com/mozilla/cubeb-pulse-rs?rev=0d168cc5be8865b21694b1b0c5a1c810de104e46#0d168cc5) 7:20.50 Compiling ordered-float v1.1.1 7:20.84 Compiling spirv v0.2.0+1.5.4 7:20.91 Compiling petgraph v0.5.1 7:26.33 Compiling flate2 v1.0.20 7:26.47 Compiling gpu-descriptor v0.2.1 7:26.80 Compiling gpu-alloc v0.5.0 7:28.48 Compiling build-parallel v0.1.2 7:28.85 Compiling nserror v0.1.0 (/tmp/B.13_9mzto/BUILD/firefox-93.0/xpcom/rust/nserror) 7:29.15 Compiling dbus v0.6.5 7:29.30 Compiling lmdb-rkv v0.14.0 7:30.40 Compiling regex v1.5.4 7:50.42 Compiling chardetng_c v0.1.2 (https://github.com/hsivonen/chardetng_c?rev=ed8a4c6f900a90d4dbc1d64b856e61490a1c3570#ed8a4c6f) 7:50.63 Compiling cexpr v0.4.0 7:56.88 Compiling glsl v4.0.3 7:58.25 Compiling paste v0.1.18 8:00.75 Compiling block-buffer v0.7.3 8:00.90 Compiling digest v0.8.1 8:01.08 Compiling gleam v0.13.1 8:11.27 Compiling synstructure v0.12.4 8:28.59 Compiling darling_core v0.10.2 8:34.44 Compiling rand_chacha v0.2.2 8:34.80 Compiling tokio-io v0.1.7 8:36.07 Compiling mio-uds v0.6.8 8:36.18 Compiling crossbeam-deque v0.8.1 8:36.52 Compiling crossbeam-deque v0.7.4 8:36.84 Compiling rand_pcg v0.2.1 8:37.16 Compiling cubeb-core v0.9.0 8:37.17 Compiling encoding_glue v0.1.0 (/tmp/B.13_9mzto/BUILD/firefox-93.0/intl/encoding_glue) 8:37.68 Compiling netwerk_helper v0.0.1 (/tmp/B.13_9mzto/BUILD/firefox-93.0/netwerk/base/rust-helper) 8:38.34 Compiling env_logger v0.8.4 8:39.51 Compiling fluent-pseudo v0.3.1 8:41.42 Compiling audio_thread_priority v0.23.4 8:42.61 Compiling glsl-to-cxx v0.1.0 (/tmp/B.13_9mzto/BUILD/firefox-93.0/gfx/wr/glsl-to-cxx) 9:13.55 Compiling thiserror-impl v1.0.25 9:26.91 Compiling xpcom_macros v0.1.0 (/tmp/B.13_9mzto/BUILD/firefox-93.0/xpcom/rust/xpcom/xpcom_macros) 9:28.14 Finished release [optimized] target(s) in 8m 04s 9:42.56 Compiling derive_more v0.99.11 9:45.70 Compiling serde_with_macros v1.1.0 9:52.74 accessible/base 9:53.77 Compiling cssparser v0.29.0 10:03.95 Compiling cssparser-macros v0.6.0 10:06.06 Compiling async-trait v0.1.42 10:26.49 Compiling profiler-macros v0.1.0 (/tmp/B.13_9mzto/BUILD/firefox-93.0/tools/profiler/rust-api/macros) 10:29.74 Compiling scroll_derive v0.10.5 10:30.64 Compiling inherent v0.1.6 10:36.23 Compiling prost-derive v0.6.1 10:36.50 Compiling rental-impl v0.5.5 10:39.80 accessible/basetypes 10:41.22 Compiling num-derive v0.3.3 10:48.84 Compiling sha2 v0.8.2 10:51.59 accessible/generic 10:55.99 Compiling malloc_size_of_derive v0.1.2 10:58.86 Compiling peek-poke-derive v0.2.1 (/tmp/B.13_9mzto/BUILD/firefox-93.0/gfx/wr/peek-poke/peek-poke-derive) 11:01.49 Compiling rand v0.7.3 11:03.80 Compiling tokio-reactor v0.1.3 11:05.36 Compiling tokio-codec v0.1.0 11:05.92 Compiling ouroboros_macro v0.9.2 11:10.74 Compiling tokio-threadpool v0.1.17 11:21.02 Compiling cubeb v0.9.0 11:21.24 Compiling cubeb-backend v0.9.0 11:21.40 Compiling mp4parse v0.11.5 (https://github.com/mozilla/mp4parse-rust?rev=72eb355ddeada541d7e57dbe5fb60eb5124dea0d#72eb355d) 11:22.18 Compiling darling_macro v0.10.2 11:25.83 Compiling thiserror v1.0.25 11:25.96 Compiling xpcom v0.1.0 (/tmp/B.13_9mzto/BUILD/firefox-93.0/xpcom/rust/xpcom) 11:30.87 Compiling gecko-profiler v0.1.0 (/tmp/B.13_9mzto/BUILD/firefox-93.0/tools/profiler/rust-api) 11:34.90 Compiling scroll v0.10.2 11:35.57 Compiling rust_cascade v0.6.0 11:38.01 Compiling jsrust_shared v0.1.0 (/tmp/B.13_9mzto/BUILD/firefox-93.0/js/src/rust/shared) 11:38.08 Compiling prost v0.6.1 11:39.07 Compiling uuid v0.8.1 11:39.71 Compiling tempfile v3.1.0 11:42.26 Compiling tokio-tcp v0.1.1 11:43.65 Compiling tokio-uds v0.2.5 11:45.39 Compiling tokio-udp v0.1.1 11:46.57 Compiling tokio-fs v0.1.3 11:48.47 Compiling phf_generator v0.8.0 11:48.62 Compiling cubeb-pulse v0.3.0 (https://github.com/mozilla/cubeb-pulse-rs?rev=0d168cc5be8865b21694b1b0c5a1c810de104e46#0d168cc5) 11:50.37 Compiling ouroboros v0.9.2 11:50.48 Compiling mp4parse_capi v0.11.5 (https://github.com/mozilla/mp4parse-rust?rev=72eb355ddeada541d7e57dbe5fb60eb5124dea0d#72eb355d) 11:51.44 Compiling darling v0.10.2 11:51.52 Compiling fluent-syntax v0.11.0 11:52.10 Compiling error-support v0.1.0 (https://github.com/mozilla/application-services?rev=8a576fbe79199fa8664f64285524017f74ebcc5f#8a576fbe) 11:52.22 Compiling rental v0.5.6 11:52.59 Compiling smallvec v1.6.1 11:53.45 Compiling url v2.1.0 11:59.57 Compiling bincode v1.3.3 11:59.64 Compiling euclid v0.22.6 11:59.89 Compiling chrono v0.4.19 12:00.64 Compiling app_units v0.7.1 12:00.84 Compiling serde_with v1.4.0 12:01.38 Compiling ron v0.6.2 12:02.58 Compiling naga v0.6.0 (https://github.com/gfx-rs/naga?rev=93db57c#93db57c1) 12:06.56 Compiling serde_bytes v0.11.5 12:07.05 Compiling wgpu-types v0.10.0 (https://github.com/kvark/wgpu?branch=gecko-beta-solaris#5a3a555b) 12:09.84 Compiling arrayvec v0.7.1 12:10.35 Compiling webrender_build v0.0.1 (/tmp/B.13_9mzto/BUILD/firefox-93.0/gfx/wr/webrender_build) 12:12.55 Compiling rust_decimal v1.14.2 12:13.45 Compiling goblin v0.1.3 12:14.93 Compiling toml v0.4.10 12:21.11 Compiling futures-executor v0.3.15 12:22.37 Compiling mdns_service v0.1.0 (/tmp/B.13_9mzto/BUILD/firefox-93.0/dom/media/webrtc/transport/mdns_service) 12:28.18 Compiling gkrust_utils v0.1.0 (/tmp/B.13_9mzto/BUILD/firefox-93.0/xpcom/rust/gkrust_utils) 12:28.50 Compiling tokio v0.1.11 12:29.38 Compiling phf_codegen v0.8.0 12:29.54 Compiling phf_macros v0.8.0 12:35.80 Compiling moz_task v0.1.0 (/tmp/B.13_9mzto/BUILD/firefox-93.0/xpcom/rust/moz_task) 12:36.85 Compiling storage_variant v0.1.0 (/tmp/B.13_9mzto/BUILD/firefox-93.0/storage/variant) 12:37.73 Compiling unic-langid-ffi v0.1.0 (/tmp/B.13_9mzto/BUILD/firefox-93.0/intl/locale/rust/unic-langid-ffi) 12:38.76 Compiling processtools v0.1.0 (/tmp/B.13_9mzto/BUILD/firefox-93.0/toolkit/components/processtools) 12:39.30 Compiling derive_common v0.0.1 (/tmp/B.13_9mzto/BUILD/firefox-93.0/servo/components/derive_common) 12:42.14 Compiling fluent-bundle v0.15.1 12:42.53 Compiling parking_lot_core v0.8.1 12:43.06 Compiling fallible v0.0.1 (/tmp/B.13_9mzto/BUILD/firefox-93.0/servo/components/fallible) 12:43.17 Compiling cascade_bloom_filter v0.1.0 (/tmp/B.13_9mzto/BUILD/firefox-93.0/toolkit/components/cascade_bloom_filter) 12:43.30 warning: using `procedural-masquerade` crate 12:43.30 --> toolkit/components/cascade_bloom_filter/src/lib.rs:24:1 12:43.30 | 12:43.30 24 | / rental! { 12:43.30 25 | | mod rentals { 12:43.30 26 | | use super::Cascade; 12:43.30 27 | | 12:43.30 ... | 12:43.30 33 | | } 12:43.30 34 | | } 12:43.30 | |_^ 12:43.30 | 12:43.30 = note: `#[warn(proc_macro_back_compat)]` on by default 12:43.30 = warning: this was previously accepted by the compiler but is being phased out; it will become a hard error in a future release! 12:43.30 = note: for more information, see issue #83125 <https://github.com/rust-lang/rust/issues/83125> 12:43.30 = note: The `procedural-masquerade` crate has been unnecessary since Rust 1.30.0. Versions of this crate below 0.1.7 will eventually stop compiling. 12:43.30 = note: this warning originates in the macro `rental` (in Nightly builds, run with -Z macro-backtrace for more info) 12:43.38 Compiling webrtc-sdp v0.3.8 12:44.06 warning: `cascade_bloom_filter` (lib) generated 1 warning 12:44.06 Compiling mozurl v0.0.1 (/tmp/B.13_9mzto/BUILD/firefox-93.0/netwerk/base/mozurl) 12:45.62 Compiling rusqlite v0.24.2 12:49.20 Compiling viaduct v0.1.0 (https://github.com/mozilla/application-services?rev=8a576fbe79199fa8664f64285524017f74ebcc5f#8a576fbe) 12:53.90 Compiling rkv v0.17.0 12:54.85 Compiling qlog v0.4.0 12:57.33 Compiling wr_malloc_size_of v0.0.1 (/tmp/B.13_9mzto/BUILD/firefox-93.0/gfx/wr/wr_malloc_size_of) 12:57.64 Compiling peek-poke v0.2.0 (/tmp/B.13_9mzto/BUILD/firefox-93.0/gfx/wr/peek-poke) 12:58.08 Compiling etagere v0.2.4 13:00.55 Compiling plane-split v0.17.1 13:01.32 Compiling sfv v0.8.0 13:01.77 Compiling object v0.16.0 13:04.71 Compiling swgl v0.1.0 (/tmp/B.13_9mzto/BUILD/firefox-93.0/gfx/wr/swgl) 13:06.10 Compiling webrender v0.61.0 (/tmp/B.13_9mzto/BUILD/firefox-93.0/gfx/wr/webrender) 13:07.09 Compiling futures v0.3.15 13:08.44 Compiling neqo-crypto v0.4.32 (https://github.com/mozilla/neqo?tag=v0.4.32#dbb04a53) 13:09.49 Compiling style v0.0.1 (/tmp/B.13_9mzto/BUILD/firefox-93.0/servo/components/style) 13:12.19 Compiling selectors v0.22.0 (/tmp/B.13_9mzto/BUILD/firefox-93.0/servo/components/selectors) 13:15.05 Compiling storage v0.1.0 (/tmp/B.13_9mzto/BUILD/firefox-93.0/storage/rust) 13:15.41 Compiling fluent-langneg-ffi v0.1.0 (/tmp/B.13_9mzto/BUILD/firefox-93.0/intl/locale/rust/fluent-langneg-ffi) 13:16.11 Compiling to_shmem_derive v0.0.1 (/tmp/B.13_9mzto/BUILD/firefox-93.0/servo/components/to_shmem_derive) 13:17.03 Compiling style_derive v0.0.1 (/tmp/B.13_9mzto/BUILD/firefox-93.0/servo/components/style_derive) 13:18.40 Compiling fluent v0.16.0 13:18.43 Compiling parking_lot v0.11.1 13:18.48 Compiling phf v0.8.0 13:18.66 Compiling rsdparsa_capi v0.1.0 (/tmp/B.13_9mzto/BUILD/firefox-93.0/dom/media/webrtc/sdp/rsdparsa_capi) 13:19.98 Compiling sync-guid v0.1.0 (https://github.com/mozilla/application-services?rev=8a576fbe79199fa8664f64285524017f74ebcc5f#8a576fbe) 13:21.03 Compiling sql-support v0.1.0 (https://github.com/mozilla/application-services?rev=8a576fbe79199fa8664f64285524017f74ebcc5f#8a576fbe) 13:21.55 Compiling glean-core v40.1.0 13:23.02 Compiling kvstore v0.1.0 (/tmp/B.13_9mzto/BUILD/firefox-93.0/toolkit/components/kvstore) 13:26.77 Compiling cert_storage v0.0.1 (/tmp/B.13_9mzto/BUILD/firefox-93.0/security/manager/ssl/cert_storage) 13:26.99 warning: using `procedural-masquerade` crate 13:26.99 --> security/manager/ssl/cert_storage/src/lib.rs:134:1 13:26.99 | 13:26.99 134 | / rental! { 13:26.99 135 | | mod holding { 13:26.99 136 | | use super::{Cascade, Mmap}; 13:26.99 137 | | 13:26.99 ... | 13:26.99 143 | | } 13:26.99 144 | | } 13:26.99 | |_^ 13:26.99 | 13:26.99 = note: `#[warn(proc_macro_back_compat)]` on by default 13:26.99 = warning: this was previously accepted by the compiler but is being phased out; it will become a hard error in a future release! 13:26.99 = note: for more information, see issue #83125 <https://github.com/rust-lang/rust/issues/83125> 13:26.99 = note: The `procedural-masquerade` crate has been unnecessary since Rust 1.30.0. Versions of this crate below 0.1.7 will eventually stop compiling. 13:26.99 = note: this warning originates in the macro `rental` (in Nightly builds, run with -Z macro-backtrace for more info) 13:31.31 Compiling webrender_api v0.61.0 (/tmp/B.13_9mzto/BUILD/firefox-93.0/gfx/wr/webrender_api) 13:32.89 Compiling http_sfv v0.1.0 (/tmp/B.13_9mzto/BUILD/firefox-93.0/netwerk/base/http-sfv) 13:37.78 warning: `cert_storage` (lib) generated 1 warning 13:37.78 Compiling profiler_helper v0.1.0 (/tmp/B.13_9mzto/BUILD/firefox-93.0/tools/profiler/rust-helper) 13:39.16 Compiling fluent-fallback v0.5.0 13:40.46 Compiling audioipc-server v0.2.3 (https://github.com/mozilla/audioipc-2?rev=7537bfadad2e981577eb75e4f13662fc517e1a09#7537bfad) 14:03.92 Compiling audioipc-client v0.4.0 (https://github.com/mozilla/audioipc-2?rev=7537bfadad2e981577eb75e4f13662fc517e1a09#7537bfad) 14:05.96 Compiling bookmark_sync v0.1.0 (/tmp/B.13_9mzto/BUILD/firefox-93.0/toolkit/components/places/bookmark_sync) 14:23.88 Compiling wgpu-hal v0.10.1 (https://github.com/kvark/wgpu?branch=gecko-beta-solaris#5a3a555b) 14:28.13 Compiling sync15-traits v0.1.0 (https://github.com/mozilla/application-services?rev=8a576fbe79199fa8664f64285524017f74ebcc5f#8a576fbe) 14:37.56 Compiling glean v40.1.0 14:48.94 Compiling glean-ffi v40.1.0 15:07.07 Compiling l10nregistry v0.2.0 (https://github.com/mozilla/l10nregistry-rs?rev=a69df9836b1ef536727195209013b9ad6b132618#a69df983) 15:15.92 Compiling to_shmem v0.0.1 (/tmp/B.13_9mzto/BUILD/firefox-93.0/servo/components/to_shmem) 15:18.86 Compiling golden_gate v0.1.0 (/tmp/B.13_9mzto/BUILD/firefox-93.0/services/sync/golden_gate) 15:31.84 Compiling fog v0.1.0 (/tmp/B.13_9mzto/BUILD/firefox-93.0/toolkit/components/glean/api) 15:37.99 Compiling fluent-ffi v0.1.0 (/tmp/B.13_9mzto/BUILD/firefox-93.0/intl/l10n/rust/fluent-ffi) 15:46.29 Compiling neqo-transport v0.4.32 (https://github.com/mozilla/neqo?tag=v0.4.32#dbb04a53) 16:13.51 Compiling app_services_logger v0.1.0 (/tmp/B.13_9mzto/BUILD/firefox-93.0/services/common/app_services_logger) 16:15.44 Compiling webext_storage_bridge v0.1.0 (/tmp/B.13_9mzto/BUILD/firefox-93.0/toolkit/components/extensions/storage/webext_storage_bridge) 16:16.20 Compiling wgpu_bindings v0.1.0 (/tmp/B.13_9mzto/BUILD/firefox-93.0/gfx/wgpu_bindings) 16:28.17 Compiling fog_control v0.1.0 (/tmp/B.13_9mzto/BUILD/firefox-93.0/toolkit/components/glean) 16:30.71 Compiling l10nregistry-ffi v0.1.0 (/tmp/B.13_9mzto/BUILD/firefox-93.0/intl/l10n/rust/l10nregistry-ffi) 16:32.89 Compiling neqo-qpack v0.4.32 (https://github.com/mozilla/neqo?tag=v0.4.32#dbb04a53) 16:43.03 Compiling gecko_logger v0.1.0 (/tmp/B.13_9mzto/BUILD/firefox-93.0/xpcom/rust/gecko_logger) 16:44.04 Compiling malloc_size_of v0.0.1 (/tmp/B.13_9mzto/BUILD/firefox-93.0/servo/components/malloc_size_of) 16:44.49 Compiling localization-ffi v0.1.0 (/tmp/B.13_9mzto/BUILD/firefox-93.0/intl/l10n/rust/localization-ffi) 16:46.66 Compiling neqo-http3 v0.4.32 (https://github.com/mozilla/neqo?tag=v0.4.32#dbb04a53) 17:00.38 Compiling style_traits v0.0.1 (/tmp/B.13_9mzto/BUILD/firefox-93.0/servo/components/style_traits) 17:02.18 Compiling neqo_glue v0.1.0 (/tmp/B.13_9mzto/BUILD/firefox-93.0/netwerk/socket/neqo_glue) 17:11.02 accessible/html 17:28.73 accessible/ipc/other 17:56.03 accessible/ipc 18:08.03 accessible/xpcom 18:11.99 accessible/xul 18:28.39 browser/app 18:30.14 Compiling geckoservo v0.0.1 (/tmp/B.13_9mzto/BUILD/firefox-93.0/servo/ports/geckolib) 18:31.23 memory/build 18:35.71 memory/mozalloc 18:36.73 mfbt 18:36.76 warning: unknown warning option '-Werror=trampolines' [-Wunknown-warning-option] 18:39.74 1 warning generated. 18:39.80 warning: unknown warning option '-Werror=trampolines' [-Wunknown-warning-option] 18:40.34 mozglue/baseprofiler 18:40.34 1 warning generated. 18:40.38 warning: unknown warning option '-Werror=trampolines' [-Wunknown-warning-option] 18:45.00 1 warning generated. 18:45.04 warning: unknown warning option '-Werror=trampolines' [-Wunknown-warning-option] 18:47.82 1 warning generated. 18:58.85 mozglue/build 18:58.99 mozglue/misc 19:00.82 xpcom/glue/standalone 19:06.27 browser/components/about 19:10.83 browser/components/shell 19:20.37 caps 19:23.50 chrome 19:40.63 config/external/rlbox 19:42.12 devtools/platform 19:45.90 devtools/shared/heapsnapshot 19:49.33 docshell/base 20:28.38 docshell/base/timeline 20:34.41 docshell/build 20:38.46 docshell/shistory 21:02.61 dom/abort 21:03.03 dom/animation 21:12.09 dom/audiochannel 21:21.03 dom/base 21:22.64 dom/battery 21:29.30 dom/bindings 21:38.51 dom/broadcastchannel 21:51.02 dom/cache 22:42.40 dom/canvas 25:41.89 dom/clients/api 27:37.85 dom/clients/manager 28:24.86 dom/commandhandler 28:30.14 dom/console 28:42.91 dom/credentialmanagement 28:52.72 dom/crypto 28:53.34 dom/debugger 29:07.16 dom/encoding 29:11.48 In file included from Unified_cpp_dom_encoding0.cpp:2: 29:11.49 /tmp/B.13_9mzto/BUILD/firefox-93.0/dom/encoding/TextDecoder.cpp:52:22: warning: result of comparison 'unsigned int' > 4294967295 is always false [-Wtautological-type-limit-compare] 29:11.49 needed.value() > std::numeric_limits<nsAString::size_type>::max()) { 29:11.49 ~~~~~~~~~~~~~~ ^ ~~~~~~~~~~~~~~~~~~~~~~~~~~~~~~~~~~~~~~~~~~~~~~~~ 29:12.37 1 warning generated. 29:12.39 dom/events 30:45.29 dom/fetch 30:46.64 dom/file/ipc 31:05.08 dom/file 31:05.84 dom/file/uri 31:06.56 dom/filehandle 31:17.63 dom/filesystem/compat 31:19.21 dom/filesystem 31:23.74 dom/flex 31:24.82 dom/gamepad 31:26.53 dom/geolocation 31:30.85 dom/grid 31:38.37 dom/html/input 31:39.25 dom/html 31:50.40 dom/indexedDB 32:59.20 In file included from Unified_cpp_dom_indexedDB0.cpp:128: 32:59.20 /tmp/B.13_9mzto/BUILD/firefox-93.0/dom/indexedDB/IDBObjectStore.cpp:208:41: warning: result of comparison 'nsTArray_base::size_type' (aka 'unsigned int') > 4294967295 is always false [-Wtautological-type-limit-compare] 32:59.20 if (cloneWriteInfo->mFiles.Length() > size_t(UINT32_MAX)) { 32:59.20 ~~~~~~~~~~~~~~~~~~~~~~~~~~~~~~~ ^ ~~~~~~~~~~~~~~~~~~ 32:59.20 /tmp/B.13_9mzto/BUILD/firefox-93.0/dom/indexedDB/IDBObjectStore.cpp:252:43: warning: result of comparison 'nsTArray_base::size_type' (aka 'unsigned int') > 4294967295 is always false [-Wtautological-type-limit-compare] 32:59.20 if (cloneWriteInfo->mFiles.Length() > size_t(UINT32_MAX)) { 32:59.20 ~~~~~~~~~~~~~~~~~~~~~~~~~~~~~~~ ^ ~~~~~~~~~~~~~~~~~~ 32:59.21 /tmp/B.13_9mzto/BUILD/firefox-93.0/dom/indexedDB/IDBObjectStore.cpp:321:38: warning: result of comparison 'nsTArray_base::size_type' (aka 'unsigned int') > 4294967295 is always false [-Wtautological-type-limit-compare] 32:59.21 if (cloneInfo->mFiles.Length() > size_t(UINT32_MAX)) { 32:59.21 ~~~~~~~~~~~~~~~~~~~~~~~~~~ ^ ~~~~~~~~~~~~~~~~~~ 32:59.21 /tmp/B.13_9mzto/BUILD/firefox-93.0/dom/indexedDB/IDBObjectStore.cpp:344:38: warning: result of comparison 'nsTArray_base::size_type' (aka 'unsigned int') > 4294967295 is always false [-Wtautological-type-limit-compare] 32:59.21 if (cloneInfo->mFiles.Length() > size_t(UINT32_MAX)) { 32:59.21 ~~~~~~~~~~~~~~~~~~~~~~~~~~ ^ ~~~~~~~~~~~~~~~~~~ 33:10.27 dom/ipc/jsactor 33:17.56 4 warnings generated. 33:17.61 dom/ipc 33:35.11 dom/jsurl 33:45.24 dom/l10n 33:56.62 dom/localstorage 33:58.19 dom/locks 34:08.45 dom/mathml 34:18.09 dom/media/autoplay 34:29.28 dom/media/bridge 34:37.92 dom/media/doctor 34:48.31 dom/media/eme 34:56.42 dom/media/encoder 35:11.09 dom/media/fake-cdm 35:14.86 dom/media/flac 35:16.03 dom/media/gmp-plugin-openh264 35:17.24 dom/media/gmp 35:24.77 dom/media/gmp/widevine-adapter 35:30.38 dom/media/imagecapture 35:39.55 dom/media/ipc 35:45.02 dom/media/mediacapabilities 35:46.70 dom/media/mediacontrol 36:09.07 dom/media/mediasession 36:14.35 dom/media/mediasink 36:26.65 dom/media/mediasource 36:40.26 dom/media/mp3 37:02.99 dom/media/mp4 37:16.63 dom/media/ogg 37:20.88 Compiling webrender_bindings v0.1.0 (/tmp/B.13_9mzto/BUILD/firefox-93.0/gfx/webrender_bindings) 37:21.06 dom/media/platforms/agnostic/bytestreams 37:25.13 dom/media/platforms/agnostic/eme 37:32.60 dom/media/platforms/agnostic/gmp 37:39.58 Compiling gkrust-shared v0.1.0 (/tmp/B.13_9mzto/BUILD/firefox-93.0/toolkit/library/rust/shared) 37:40.47 dom/media/platforms/ffmpeg/ffmpeg57 37:40.79 dom/media/platforms/ffmpeg/ffmpeg58 37:48.95 dom/media/platforms/ffmpeg/ffvpx 37:48.99 dom/media/platforms/ffmpeg/libav53 37:50.77 dom/media/platforms/ffmpeg/libav54 37:57.20 dom/media/platforms/ffmpeg/libav55 37:58.95 dom/media/platforms/ffmpeg 38:01.97 Compiling gkrust v0.1.0 (/tmp/B.13_9mzto/BUILD/firefox-93.0/toolkit/library/rust) 38:03.62 dom/media/platforms/omx 38:03.96 dom/media/platforms 38:25.60 dom/media/systemservices 38:25.60 dom/media 38:38.06 dom/media/utils 38:45.98 dom/media/wave 38:54.98 dom/media/webaudio/blink 38:55.81 dom/media/webaudio 39:03.60 dom/media/webm 40:00.38 dom/media/webrtc/common 40:00.40 warning: unknown warning option '-Werror=trampolines' [-Wunknown-warning-option] 40:00.50 1 warning generated. 40:03.52 dom/media/webrtc/jsapi 40:33.02 dom/media/webrtc/jsep 40:40.38 dom/media/webrtc/libwebrtcglue 40:49.19 dom/media/webrtc/sdp 41:06.62 dom/media/webrtc 41:07.96 dom/media/webrtc/transport/build 41:25.80 dom/media/webrtc/transport/ipc 41:38.18 dom/media/webrtc/transport/third_party/nICEr 41:38.20 warning: unknown warning option '-Werror=trampolines' [-Wunknown-warning-option] 41:41.18 1 warning generated. 41:41.22 warning: unknown warning option '-Werror=trampolines' [-Wunknown-warning-option] 41:43.34 1 warning generated. 41:43.38 warning: unknown warning option '-Werror=trampolines' [-Wunknown-warning-option] 41:43.47 1 warning generated. 41:43.48 dom/media/webrtc/transport/third_party/nrappkit 41:43.51 warning: unknown warning option '-Werror=trampolines' [-Wunknown-warning-option] 41:44.85 dom/media/webrtc/transportbridge 41:45.15 1 warning generated. 41:45.16 dom/media/webspeech/recognition 42:02.59 dom/media/webspeech/synth/speechd 42:03.91 dom/media/webspeech/synth 42:09.21 dom/media/webvtt 42:26.62 dom/messagechannel 42:27.51 dom/midi 42:28.04 dom/network 42:40.91 dom/notification 42:47.84 dom/offline 42:53.02 dom/payments/ipc 42:55.05 dom/payments 43:00.63 dom/performance 43:01.28 dom/permission 43:14.76 dom/plugins/base 43:18.68 dom/power 43:19.05 dom/prio 43:23.50 dom/promise 43:27.05 dom/prototype 43:33.70 dom/push 43:37.70 dom/quota 43:51.57 dom/reporting 43:52.27 dom/script 44:05.80 dom/security/featurepolicy 44:12.47 dom/security/sanitizer 44:12.87 dom/security 44:14.90 dom/serializers 44:19.48 dom/serviceworkers 44:59.04 dom/simpledb 45:04.41 dom/smil 45:10.01 dom/storage 45:19.21 dom/svg 45:23.64 dom/system 45:44.16 dom/u2f 46:21.30 dom/url 46:24.25 dom/vr 46:28.74 dom/webauthn 46:41.49 dom/webbrowserpersist 46:47.48 dom/webgpu 46:48.21 dom/websocket 47:07.74 dom/workers/remoteworkers 47:08.03 dom/workers/sharedworkers 47:18.63 dom/workers 47:26.61 dom/worklet 47:38.29 dom/xhr 47:45.43 dom/xml 47:49.25 Finished release [optimized] target(s) in 46m 25s 47:50.45 dom/xslt/base 47:53.73 dom/xslt/xml 47:57.79 dom/xslt/xpath 47:58.80 dom/xslt/xslt 48:02.10 dom/xul 48:19.13 editor/composer 48:23.42 editor/libeditor 48:25.43 editor/spellchecker 48:30.85 editor/txmgr 48:33.64 extensions/auth 48:39.83 extensions/permissions 48:45.68 extensions/pref/autoconfig/src 48:51.94 extensions/spellcheck/hunspell/glue 49:01.21 extensions/spellcheck/hunspell/src 49:04.39 In file included from <built-in>:3: 49:04.39 In file included from /tmp/B.13_9mzto/BUILD/firefox-93.0/extensions/spellcheck/hunspell/glue/hunspell_alloc_hooks.h:47: 49:04.39 In file included from /tmp/B.13_9mzto/BUILD/firefox-93.0/extensions/spellcheck/hunspell/glue/mozHunspellAllocator.h:10: 49:04.39 /tmp/B.13_9mzto/BUILD/firefox-93.0/obj-i686/dist/include/mozilla/CountingAllocatorBase.h:111:5: warning: instantiation of variable 'mozilla::CountingAllocatorBase<HunspellAllocator>::sAmount' required here, but no definition is available [-Wundefined-var-template] 49:04.39 sAmount -= MallocSizeOfOnFree(p); 49:04.39 ^ 49:04.39 /tmp/B.13_9mzto/BUILD/firefox-93.0/obj-i686/dist/include/js/Utility.h:411:3: note: in instantiation of member function 'mozilla::CountingAllocatorBase<HunspellAllocator>::CountingFree' requested here 49:04.39 free(p); 49:04.39 ^ 49:04.39 /tmp/B.13_9mzto/BUILD/firefox-93.0/extensions/spellcheck/hunspell/glue/hunspell_alloc_hooks.h:56:38: note: expanded from macro 'free' 49:04.39 #define free(ptr) HunspellAllocator::CountingFree(ptr) 49:04.39 ^ 49:04.39 /tmp/B.13_9mzto/BUILD/firefox-93.0/obj-i686/dist/include/mozilla/CountingAllocatorBase.h:150:21: note: forward declaration of template entity is here 49:04.39 static AmountType sAmount; 49:04.39 ^ 49:04.39 /tmp/B.13_9mzto/BUILD/firefox-93.0/obj-i686/dist/include/mozilla/CountingAllocatorBase.h:111:5: note: add an explicit instantiation declaration to suppress this warning if 'mozilla::CountingAllocatorBase<HunspellAllocator>::sAmount' is explicitly instantiated in another translation unit 49:04.39 sAmount -= MallocSizeOfOnFree(p); 49:04.39 ^ 49:13.15 extensions/spellcheck/src 49:16.94 gfx/2d 49:16.97 warning: unknown warning option '-Werror=trampolines' [-Wunknown-warning-option] 49:17.17 1 warning generated. 49:18.31 1 warning generated. 49:18.34 gfx/angle/targets/angle_common 49:18.37 warning: unknown warning option '-Werror=trampolines' [-Wunknown-warning-option] 49:18.69 1 warning generated. 49:20.73 gfx/angle/targets/preprocessor 49:39.79 gfx/angle/targets/translator 50:15.01 gfx/cairo/cairo/src 50:15.03 warning: unknown warning option '-Werror=trampolines' [-Wunknown-warning-option] 50:15.28 1 warning generated. 50:15.32 warning: unknown warning option '-Werror=trampolines' [-Wunknown-warning-option] 50:15.78 1 warning generated. 50:15.82 warning: unknown warning option '-Werror=trampolines' [-Wunknown-warning-option] 50:16.23 1 warning generated. 50:16.27 warning: unknown warning option '-Werror=trampolines' [-Wunknown-warning-option] 50:16.87 1 warning generated. 50:16.90 warning: unknown warning option '-Werror=trampolines' [-Wunknown-warning-option] 50:17.32 1 warning generated. 50:17.36 warning: unknown warning option '-Werror=trampolines' [-Wunknown-warning-option] 50:18.85 1 warning generated. 50:18.88 warning: unknown warning option '-Werror=trampolines' [-Wunknown-warning-option] 50:19.15 1 warning generated. 50:19.18 warning: unknown warning option '-Werror=trampolines' [-Wunknown-warning-option] 50:19.44 1 warning generated. 50:19.47 warning: unknown warning option '-Werror=trampolines' [-Wunknown-warning-option] 50:20.00 warning: unknown warning option '-Werror=trampolines' [-Wunknown-warning-option] 50:20.56 1 warning generated. 50:20.57 1 warning generated. 50:20.60 warning: unknown warning option '-Werror=trampolines' [-Wunknown-warning-option] 50:21.16 1 warning generated. 50:21.19 warning: unknown warning option '-Werror=trampolines' [-Wunknown-warning-option] 50:21.71 1 warning generated. 50:21.74 warning: unknown warning option '-Werror=trampolines' [-Wunknown-warning-option] 50:22.10 warning: unknown warning option '-Werror=trampolines' [-Wunknown-warning-option] 50:22.13 1 warning generated. 50:22.17 warning: unknown warning option '-Werror=trampolines' [-Wunknown-warning-option] 50:22.72 1 warning generated. 50:22.75 warning: unknown warning option '-Werror=trampolines' [-Wunknown-warning-option] 50:22.83 1 warning generated. 50:22.87 warning: unknown warning option '-Werror=trampolines' [-Wunknown-warning-option] 50:23.04 1 warning generated. 50:23.08 warning: unknown warning option '-Werror=trampolines' [-Wunknown-warning-option] 50:23.16 /tmp/B.13_9mzto/BUILD/firefox-93.0/gfx/cairo/cairo/src/cairo-pdf-surface.c:2436:9: warning: variable 'status' is used uninitialized whenever 'if' condition is true [-Wsometimes-uninitialized] 50:23.16 if (surface->base.status != CAIRO_STATUS_SUCCESS) 50:23.16 ^~~~~~~~~~~~~~~~~~~~~~~~~~~~~~~~~~~~~~~~~~~~ 50:23.16 /tmp/B.13_9mzto/BUILD/firefox-93.0/gfx/cairo/cairo/src/cairo-pdf-surface.c:2504:9: note: uninitialized use occurs here 50:23.16 if (status == CAIRO_STATUS_SUCCESS) 50:23.16 ^~~~~~ 50:23.16 /tmp/B.13_9mzto/BUILD/firefox-93.0/gfx/cairo/cairo/src/cairo-pdf-surface.c:2436:5: note: remove the 'if' if its condition is always false 50:23.16 if (surface->base.status != CAIRO_STATUS_SUCCESS) 50:23.16 ^~~~~~~~~~~~~~~~~~~~~~~~~~~~~~~~~~~~~~~~~~~~~~~~~ 50:23.16 /tmp/B.13_9mzto/BUILD/firefox-93.0/gfx/cairo/cairo/src/cairo-pdf-surface.c:2428:5: note: variable 'status' is declared here 50:23.16 cairo_status_t status, status2; 50:23.16 ^ 50:23.60 warning: unknown warning option '-Werror=trampolines' [-Wunknown-warning-option] 50:23.82 1 warning generated. 50:24.33 1 warning generated. 50:24.35 gfx/config 50:25.30 2 warnings generated. 50:25.33 warning: unknown warning option '-Werror=trampolines' [-Wunknown-warning-option] 50:26.63 1 warning generated. 50:26.66 warning: unknown warning option '-Werror=trampolines' [-Wunknown-warning-option] 50:27.17 1 warning generated. 50:27.21 warning: unknown warning option '-Werror=trampolines' [-Wunknown-warning-option] 50:27.68 1 warning generated. 50:27.71 warning: unknown warning option '-Werror=trampolines' [-Wunknown-warning-option] 50:28.54 1 warning generated. 50:28.58 warning: unknown warning option '-Werror=trampolines' [-Wunknown-warning-option] 50:29.32 1 warning generated. 50:29.35 warning: unknown warning option '-Werror=trampolines' [-Wunknown-warning-option] 50:30.10 1 warning generated. 50:30.13 warning: unknown warning option '-Werror=trampolines' [-Wunknown-warning-option] 50:30.60 1 warning generated. 50:30.63 warning: unknown warning option '-Werror=trampolines' [-Wunknown-warning-option] 50:30.85 1 warning generated. 50:30.88 warning: unknown warning option '-Werror=trampolines' [-Wunknown-warning-option] 50:31.79 1 warning generated. 50:31.82 warning: unknown warning option '-Werror=trampolines' [-Wunknown-warning-option] 50:32.13 1 warning generated. 50:32.17 warning: unknown warning option '-Werror=trampolines' [-Wunknown-warning-option] 50:32.58 1 warning generated. 50:32.61 warning: unknown warning option '-Werror=trampolines' [-Wunknown-warning-option] 50:33.00 1 warning generated. 50:33.04 warning: unknown warning option '-Werror=trampolines' [-Wunknown-warning-option] 50:33.33 1 warning generated. 50:33.36 warning: unknown warning option '-Werror=trampolines' [-Wunknown-warning-option] 50:34.05 gfx/gl 50:34.21 1 warning generated. 50:34.25 warning: unknown warning option '-Werror=trampolines' [-Wunknown-warning-option] 50:34.61 1 warning generated. 50:34.65 warning: unknown warning option '-Werror=trampolines' [-Wunknown-warning-option] 50:35.29 1 warning generated. 50:35.33 warning: unknown warning option '-Werror=trampolines' [-Wunknown-warning-option] 50:35.59 1 warning generated. 50:35.63 warning: unknown warning option '-Werror=trampolines' [-Wunknown-warning-option] 50:36.47 1 warning generated. 50:36.51 warning: unknown warning option '-Werror=trampolines' [-Wunknown-warning-option] 50:36.85 1 warning generated. 50:36.88 warning: unknown warning option '-Werror=trampolines' [-Wunknown-warning-option] 50:37.08 1 warning generated. 50:37.12 warning: unknown warning option '-Werror=trampolines' [-Wunknown-warning-option] 50:39.85 1 warning generated. 50:39.89 warning: unknown warning option '-Werror=trampolines' [-Wunknown-warning-option] 50:40.18 warning: unknown warning option '-Werror=trampolines' [-Wunknown-warning-option] 50:41.77 1 warning generated. 50:41.79 gfx/graphite2/src 50:42.90 1 warning generated. 50:42.93 warning: unknown warning option '-Werror=trampolines' [-Wunknown-warning-option] 50:43.57 In file included from Unified_c_gfx_cairo_cairo_src3.c:137: 50:43.57 /tmp/B.13_9mzto/BUILD/firefox-93.0/gfx/cairo/cairo/src/cairo-shape-mask-compositor.c:119:14: warning: equality comparison with extraneous parentheses [-Wparentheses-equality] 50:43.57 if ((status == CAIRO_INT_STATUS_SUCCESS)) { 50:43.57 ~~~~~~~^~~~~~~~~~~~~~~~~~~~~~~~~~~ 50:43.57 /tmp/B.13_9mzto/BUILD/firefox-93.0/gfx/cairo/cairo/src/cairo-shape-mask-compositor.c:119:14: note: remove extraneous parentheses around the comparison to silence this warning 50:43.57 if ((status == CAIRO_INT_STATUS_SUCCESS)) { 50:43.57 ~ ^ ~ 50:43.57 /tmp/B.13_9mzto/BUILD/firefox-93.0/gfx/cairo/cairo/src/cairo-shape-mask-compositor.c:119:14: note: use '=' to turn this equality comparison into an assignment 50:43.57 if ((status == CAIRO_INT_STATUS_SUCCESS)) { 50:43.57 ^~ 50:43.57 = 50:43.57 /tmp/B.13_9mzto/BUILD/firefox-93.0/gfx/cairo/cairo/src/cairo-shape-mask-compositor.c:213:14: warning: equality comparison with extraneous parentheses [-Wparentheses-equality] 50:43.57 if ((status == CAIRO_INT_STATUS_SUCCESS)) { 50:43.57 ~~~~~~~^~~~~~~~~~~~~~~~~~~~~~~~~~~ 50:43.57 /tmp/B.13_9mzto/BUILD/firefox-93.0/gfx/cairo/cairo/src/cairo-shape-mask-compositor.c:213:14: note: remove extraneous parentheses around the comparison to silence this warning 50:43.57 if ((status == CAIRO_INT_STATUS_SUCCESS)) { 50:43.57 ~ ^ ~ 50:43.57 /tmp/B.13_9mzto/BUILD/firefox-93.0/gfx/cairo/cairo/src/cairo-shape-mask-compositor.c:213:14: note: use '=' to turn this equality comparison into an assignment 50:43.57 if ((status == CAIRO_INT_STATUS_SUCCESS)) { 50:43.57 ^~ 50:43.57 = 50:43.57 /tmp/B.13_9mzto/BUILD/firefox-93.0/gfx/cairo/cairo/src/cairo-shape-mask-compositor.c:306:14: warning: equality comparison with extraneous parentheses [-Wparentheses-equality] 50:43.57 if ((status == CAIRO_INT_STATUS_SUCCESS)) { 50:43.57 ~~~~~~~^~~~~~~~~~~~~~~~~~~~~~~~~~~ 50:43.57 /tmp/B.13_9mzto/BUILD/firefox-93.0/gfx/cairo/cairo/src/cairo-shape-mask-compositor.c:306:14: note: remove extraneous parentheses around the comparison to silence this warning 50:43.57 if ((status == CAIRO_INT_STATUS_SUCCESS)) { 50:43.57 ~ ^ ~ 50:43.57 /tmp/B.13_9mzto/BUILD/firefox-93.0/gfx/cairo/cairo/src/cairo-shape-mask-compositor.c:306:14: note: use '=' to turn this equality comparison into an assignment 50:43.57 if ((status == CAIRO_INT_STATUS_SUCCESS)) { 50:43.57 ^~ 50:43.57 = 50:47.77 4 warnings generated. 50:47.80 warning: unknown warning option '-Werror=trampolines' [-Wunknown-warning-option] 50:49.13 gfx/harfbuzz/src 50:50.42 1 warning generated. 50:50.46 warning: unknown warning option '-Werror=trampolines' [-Wunknown-warning-option] 50:50.76 In file included from Unified_cpp_gfx_harfbuzz_src0.cpp:2: 50:50.76 In file included from /tmp/B.13_9mzto/BUILD/firefox-93.0/gfx/harfbuzz/src/hb-aat-layout.cc:35: 50:50.76 In file included from /tmp/B.13_9mzto/BUILD/firefox-93.0/gfx/harfbuzz/src/hb-aat-layout-kerx-table.hh:31: 50:50.76 In file included from /tmp/B.13_9mzto/BUILD/firefox-93.0/gfx/harfbuzz/src/hb-kern.hh:32: 50:50.76 In file included from /tmp/B.13_9mzto/BUILD/firefox-93.0/gfx/harfbuzz/src/hb-ot-layout-gpos-table.hh:32: 50:50.76 /tmp/B.13_9mzto/BUILD/firefox-93.0/gfx/harfbuzz/src/hb-ot-layout-gsubgpos.hh:1529:85: warning: possible misuse of comma operator here [-Wcomma] 50:50.76 && (c->buffer->unsafe_to_break (c->buffer->idx, c->buffer->idx + match_length), 50:50.76 ^ 50:50.76 /tmp/B.13_9mzto/BUILD/firefox-93.0/gfx/harfbuzz/src/hb-ot-layout-gsubgpos.hh:1529:11: note: cast expression to void to silence warning 50:50.76 && (c->buffer->unsafe_to_break (c->buffer->idx, c->buffer->idx + match_length), 50:50.76 ^~~~~~~~~~~~~~~~~~~~~~~~~~~~~~~~~~~~~~~~~~~~~~~~~~~~~~~~~~~~~~~~~~~~~~~~~~ 50:50.76 static_cast<void>( ) 50:50.81 In file included from Unified_c_gfx_cairo_cairo_src5.c:65: 50:50.81 /tmp/B.13_9mzto/BUILD/firefox-93.0/gfx/cairo/cairo/src/cairo.c:3305:22: warning: equality comparison with extraneous parentheses [-Wparentheses-equality] 50:50.81 if ((scaled_font == NULL)) { 50:50.81 ~~~~~~~~~~~~^~~~~~~ 50:50.81 /tmp/B.13_9mzto/BUILD/firefox-93.0/gfx/cairo/cairo/src/cairo.c:3305:22: note: remove extraneous parentheses around the comparison to silence this warning 50:50.81 if ((scaled_font == NULL)) { 50:50.81 ~ ^ ~ 50:50.81 /tmp/B.13_9mzto/BUILD/firefox-93.0/gfx/cairo/cairo/src/cairo.c:3305:22: note: use '=' to turn this equality comparison into an assignment 50:50.81 if ((scaled_font == NULL)) { 50:50.81 ^~ 50:50.81 = 50:50.93 /tmp/B.13_9mzto/BUILD/firefox-93.0/gfx/harfbuzz/src/hb-ot-layout-gsubgpos.hh:2429:77: warning: possible misuse of comma operator here [-Wcomma] 50:50.93 && (c->buffer->unsafe_to_break_from_outbuffer (start_index, end_index), 50:50.93 ^ 50:50.93 /tmp/B.13_9mzto/BUILD/firefox-93.0/gfx/harfbuzz/src/hb-ot-layout-gsubgpos.hh:2429:11: note: cast expression to void to silence warning 50:50.93 && (c->buffer->unsafe_to_break_from_outbuffer (start_index, end_index), 50:50.93 ^~~~~~~~~~~~~~~~~~~~~~~~~~~~~~~~~~~~~~~~~~~~~~~~~~~~~~~~~~~~~~~~~~ 50:50.93 static_cast<void>( ) 50:51.98 2 warnings generated. 50:52.06 In file included from Unified_cpp_gfx_harfbuzz_src0.cpp:65: 50:52.06 In file included from /tmp/B.13_9mzto/BUILD/firefox-93.0/gfx/harfbuzz/src/hb-font.cc:37: 50:52.06 /tmp/B.13_9mzto/BUILD/firefox-93.0/gfx/harfbuzz/src/hb-ot-var-fvar-table.hh:214:89: warning: possible misuse of comma operator here [-Wcomma] 50:52.06 return axes.lfind (tag, axis_index) && (axes[*axis_index].get_axis_deprecated (info), true); 50:52.06 ^ 50:52.06 /tmp/B.13_9mzto/BUILD/firefox-93.0/gfx/harfbuzz/src/hb-ot-var-fvar-table.hh:214:45: note: cast expression to void to silence warning 50:52.06 return axes.lfind (tag, axis_index) && (axes[*axis_index].get_axis_deprecated (info), true); 50:52.06 ^~~~~~~~~~~~~~~~~~~~~~~~~~~~~~~~~~~~~~~~~~~~ 50:52.06 static_cast<void>( ) 50:52.06 /tmp/B.13_9mzto/BUILD/firefox-93.0/gfx/harfbuzz/src/hb-ot-var-fvar-table.hh:223:68: warning: possible misuse of comma operator here [-Wcomma] 50:52.06 return axes.lfind (tag, &i) && (axes[i].get_axis_info (i, info), true); 50:52.06 ^ 50:52.06 /tmp/B.13_9mzto/BUILD/firefox-93.0/gfx/harfbuzz/src/hb-ot-var-fvar-table.hh:223:37: note: cast expression to void to silence warning 50:52.06 return axes.lfind (tag, &i) && (axes[i].get_axis_info (i, info), true); 50:52.06 ^~~~~~~~~~~~~~~~~~~~~~~~~~~~~~~ 50:52.06 static_cast<void>( ) 51:09.96 gfx/ipc 51:20.04 gfx/layers 51:52.33 4 warnings generated. 51:54.49 gfx/ots/src 51:55.64 In file included from Unified_cpp_gfx_ots_src0.cpp:20: 51:55.64 /tmp/B.13_9mzto/BUILD/firefox-93.0/gfx/ots/src/cff_charstring.cc:376:31: warning: comparison of integers of different signs: '__gnu_cxx::__alloc_traits<std::allocator<int>, int>::value_type' (aka 'int') and 'std::vector::size_type' (aka 'unsigned int') [-Wsign-compare] 51:55.64 if (argument_stack->top() >= cff.region_index_count.size()) { 51:55.64 ~~~~~~~~~~~~~~~~~~~~~ ^ ~~~~~~~~~~~~~~~~~~~~~~~~~~~~~ 51:55.64 /tmp/B.13_9mzto/BUILD/firefox-93.0/gfx/ots/src/cff_charstring.cc:393:25: warning: comparison of integers of different signs: 'int32_t' (aka 'int') and 'std::vector::size_type' (aka 'unsigned int') [-Wsign-compare] 51:55.64 if (*in_out_vsindex >= cff.region_index_count.size()) { 51:55.64 ~~~~~~~~~~~~~~~ ^ ~~~~~~~~~~~~~~~~~~~~~~~~~~~~~ 52:03.29 2 warnings generated. 53:06.10 gfx/skia 53:57.28 /tmp/B.13_9mzto/BUILD/firefox-93.0/gfx/skia/skia/src/core/SkXfermode.cpp:138:12: warning: 'return' will never be executed [-Wunreachable-code-return] 53:57.28 return false; 53:57.28 ^~~~~ 53:57.53 1 warning generated. 54:34.38 gfx/src 54:42.72 gfx/thebes 54:51.28 In file included from Unified_cpp_gfx_skia10.cpp:101: 54:51.28 In file included from /tmp/B.13_9mzto/BUILD/firefox-93.0/gfx/skia/skia/src/image/SkImage.cpp:34: 54:51.28 In file included from /tmp/B.13_9mzto/BUILD/firefox-93.0/gfx/skia/skia/include/gpu/GrBackendSurface.h:13: 54:51.28 In file included from /tmp/B.13_9mzto/BUILD/firefox-93.0/gfx/skia/skia/include/gpu/mock/GrMockTypes.h:12: 54:51.28 /tmp/B.13_9mzto/BUILD/firefox-93.0/gfx/skia/skia/include/private/GrTypesPriv.h:543:1: warning: non-void function does not return a value in all control paths [-Wreturn-type] 54:51.28 } 54:51.28 ^ 54:51.29 /tmp/B.13_9mzto/BUILD/firefox-93.0/gfx/skia/skia/include/private/GrTypesPriv.h:559:1: warning: non-void function does not return a value in all control paths [-Wreturn-type] 54:51.29 } 54:51.29 ^ 54:57.82 2 warnings generated. 55:08.54 gfx/vr/service/openvr 55:15.12 In file included from Unified_cpp_gfx_skia14.cpp:2: 55:15.12 /tmp/B.13_9mzto/BUILD/firefox-93.0/gfx/skia/skia/src/shaders/SkImageShader.cpp:86:39: warning: implicit conversion from 'const int32_t' (aka 'const int') to 'float' changes value from 2147483647 to 2147483648 [-Wimplicit-const-int-float-conversion] 55:15.12 const SkScalar max_fixed32dot32 = SK_MaxS32 * 0.25f; 55:15.12 ^~~~~~~~~ ~ 55:16.67 gfx/vr/service 55:23.66 1 warning generated. 55:42.61 gfx/vr 55:56.52 In file included from Unified_cpp_gfx_skia3.cpp:56: 55:56.52 /tmp/B.13_9mzto/BUILD/firefox-93.0/gfx/skia/skia/src/core/SkFont.cpp:180:17: warning: variable 'uni' is used uninitialized whenever 'if' condition is false [-Wsometimes-uninitialized] 55:56.52 SK_ABORT("unexpected enum"); 55:56.52 ^~~~~~~~~~~~~~~~~~~~~~~~~~~ 55:56.52 /tmp/B.13_9mzto/BUILD/firefox-93.0/gfx/skia/skia/include/core/SkPostConfig.h:131:14: note: expanded from macro 'SK_ABORT' 55:56.52 do { if (sk_abort_is_enabled()) { \ 55:56.52 ^~~~~~~~~~~~~~~~~~~~~ 55:56.52 /tmp/B.13_9mzto/BUILD/firefox-93.0/gfx/skia/skia/src/core/SkFont.cpp:182:16: note: uninitialized use occurs here 55:56.52 return uni; 55:56.52 ^~~ 55:56.52 /tmp/B.13_9mzto/BUILD/firefox-93.0/gfx/skia/skia/src/core/SkFont.cpp:180:17: note: remove the 'if' if its condition is always true 55:56.52 SK_ABORT("unexpected enum"); 55:56.52 ^ 55:56.52 /tmp/B.13_9mzto/BUILD/firefox-93.0/gfx/skia/skia/include/core/SkPostConfig.h:131:10: note: expanded from macro 'SK_ABORT' 55:56.52 do { if (sk_abort_is_enabled()) { \ 55:56.52 ^ 55:56.52 /tmp/B.13_9mzto/BUILD/firefox-93.0/gfx/skia/skia/src/core/SkFont.cpp:158:29: note: initialize the variable 'uni' to silence this warning 55:56.52 const SkUnichar* uni; 55:56.52 ^ 55:56.52 = nullptr 56:00.56 1 warning generated. 56:16.64 gfx/webrender_bindings 56:18.36 In file included from Unified_cpp_gfx_skia6.cpp:101: 56:18.36 In file included from /tmp/B.13_9mzto/BUILD/firefox-93.0/gfx/skia/skia/src/core/SkPromiseImageTexture.cpp:8: 56:18.36 In file included from /tmp/B.13_9mzto/BUILD/firefox-93.0/gfx/skia/skia/include/core/SkPromiseImageTexture.h:12: 56:18.36 In file included from /tmp/B.13_9mzto/BUILD/firefox-93.0/gfx/skia/skia/include/gpu/GrBackendSurface.h:13: 56:18.36 In file included from /tmp/B.13_9mzto/BUILD/firefox-93.0/gfx/skia/skia/include/gpu/mock/GrMockTypes.h:12: 56:18.36 /tmp/B.13_9mzto/BUILD/firefox-93.0/gfx/skia/skia/include/private/GrTypesPriv.h:543:1: warning: non-void function does not return a value in all control paths [-Wreturn-type] 56:18.36 } 56:18.36 ^ 56:18.36 /tmp/B.13_9mzto/BUILD/firefox-93.0/gfx/skia/skia/include/private/GrTypesPriv.h:559:1: warning: non-void function does not return a value in all control paths [-Wreturn-type] 56:18.36 } 56:18.36 ^ 56:22.19 2 warnings generated. 56:25.34 In file included from Unified_cpp_gfx_skia7.cpp:110: 56:25.34 In file included from /tmp/B.13_9mzto/BUILD/firefox-93.0/gfx/skia/skia/src/core/SkRemoteGlyphCache.cpp:23: 56:25.34 /tmp/B.13_9mzto/BUILD/firefox-93.0/gfx/skia/skia/src/core/SkTypeface_remote.h:66:75: warning: non-void function does not return a value in all control paths [-Wreturn-type] 56:25.34 int onGetUPEM() const override { SK_ABORT("Should never be called."); } 56:25.34 ^ 56:25.34 /tmp/B.13_9mzto/BUILD/firefox-93.0/gfx/skia/skia/src/core/SkTypeface_remote.h:69:5: warning: non-void function does not return a value in all control paths [-Wreturn-type] 56:25.34 } 56:25.34 ^ 56:25.34 /tmp/B.13_9mzto/BUILD/firefox-93.0/gfx/skia/skia/src/core/SkTypeface_remote.h:72:5: warning: non-void function does not return a value in all control paths [-Wreturn-type] 56:25.34 } 56:25.34 ^ 56:25.34 /tmp/B.13_9mzto/BUILD/firefox-93.0/gfx/skia/skia/src/core/SkTypeface_remote.h:75:5: warning: non-void function does not return a value in all control paths [-Wreturn-type] 56:25.34 } 56:25.34 ^ 56:25.34 /tmp/B.13_9mzto/BUILD/firefox-93.0/gfx/skia/skia/src/core/SkTypeface_remote.h:79:5: warning: non-void function does not return a value in all control paths [-Wreturn-type] 56:25.34 } 56:25.34 ^ 56:25.34 /tmp/B.13_9mzto/BUILD/firefox-93.0/gfx/skia/skia/src/core/SkTypeface_remote.h:83:5: warning: non-void function does not return a value in all control paths [-Wreturn-type] 56:25.34 } 56:25.34 ^ 56:25.34 /tmp/B.13_9mzto/BUILD/firefox-93.0/gfx/skia/skia/src/core/SkTypeface_remote.h:90:5: warning: non-void function does not return a value in all control paths [-Wreturn-type] 56:25.34 } 56:25.34 ^ 56:25.34 /tmp/B.13_9mzto/BUILD/firefox-93.0/gfx/skia/skia/src/core/SkTypeface_remote.h:93:5: warning: non-void function does not return a value in all control paths [-Wreturn-type] 56:25.34 } 56:25.34 ^ 56:25.34 /tmp/B.13_9mzto/BUILD/firefox-93.0/gfx/skia/skia/src/core/SkTypeface_remote.h:96:5: warning: non-void function does not return a value in all control paths [-Wreturn-type] 56:25.34 } 56:25.34 ^ 56:25.36 /tmp/B.13_9mzto/BUILD/firefox-93.0/gfx/skia/skia/src/core/SkTypeface_remote.h:119:5: warning: non-void function does not return a value in all control paths [-Wreturn-type] 56:25.36 } 56:25.36 ^ 56:25.36 /tmp/B.13_9mzto/BUILD/firefox-93.0/gfx/skia/skia/src/core/SkTypeface_remote.h:129:5: warning: non-void function does not return a value in all control paths [-Wreturn-type] 56:25.36 } 56:25.36 ^ 56:34.77 11 warnings generated. 56:36.41 gfx/ycbcr 56:40.56 hal 56:45.68 In file included from Unified_cpp_gfx_skia9.cpp:74: 56:45.68 /tmp/B.13_9mzto/BUILD/firefox-93.0/gfx/skia/skia/src/core/SkTextBlob.cpp:204:1: warning: non-void function does not return a value in all control paths [-Wreturn-type] 56:45.68 } 56:45.68 ^ 56:46.20 In file included from Unified_cpp_gfx_skia9.cpp:119: 56:46.20 In file included from /tmp/B.13_9mzto/BUILD/firefox-93.0/gfx/skia/skia/src/core/SkTypeface_remote.cpp:13: 56:46.20 /tmp/B.13_9mzto/BUILD/firefox-93.0/gfx/skia/skia/src/core/SkTypeface_remote.h:66:75: warning: non-void function does not return a value in all control paths [-Wreturn-type] 56:46.20 int onGetUPEM() const override { SK_ABORT("Should never be called."); } 56:46.20 ^ 56:46.20 /tmp/B.13_9mzto/BUILD/firefox-93.0/gfx/skia/skia/src/core/SkTypeface_remote.h:69:5: warning: non-void function does not return a value in all control paths [-Wreturn-type] 56:46.21 } 56:46.21 ^ 56:46.21 /tmp/B.13_9mzto/BUILD/firefox-93.0/gfx/skia/skia/src/core/SkTypeface_remote.h:72:5: warning: non-void function does not return a value in all control paths [-Wreturn-type] 56:46.21 } 56:46.21 ^ 56:46.21 /tmp/B.13_9mzto/BUILD/firefox-93.0/gfx/skia/skia/src/core/SkTypeface_remote.h:75:5: warning: non-void function does not return a value in all control paths [-Wreturn-type] 56:46.21 } 56:46.21 ^ 56:46.21 /tmp/B.13_9mzto/BUILD/firefox-93.0/gfx/skia/skia/src/core/SkTypeface_remote.h:79:5: warning: non-void function does not return a value in all control paths [-Wreturn-type] 56:46.21 } 56:46.21 ^ 56:46.21 /tmp/B.13_9mzto/BUILD/firefox-93.0/gfx/skia/skia/src/core/SkTypeface_remote.h:83:5: warning: non-void function does not return a value in all control paths [-Wreturn-type] 56:46.21 } 56:46.21 ^ 56:46.21 /tmp/B.13_9mzto/BUILD/firefox-93.0/gfx/skia/skia/src/core/SkTypeface_remote.h:90:5: warning: non-void function does not return a value in all control paths [-Wreturn-type] 56:46.21 } 56:46.21 ^ 56:46.21 /tmp/B.13_9mzto/BUILD/firefox-93.0/gfx/skia/skia/src/core/SkTypeface_remote.h:93:5: warning: non-void function does not return a value in all control paths [-Wreturn-type] 56:46.21 } 56:46.21 ^ 56:46.21 /tmp/B.13_9mzto/BUILD/firefox-93.0/gfx/skia/skia/src/core/SkTypeface_remote.h:96:5: warning: non-void function does not return a value in all control paths [-Wreturn-type] 56:46.21 } 56:46.21 ^ 56:46.21 /tmp/B.13_9mzto/BUILD/firefox-93.0/gfx/skia/skia/src/core/SkTypeface_remote.h:119:5: warning: non-void function does not return a value in all control paths [-Wreturn-type] 56:46.21 } 56:46.21 ^ 56:46.21 /tmp/B.13_9mzto/BUILD/firefox-93.0/gfx/skia/skia/src/core/SkTypeface_remote.h:129:5: warning: non-void function does not return a value in all control paths [-Wreturn-type] 56:46.21 } 56:46.21 ^ 56:46.21 In file included from Unified_cpp_gfx_skia9.cpp:119: 56:46.21 /tmp/B.13_9mzto/BUILD/firefox-93.0/gfx/skia/skia/src/core/SkTypeface_remote.cpp:32:1: warning: non-void function does not return a value in all control paths [-Wreturn-type] 56:46.21 } 56:46.21 ^ 56:48.51 13 warnings generated. 56:48.53 image/build 56:55.29 image/decoders/icon/gtk 57:10.71 image/decoders/icon 57:15.11 image/decoders 57:15.14 warning: unknown warning option '-Werror=trampolines' [-Wunknown-warning-option] 57:15.24 1 warning generated. 57:15.65 image/encoders/bmp 57:19.53 image/encoders/ico 57:22.15 image/encoders/jpeg 57:23.25 image/encoders/png 57:25.91 image 57:29.97 intl/components 57:38.76 intl/hyphenation/glue 57:39.71 intl/l10n 57:53.69 intl/locale/gtk 57:56.03 intl/locale 57:57.74 intl/lwbrk 58:00.51 intl/strres 58:02.68 intl/uconv 58:03.45 intl/unicharutil/util 58:05.82 ipc/app 58:07.46 toolkit/library/build/symverscript.stub 58:07.65 media/libsoundtouch/src 58:08.75 In file included from Unified_cpp_libsoundtouch_src0.cpp:20: 58:08.75 /tmp/B.13_9mzto/BUILD/firefox-93.0/media/libsoundtouch/src/FIRFilter.cpp:81:12: warning: unused variable 'dScaler' [-Wunused-variable] 58:08.75 double dScaler = 1.0 / (double)resultDivider; 58:08.75 ^ 58:08.75 /tmp/B.13_9mzto/BUILD/firefox-93.0/media/libsoundtouch/src/FIRFilter.cpp:127:12: warning: unused variable 'dScaler' [-Wunused-variable] 58:08.75 double dScaler = 1.0 / (double)resultDivider; 58:08.75 ^ 58:08.75 /tmp/B.13_9mzto/BUILD/firefox-93.0/media/libsoundtouch/src/FIRFilter.cpp:166:12: warning: unused variable 'dScaler' [-Wunused-variable] 58:08.75 double dScaler = 1.0 / (double)resultDivider; 58:08.75 ^ 58:08.77 In file included from Unified_cpp_libsoundtouch_src0.cpp:47: 58:08.77 /tmp/B.13_9mzto/BUILD/firefox-93.0/media/libsoundtouch/src/InterpolateShannon.cpp:71:9: warning: 'PI' macro redefined [-Wmacro-redefined] 58:08.77 #define PI 3.1415926536 58:08.77 ^ 58:08.77 /tmp/B.13_9mzto/BUILD/firefox-93.0/media/libsoundtouch/src/AAFilter.cpp:45:9: note: previous definition is here 58:08.77 #define PI M_PI 58:08.77 ^ 58:08.83 In file included from Unified_cpp_libsoundtouch_src0.cpp:92: 58:08.83 /tmp/B.13_9mzto/BUILD/firefox-93.0/media/libsoundtouch/src/cpu_detect_x86.cpp:48:12: warning: 'bit_MMX' macro redefined [-Wmacro-redefined] 58:08.83 #define bit_MMX (1 << 23) 58:08.83 ^ 58:08.83 /usr/lib/clang/12.0.1/include/cpuid.h:133:9: note: previous definition is here 58:08.83 #define bit_MMX 0x00800000 58:08.83 ^ 58:08.83 In file included from Unified_cpp_libsoundtouch_src0.cpp:92: 58:08.83 /tmp/B.13_9mzto/BUILD/firefox-93.0/media/libsoundtouch/src/cpu_detect_x86.cpp:49:12: warning: 'bit_SSE' macro redefined [-Wmacro-redefined] 58:08.83 #define bit_SSE (1 << 25) 58:08.83 ^ 58:08.83 /usr/lib/clang/12.0.1/include/cpuid.h:136:9: note: previous definition is here 58:08.83 #define bit_SSE 0x02000000 58:08.83 ^ 58:08.83 In file included from Unified_cpp_libsoundtouch_src0.cpp:92: 58:08.83 /tmp/B.13_9mzto/BUILD/firefox-93.0/media/libsoundtouch/src/cpu_detect_x86.cpp:50:12: warning: 'bit_SSE2' macro redefined [-Wmacro-redefined] 58:08.83 #define bit_SSE2 (1 << 26) 58:08.83 ^ 58:08.83 /usr/lib/clang/12.0.1/include/cpuid.h:137:9: note: previous definition is here 58:08.83 #define bit_SSE2 0x04000000 58:08.83 ^ 58:09.60 7 warnings generated. 58:09.61 config/external/sqlite/libmozsqlite3.so.symbols.stub 58:09.81 third_party/sqlite3/src 58:09.83 warning: unknown warning option '-Werror=trampolines' [-Wunknown-warning-option] 58:11.55 ipc/chromium 58:11.70 /tmp/B.13_9mzto/BUILD/firefox-93.0/third_party/sqlite3/src/sqlite3.c:161544:9: warning: code will never be executed [-Wunreachable-code] 58:11.70 YYMINORTYPE yylhsminor; 58:11.70 ^~~~~~~~~~~~~~~~~~~~~~~ 58:15.84 ipc/glue 58:19.07 ipc/ipdl 58:43.66 ipc/testshell 59:07.22 2 warnings generated. 59:07.24 js/ductwork/debugger 59:28.52 js/src/debugger 61:36.21 js/src/frontend 62:06.42 js/src/gc/StatsPhasesGenerated.inc.stub 63:17.34 js/src/irregexp 63:31.20 js/src/jit 63:31.70 js/src 63:33.38 js/src/wasm 64:08.75 modules/fdlibm/src 64:09.20 In file included from /tmp/B.13_9mzto/BUILD/firefox-93.0/modules/fdlibm/src/e_acos.cpp:44: 64:09.20 /tmp/B.13_9mzto/BUILD/firefox-93.0/modules/fdlibm/src/math_private.h:34:21: error: typedef redefinition with different types ('__double_t' (aka 'double') vs 'long double') 64:09.20 typedef __double_t double_t; 64:09.20 ^ 64:09.20 /usr/include/math.h:170:21: note: previous definition is here 64:09.20 typedef long double double_t; 64:09.20 ^ 64:09.31 1 error generated. 64:09.32 gmake[4]: *** [/tmp/B.13_9mzto/BUILD/firefox-93.0/config/rules.mk:676: e_acos.o] Error 1 64:09.32 gmake[3]: *** [/tmp/B.13_9mzto/BUILD/firefox-93.0/config/recurse.mk:72: modules/fdlibm/src/target-objects] Error 2 64:09.32 gmake[3]: *** Waiting for unfinished jobs.... 68:14.74 gmake[2]: *** [/tmp/B.13_9mzto/BUILD/firefox-93.0/config/recurse.mk:34: compile] Error 2 68:14.74 gmake[1]: *** [/tmp/B.13_9mzto/BUILD/firefox-93.0/config/rules.mk:358: default] Error 2 68:14.74 gmake: *** [client.mk:65: build] Error 2 68:14.76 43 compiler warnings present. 68:15.03 /usr/bin/notify-send --app-name=Mozilla Build System Mozilla Build System Build failed Config object not found by mach. Configure complete! Be sure to run |mach build| to pick up any changes error: Bad exit status from /tmp/B.13_9mzto/BUILD/tmp/rpm-tmp.hGow1U (%build) RPM build errors: line 562: It's not recommended to have unversioned Obsoletes: Obsoletes: firefox-lang-bn_IN Macro expanded in comment on line 2449: %{_datadir}/%{name}/browser/extensions/langpack-csb@firefox.mozilla.org.xpi Macro expanded in comment on line 2621: %{_datadir}/%{name}/browser/extensions/langpack-ku@firefox.mozilla.org.xpi Macro expanded in comment on line 2789: %{_datadir}/%{name}/browser/extensions/langpack-zu@firefox.mozilla.org.xpi Could not canonicalize hostname: nereid Bad exit status from /tmp/B.13_9mzto/BUILD/tmp/rpm-tmp.hGow1U (%build) ended at: Tue Oct 5 23:48:01 2021, done in 1:09:12.198345 error: No files produced. + chmod -R u+rwX /tmp/B.13_9mzto/BUILD + rm -rf /tmp/B.13_9mzto/tmp /tmp/B.13_9mzto/BUILD + rm -rf /tmp/B.13_9mzto Begin-PLD-Builder-Info Build-Time: user:15969.29s sys:324.01s real:4202.77s (faults io:87940 non-io:53832206) End-PLD-Builder-Info
[Back to list of logs] [View rpm -qa of builder]