FailedOk

th/SRPMS[OK]
th/x32[OK]
th/i686[OK]
th/x86_64[OK]

ac/SRPMS[OK]
ac/i386[OK]
ac/i586[OK]
ac/i686[OK]
ac/alpha[OK]
ac/amd64[OK]
ac/athlon[OK]
ac/ppc[OK]
ac/sparc[OK]
ac/sparc64[OK]

Advanced Search
main()
Powered by PLD Linux
(c) 2002-2021 PLD Team
$Revision: 1.37 $
Powered by foobar.
Your IP: 3.80.3.192

firefox d871e1f7-f313-4a89-ad48-c84360585cd2

Status:Failed
Source URL:https://buildlogs.pld-linux.org/pld/th/i686/FAIL/firefox,d871e1f7-f313-4a89-ad48-c84360585cd2.bz2
text/plain URL:View!
full text:View!
rpm -qa of builder:View!
Date:2021/10/05 23:48:19
Runtime:1:09:12.198345

Toc:

  • error 1
  • 64:09.20 /tmp/B.13_9mzto/BUILD/firefox-93.0/modules/fdlibm/src/math_private.h:34:21: error: typedef redefinition with different types ('__double_t' (aka 'double') vs 'long double')
  • error 2
  • 64:09.32 gmake[4]: *** [/tmp/B.13_9mzto/BUILD/firefox-93.0/config/rules.mk:676: e_acos.o] Error 1
  • error 3
  • 64:09.32 gmake[3]: *** [/tmp/B.13_9mzto/BUILD/firefox-93.0/config/recurse.mk:72: modules/fdlibm/src/target-objects] Error 2
  • error 4
  • 68:14.74 gmake[2]: *** [/tmp/B.13_9mzto/BUILD/firefox-93.0/config/recurse.mk:34: compile] Error 2
  • error 5
  • 68:14.74 gmake[1]: *** [/tmp/B.13_9mzto/BUILD/firefox-93.0/config/rules.mk:358: default] Error 2
  • error 6
  • error: Bad exit status from /tmp/B.13_9mzto/BUILD/tmp/rpm-tmp.hGow1U (%build)
  • error 7
  • RPM build errors:
  • error 8
  • error: No files produced.

Content:

56:46.21     }
56:46.21     ^
56:46.21 /tmp/B.13_9mzto/BUILD/firefox-93.0/gfx/skia/skia/src/core/SkTypeface_remote.h:96:5: warning: non-void function does not return a value in all control paths [-Wreturn-type]
56:46.21     }
56:46.21     ^
56:46.21 /tmp/B.13_9mzto/BUILD/firefox-93.0/gfx/skia/skia/src/core/SkTypeface_remote.h:119:5: warning: non-void function does not return a value in all control paths [-Wreturn-type]
56:46.21     }
56:46.21     ^
56:46.21 /tmp/B.13_9mzto/BUILD/firefox-93.0/gfx/skia/skia/src/core/SkTypeface_remote.h:129:5: warning: non-void function does not return a value in all control paths [-Wreturn-type]
56:46.21     }
56:46.21     ^
56:46.21 In file included from Unified_cpp_gfx_skia9.cpp:119:
56:46.21 /tmp/B.13_9mzto/BUILD/firefox-93.0/gfx/skia/skia/src/core/SkTypeface_remote.cpp:32:1: warning: non-void function does not return a value in all control paths [-Wreturn-type]
56:46.21 }
56:46.21 ^
56:48.51 13 warnings generated.
56:48.53 image/build
56:55.29 image/decoders/icon/gtk
57:10.71 image/decoders/icon
57:15.11 image/decoders
57:15.14 warning: unknown warning option '-Werror=trampolines' [-Wunknown-warning-option]
57:15.24 1 warning generated.
57:15.65 image/encoders/bmp
57:19.53 image/encoders/ico
57:22.15 image/encoders/jpeg
57:23.25 image/encoders/png
57:25.91 image
57:29.97 intl/components
57:38.76 intl/hyphenation/glue
57:39.71 intl/l10n
57:53.69 intl/locale/gtk
57:56.03 intl/locale
57:57.74 intl/lwbrk
58:00.51 intl/strres
58:02.68 intl/uconv
58:03.45 intl/unicharutil/util
58:05.82 ipc/app
58:07.46 toolkit/library/build/symverscript.stub
58:07.65 media/libsoundtouch/src
58:08.75 In file included from Unified_cpp_libsoundtouch_src0.cpp:20:
58:08.75 /tmp/B.13_9mzto/BUILD/firefox-93.0/media/libsoundtouch/src/FIRFilter.cpp:81:12: warning: unused variable 'dScaler' [-Wunused-variable]
58:08.75     double dScaler = 1.0 / (double)resultDivider;
58:08.75            ^
58:08.75 /tmp/B.13_9mzto/BUILD/firefox-93.0/media/libsoundtouch/src/FIRFilter.cpp:127:12: warning: unused variable 'dScaler' [-Wunused-variable]
58:08.75     double dScaler = 1.0 / (double)resultDivider;
58:08.75            ^
58:08.75 /tmp/B.13_9mzto/BUILD/firefox-93.0/media/libsoundtouch/src/FIRFilter.cpp:166:12: warning: unused variable 'dScaler' [-Wunused-variable]
58:08.75     double dScaler = 1.0 / (double)resultDivider;
58:08.75            ^
58:08.77 In file included from Unified_cpp_libsoundtouch_src0.cpp:47:
58:08.77 /tmp/B.13_9mzto/BUILD/firefox-93.0/media/libsoundtouch/src/InterpolateShannon.cpp:71:9: warning: 'PI' macro redefined [-Wmacro-redefined]
58:08.77 #define PI 3.1415926536
58:08.77         ^
58:08.77 /tmp/B.13_9mzto/BUILD/firefox-93.0/media/libsoundtouch/src/AAFilter.cpp:45:9: note: previous definition is here
58:08.77 #define PI       M_PI
58:08.77         ^
58:08.83 In file included from Unified_cpp_libsoundtouch_src0.cpp:92:
58:08.83 /tmp/B.13_9mzto/BUILD/firefox-93.0/media/libsoundtouch/src/cpu_detect_x86.cpp:48:12: warning: 'bit_MMX' macro redefined [-Wmacro-redefined]
58:08.83    #define bit_MMX     (1 << 23)
58:08.83            ^
58:08.83 /usr/lib/clang/12.0.1/include/cpuid.h:133:9: note: previous definition is here
58:08.83 #define bit_MMX         0x00800000
58:08.83         ^
58:08.83 In file included from Unified_cpp_libsoundtouch_src0.cpp:92:
58:08.83 /tmp/B.13_9mzto/BUILD/firefox-93.0/media/libsoundtouch/src/cpu_detect_x86.cpp:49:12: warning: 'bit_SSE' macro redefined [-Wmacro-redefined]
58:08.83    #define bit_SSE     (1 << 25)
58:08.83            ^
58:08.83 /usr/lib/clang/12.0.1/include/cpuid.h:136:9: note: previous definition is here
58:08.83 #define bit_SSE         0x02000000
58:08.83         ^
58:08.83 In file included from Unified_cpp_libsoundtouch_src0.cpp:92:
58:08.83 /tmp/B.13_9mzto/BUILD/firefox-93.0/media/libsoundtouch/src/cpu_detect_x86.cpp:50:12: warning: 'bit_SSE2' macro redefined [-Wmacro-redefined]
58:08.83    #define bit_SSE2    (1 << 26)
58:08.83            ^
58:08.83 /usr/lib/clang/12.0.1/include/cpuid.h:137:9: note: previous definition is here
58:08.83 #define bit_SSE2        0x04000000
58:08.83         ^
58:09.60 7 warnings generated.
58:09.61 config/external/sqlite/libmozsqlite3.so.symbols.stub
58:09.81 third_party/sqlite3/src
58:09.83 warning: unknown warning option '-Werror=trampolines' [-Wunknown-warning-option]
58:11.55 ipc/chromium
58:11.70 /tmp/B.13_9mzto/BUILD/firefox-93.0/third_party/sqlite3/src/sqlite3.c:161544:9: warning: code will never be executed [-Wunreachable-code]
58:11.70         YYMINORTYPE yylhsminor;
58:11.70         ^~~~~~~~~~~~~~~~~~~~~~~
58:15.84 ipc/glue
58:19.07 ipc/ipdl
58:43.66 ipc/testshell
59:07.22 2 warnings generated.
59:07.24 js/ductwork/debugger
59:28.52 js/src/debugger
61:36.21 js/src/frontend
62:06.42 js/src/gc/StatsPhasesGenerated.inc.stub
63:17.34 js/src/irregexp
63:31.20 js/src/jit
63:31.70 js/src
63:33.38 js/src/wasm
64:08.75 modules/fdlibm/src
64:09.20 In file included from /tmp/B.13_9mzto/BUILD/firefox-93.0/modules/fdlibm/src/e_acos.cpp:44:
64:09.20 /tmp/B.13_9mzto/BUILD/firefox-93.0/modules/fdlibm/src/math_private.h:34:21: error: typedef redefinition with different types ('__double_t' (aka 'double') vs 'long double')
64:09.20 typedef __double_t  double_t;
64:09.20                     ^
64:09.20 /usr/include/math.h:170:21: note: previous definition is here
64:09.20 typedef long double double_t;
64:09.20                     ^
64:09.31 1 error generated.
64:09.32 gmake[4]: *** [/tmp/B.13_9mzto/BUILD/firefox-93.0/config/rules.mk:676: e_acos.o] Error 1
64:09.32 gmake[3]: *** [/tmp/B.13_9mzto/BUILD/firefox-93.0/config/recurse.mk:72: modules/fdlibm/src/target-objects] Error 2
64:09.32 gmake[3]: *** Waiting for unfinished jobs....
68:14.74 gmake[2]: *** [/tmp/B.13_9mzto/BUILD/firefox-93.0/config/recurse.mk:34: compile] Error 2
68:14.74 gmake[1]: *** [/tmp/B.13_9mzto/BUILD/firefox-93.0/config/rules.mk:358: default] Error 2
68:14.74 gmake: *** [client.mk:65: build] Error 2
68:14.76 43 compiler warnings present.
68:15.03 /usr/bin/notify-send --app-name=Mozilla Build System Mozilla Build System Build failed
 Config object not found by mach.
Configure complete!
Be sure to run |mach build| to pick up any changes
error: Bad exit status from /tmp/B.13_9mzto/BUILD/tmp/rpm-tmp.hGow1U (%build)


RPM build errors:
    line 562: It's not recommended to have unversioned Obsoletes: Obsoletes:	firefox-lang-bn_IN
    Macro expanded in comment on line 2449: %{_datadir}/%{name}/browser/extensions/langpack-csb@firefox.mozilla.org.xpi

    Macro expanded in comment on line 2621: %{_datadir}/%{name}/browser/extensions/langpack-ku@firefox.mozilla.org.xpi

    Macro expanded in comment on line 2789: %{_datadir}/%{name}/browser/extensions/langpack-zu@firefox.mozilla.org.xpi

    Could not canonicalize hostname: nereid
    Bad exit status from /tmp/B.13_9mzto/BUILD/tmp/rpm-tmp.hGow1U (%build)
ended at: Tue Oct  5 23:48:01 2021, done in 1:09:12.198345
error: No files produced.
+ chmod -R u+rwX /tmp/B.13_9mzto/BUILD
+ rm -rf /tmp/B.13_9mzto/tmp /tmp/B.13_9mzto/BUILD
+ rm -rf /tmp/B.13_9mzto
Begin-PLD-Builder-Info
Build-Time: user:15969.29s sys:324.01s real:4202.77s (faults io:87940 non-io:53832206)

End-PLD-Builder-Info
[Back to list of logs] [View rpm -qa of builder]