FailedOk

th/SRPMS[OK]
th/x32[OK]
th/i686[OK]
th/x86_64[OK]

ac/SRPMS[OK]
ac/i386[OK]
ac/i586[OK]
ac/i686[OK]
ac/alpha[OK]
ac/amd64[OK]
ac/athlon[OK]
ac/ppc[OK]
ac/sparc[OK]
ac/sparc64[OK]

Advanced Search
main()
Powered by PLD Linux
(c) 2002-2022 PLD Team
$Revision: 1.37 $
Powered by ufo.
Your IP: 3.238.98.39

gl2ps 85670c26-4b0d-417b-9840-d412d710b9db

Status:Failed
Source URL:https://buildlogs.pld-linux.org/pld/th/i686/FAIL/gl2ps,85670c26-4b0d-417b-9840-d412d710b9db.bz2
text/plain URL:View!
rpm -qa of builder:View!
Date:2022/09/12 06:28:52
Runtime:0:00:03.702392

Toc:

  • prep
  • Executing(%prep): /bin/sh -e /tmp/B.0hvzpk35/BUILD/tmp/rpm-tmp.FGvzuG
  • build
  • Executing(%build): /bin/sh -e /tmp/B.0hvzpk35/BUILD/tmp/rpm-tmp.D9PxUO
  • error 1
  • ! LaTeX Error: File `ifxetex.sty' not found.
  • error 2
  • make[2]: *** [CMakeFiles/pdf.dir/build.make:76: gl2ps.pdf] Error 1
  • error 3
  • make[1]: *** [CMakeFiles/Makefile2:198: CMakeFiles/pdf.dir/all] Error 2
  • error 4
  • error: Bad exit status from /tmp/B.0hvzpk35/BUILD/tmp/rpm-tmp.D9PxUO (%build)
  • error 5
  • RPM build errors:
  • error 6
  • error: No files produced.

Content:

request from: qboosh
checking if we should skip the build
started at: Mon Sep 12 06:28:47 2022
killing old processes on a builder
sending signal 9 to pid -1
cleaning up /tmp
fetching https://srcbuilder.pld-linux.org/th//srpms/85670c26-4b0d-417b-9840-d412d710b9db/gl2ps-1.4.2-1.src.rpm
fetched 315140 bytes, 788.6 K/s
installing srpm: gl2ps-1.4.2-1.src.rpm
+ install -d /tmp/B.0hvzpk35/BUILD /tmp/B.0hvzpk35/RPMS
+ LC_ALL=en_US.UTF-8
+ rpm -qp --changelog gl2ps-1.4.2-1.src.rpm
* Mon Sep 12 2022 PLD Linux Team <feedback@pld-linux.org>
- For complete changelog see: http://git.pld-linux.org/?p=packages/gl2ps.git;a=log;h=master
* Sun Sep 11 2022 Jakub Bogusz <qboosh@pld-linux.org> 01f5f5d
- updated to 1.4.2 - updated link patch * Mon May 14 2018 Jakub Bogusz <qboosh@pld-linux.org> b5a578b
- updated to 1.4.0 * Tue Nov 24 2015 Jakub Bogusz <qboosh@pld-linux.org> c52d1f6
- updated to 1.3.9 * Mon Mar 09 2015 Jan Rękorajski <baggins@pld-linux.org> 63f734c
- release 3 (by relup.sh) * Tue Oct 29 2013 Arkadiusz Miśkiewicz <arekm@maven.pl> 99ea5f2
- release 2 (by relup.sh) * Fri Nov 30 2012 Jakub Bogusz <qboosh@pld-linux.org> 8185250
- updated to 1.3.8 * Thu Nov 15 2012 Jakub Bogusz <qboosh@pld-linux.org> f4df5f9
- updated to 1.3.7 - updated link patch * Sat Feb 11 2012 Adam Gołębiowski <adamg@pld-linux.org> 6ef79ad
- release 2 (rebuild against libpng-1.5) * Thu Aug 18 2011 Jakub Bogusz <qboosh@pld-linux.org> 30d9e52
- updated to 1.3.6 - added link patch * Sat May 29 2010 Tomasz Pala <gotar@pld-linux.org> 1b2c360
- rel. 4 as builders deny to do partial builds * Sat May 29 2010 Tomasz Pala <gotar@pld-linux.org> af77afe
- one more workaround * Sat May 29 2010 Tomasz Pala <gotar@pld-linux.org> 40497aa
- work around another shitty build system that can't cope with lib64 * Sat May 29 2010 Tomasz Pala <gotar@pld-linux.org> 1f4aac7
- switched build to cmake * Sat May 29 2010 Tomasz Pala <gotar@pld-linux.org> fce1db7
- upgraded to 1.3.5 * Tue Feb 13 2007 Elan Ruusamäe <glen@pld-linux.org> 6fb6e21
- tabs in preamble * Mon Feb 12 2007 Jan Rękorajski <baggins@pld-linux.org> 3cee7fc
- converted to UTF-8 * Tue Jan 09 2007 Robert Tomasik <rotom@pld-linux.org> 025d84b
- up to 1.3.2 * Sat Oct 29 2005 Jakub Bogusz <qboosh@pld-linux.org> 8692f6f
- pl desc, release 1 * Sat Oct 29 2005 Jakub Bogusz <qboosh@pld-linux.org> 01c29aa
- new, saving work + rpm -Uhv --nodeps --define '_topdir /tmp/B.0hvzpk35' --define '_specdir %{_topdir}' --define '_sourcedir %{_specdir}' --define '_rpmdir %{_topdir}/RPMS' --define '_builddir %{_topdir}/BUILD' gl2ps-1.4.2-1.src.rpm Updating / installing... gl2ps-1.4.2-1 ######################################## + rm -f gl2ps-1.4.2-1.src.rpm + install -m 700 -d /tmp/B.0hvzpk35/BUILD/tmp + TMPDIR=/tmp/B.0hvzpk35/BUILD/tmp + exec nice -n 0 rpmbuild -bp --short-circuit --nodeps --define '_topdir /tmp/B.0hvzpk35' --define '_specdir %{_topdir}' --define '_sourcedir %{_specdir}' --define '_rpmdir %{_topdir}/RPMS' --define '_builddir %{_topdir}/BUILD' --target i686-pld-linux --define 'prep exit 0' /tmp/B.0hvzpk35/gl2ps.spec warning: Could not canonicalize hostname: nereid Building target platforms: i686-pld-linux Building for target i686-pld-linux RPM build warnings: Could not canonicalize hostname: nereid checking BuildConflict-ing packages rpm: warning: Could not canonicalize hostname: nereid rpm: Building target platforms: i686-pld-linux rpm: Building for target i686-pld-linux rpm: rpm: RPM build warnings: rpm: Could not canonicalize hostname: nereid no BuildConflicts found checking BR rpm: warning: Could not canonicalize hostname: nereid rpm: Building target platforms: i686-pld-linux rpm: Building for target i686-pld-linux rpm: rpm: RPM build warnings: rpm: Could not canonicalize hostname: nereid no BR needed building RPM using: set -ex; : build-id: 85670c26-4b0d-417b-9840-d412d710b9db; TMPDIR=/tmp/B.0hvzpk35/BUILD/tmp exec nice -n 0 rpmbuild -bb --define '__jobs 9' --define '_smp_mflags -j9' --define '_make_opts -Otarget' --define '_pld_builder 1' --define '_topdir /tmp/B.0hvzpk35' --define '_specdir %{_topdir}' --define '_sourcedir %{_specdir}' --define '_rpmdir %{_topdir}/RPMS' --define '_builddir %{_topdir}/BUILD' --target i686-pld-linux /tmp/B.0hvzpk35/gl2ps.spec + : build-id: 85670c26-4b0d-417b-9840-d412d710b9db + TMPDIR=/tmp/B.0hvzpk35/BUILD/tmp + exec nice -n 0 rpmbuild -bb --define '__jobs 9' --define '_smp_mflags -j9' --define '_make_opts -Otarget' --define '_pld_builder 1' --define '_topdir /tmp/B.0hvzpk35' --define '_specdir %{_topdir}' --define '_sourcedir %{_specdir}' --define '_rpmdir %{_topdir}/RPMS' --define '_builddir %{_topdir}/BUILD' --target i686-pld-linux /tmp/B.0hvzpk35/gl2ps.spec warning: Could not canonicalize hostname: nereid Building target platforms: i686-pld-linux Building for target i686-pld-linux Executing(%prep): /bin/sh -e /tmp/B.0hvzpk35/BUILD/tmp/rpm-tmp.FGvzuG + umask 022 + cd /tmp/B.0hvzpk35/BUILD + cd /tmp/B.0hvzpk35/BUILD + rm -rf gl2ps-1.4.2 + /bin/gzip -dc /tmp/B.0hvzpk35/gl2ps-1.4.2.tgz + /bin/tar -xof - + STATUS=0 + '[' 0 -ne 0 ']' + cd gl2ps-1.4.2 + /bin/chmod -Rf a+rX,u+w,g-w,o-w . + echo 'Patch #0 (gl2ps-link.patch):' Patch #0 (gl2ps-link.patch): + </tmp/B.0hvzpk35/gl2ps-link.patch + /usr/bin/patch -s -f -p1 '--fuzz=0' + RPM_EC=0 + jobs -p + exit 0 Executing(%build): /bin/sh -e /tmp/B.0hvzpk35/BUILD/tmp/rpm-tmp.D9PxUO TMP=/home/users/builder/tmp HOME=/home/users/builder PATH=/home/users/builder/GNUstep/Tools:/bin:/usr/bin:/usr/local/bin:/home/users/builder/bin TMPDIR=/tmp/B.0hvzpk35/BUILD/tmp + umask 022 + cd /tmp/B.0hvzpk35/BUILD + cd gl2ps-1.4.2 + install -d build + cd build + CC=i686-pld-linux-gcc CXX=i686-pld-linux-g++ CPPFLAGS='' /usr/bin/cmake '-DCMAKE_VERBOSE_MAKEFILE:BOOL=ON' '-DCMAKE_BUILD_TYPE=PLD' '-DCMAKE_INSTALL_BINDIR:PATH=/usr/bin' '-DCMAKE_INSTALL_SBINDIR:PATH=/usr/sbin' '-DCMAKE_INSTALL_LIBEXECDIR:PATH=/usr/libexec' '-DCMAKE_INSTALL_SYSCONFDIR:PATH=/etc' '-DCMAKE_INSTALL_SHAREDSTATEDIRPATH:PATH=/var/lib' '-DCMAKE_INSTALL_LOCALSTATEDIRPATH:PATH=/var' '-DCMAKE_INSTALL_LIBDIR:PATH=/usr/lib' '-DCMAKE_INSTALL_INCLUDEDIR:PATH=/usr/include' '-DCMAKE_INSTALL_OLDINCLUDEDIR:PATH=/usr/include' '-DCMAKE_INSTALL_DATAROOTDIR:PATH=/usr/share' '-DCMAKE_INSTALL_DATADIR:PATH=/usr/share' '-DCMAKE_INSTALL_INFODIR:PATH=/usr/share/info' '-DCMAKE_INSTALL_LOCALEDIR:PATH=/usr/share/locale' '-DCMAKE_INSTALL_MANDIR:PATH=/usr/share/man' '-DCMAKE_INSTALL_DOCDIR:PATH=/usr/share/doc' '-DCMAKE_INSTALL_PREFIX:PATH=/usr' '-DSYSCONF_INSTALL_DIR:PATH=/etc' '-DCMAKE_CXX_FLAGS_PLD=-O2 -fwrapv -pipe -Wformat -Werror=format-security -gdwarf-4 -fno-debug-types-section -fvar-tracking-assignments -g2 -Wp,-D_FORTIFY_SOURCE=2 -fstack-protector-strong --param=ssp-buffer-size=4 -Werror=trampolines -fomit-frame-pointer -march=i686 -fasynchronous-unwind-tables -mtune=pentium4 -gdwarf-4 -fno-debug-types-section -fvar-tracking-assignments -g2 -DNDEBUG -DQT_NO_DEBUG' '-DCMAKE_C_FLAGS_PLD=-O2 -fwrapv -pipe -Wformat -Werror=format-security -gdwarf-4 -fno-debug-types-section -fvar-tracking-assignments -g2 -Wp,-D_FORTIFY_SOURCE=2 -fstack-protector-strong --param=ssp-buffer-size=4 -Werror=trampolines -fomit-frame-pointer -march=i686 -fasynchronous-unwind-tables -mtune=pentium4 -gdwarf-4 -fno-debug-types-section -fvar-tracking-assignments -g2 -DNDEBUG -DQT_NO_DEBUG' '-DCMAKE_Fortran_FLAGS_PLD=-O2 -fwrapv -pipe -Wformat -Werror=format-security -gdwarf-4 -fno-debug-types-section -fvar-tracking-assignments -g2 -Wp,-D_FORTIFY_SOURCE=2 -fstack-protector-strong --param=ssp-buffer-size=4 -Werror=trampolines -fomit-frame-pointer -march=i686 -fasynchronous-unwind-tables -mtune=pentium4 -gdwarf-4 -fno-debug-types-section -fvar-tracking-assignments -g2 -DNDEBUG -DQT_NO_DEBUG' '-DCMAKE_EXE_LINKER_FLAGS_PLD=-Wl,--as-needed -Wl,--no-copy-dt-needed-entries -Wl,-z,relro -Wl,-z,combreloc ' '-DCMAKE_SHARED_LINKER_FLAGS_PLD=-Wl,--as-needed -Wl,--no-copy-dt-needed-entries -Wl,-z,relro -Wl,-z,combreloc ' '-DCMAKE_MODULE_LINKER_FLAGS_PLD=-Wl,--as-needed -Wl,--no-copy-dt-needed-entries -Wl,-z,relro -Wl,-z,combreloc ' '-DBUILD_SHARED_LIBS:BOOL=ON' .. CMake Deprecation Warning at CMakeLists.txt:34 (cmake_minimum_required): Compatibility with CMake < 2.8.12 will be removed from a future version of CMake. Update the VERSION argument <min> value or use a ...<max> suffix to tell CMake that the project does not need compatibility with older versions. -- The C compiler identification is GNU 12.2.0 -- Detecting C compiler ABI info -- Detecting C compiler ABI info - done -- Check for working C compiler: /usr/bin/i686-pld-linux-gcc - skipped -- Detecting C compile features -- Detecting C compile features - done -- Looking for vsnprintf -- Looking for vsnprintf - found CMake Warning (dev) at /usr/share/cmake/Modules/FindOpenGL.cmake:315 (message): Policy CMP0072 is not set: FindOpenGL prefers GLVND by default when available. Run "cmake --help-policy CMP0072" for policy details. Use the cmake_policy command to set the policy and suppress this warning. FindOpenGL found both a legacy GL library: OPENGL_gl_LIBRARY: /usr/lib/libGL.so and GLVND libraries for OpenGL and GLX: OPENGL_opengl_LIBRARY: /usr/lib/libOpenGL.so OPENGL_glx_LIBRARY: /usr/lib/libGLX.so OpenGL_GL_PREFERENCE has not been set to "GLVND" or "LEGACY", so for compatibility with CMake 3.10 and below the legacy GL library will be used. Call Stack (most recent call first): CMakeLists.txt:94 (find_package) This warning is for project developers. Use -Wno-dev to suppress it. -- Found OpenGL: /usr/lib/libOpenGL.so -- Found GLUT: TRUE -- Found ZLIB: /usr/lib/libz.so (found version "1.2.12") -- Found PNG: /usr/lib/libpng.so (found version "1.6.37") -- Found LATEX: /usr/bin/latex -- Configuring done -- Generating done CMake Warning: Manually-specified variables were not used by the project: CMAKE_CXX_FLAGS_PLD CMAKE_Fortran_FLAGS_PLD CMAKE_INSTALL_BINDIR CMAKE_INSTALL_DATADIR CMAKE_INSTALL_DATAROOTDIR CMAKE_INSTALL_DOCDIR CMAKE_INSTALL_INCLUDEDIR CMAKE_INSTALL_INFODIR CMAKE_INSTALL_LIBDIR CMAKE_INSTALL_LIBEXECDIR CMAKE_INSTALL_LOCALEDIR CMAKE_INSTALL_LOCALSTATEDIRPATH CMAKE_INSTALL_MANDIR CMAKE_INSTALL_OLDINCLUDEDIR CMAKE_INSTALL_SBINDIR CMAKE_INSTALL_SHAREDSTATEDIRPATH CMAKE_INSTALL_SYSCONFDIR SYSCONF_INSTALL_DIR -- Build files have been written to: /tmp/B.0hvzpk35/BUILD/gl2ps-1.4.2/build + /usr/bin/make -Otarget -j9 /usr/bin/cmake -S/tmp/B.0hvzpk35/BUILD/gl2ps-1.4.2 -B/tmp/B.0hvzpk35/BUILD/gl2ps-1.4.2/build --check-build-system CMakeFiles/Makefile.cmake 0 /usr/bin/cmake -E cmake_progress_start /tmp/B.0hvzpk35/BUILD/gl2ps-1.4.2/build/CMakeFiles /tmp/B.0hvzpk35/BUILD/gl2ps-1.4.2/build//CMakeFiles/progress.marks /usr/bin/make -f CMakeFiles/Makefile2 all /usr/bin/make -f CMakeFiles/lib.dir/build.make CMakeFiles/lib.dir/depend /usr/bin/make -f CMakeFiles/shared.dir/build.make CMakeFiles/shared.dir/depend /usr/bin/make -f CMakeFiles/pdf.dir/build.make CMakeFiles/pdf.dir/depend make[2]: Entering directory '/tmp/B.0hvzpk35/BUILD/gl2ps-1.4.2/build' cd /tmp/B.0hvzpk35/BUILD/gl2ps-1.4.2/build && /usr/bin/cmake -E cmake_depends "Unix Makefiles" /tmp/B.0hvzpk35/BUILD/gl2ps-1.4.2 /tmp/B.0hvzpk35/BUILD/gl2ps-1.4.2 /tmp/B.0hvzpk35/BUILD/gl2ps-1.4.2/build /tmp/B.0hvzpk35/BUILD/gl2ps-1.4.2/build /tmp/B.0hvzpk35/BUILD/gl2ps-1.4.2/build/CMakeFiles/pdf.dir/DependInfo.cmake --color= make[2]: Leaving directory '/tmp/B.0hvzpk35/BUILD/gl2ps-1.4.2/build' make[2]: Entering directory '/tmp/B.0hvzpk35/BUILD/gl2ps-1.4.2/build' cd /tmp/B.0hvzpk35/BUILD/gl2ps-1.4.2/build && /usr/bin/cmake -E cmake_depends "Unix Makefiles" /tmp/B.0hvzpk35/BUILD/gl2ps-1.4.2 /tmp/B.0hvzpk35/BUILD/gl2ps-1.4.2 /tmp/B.0hvzpk35/BUILD/gl2ps-1.4.2/build /tmp/B.0hvzpk35/BUILD/gl2ps-1.4.2/build /tmp/B.0hvzpk35/BUILD/gl2ps-1.4.2/build/CMakeFiles/shared.dir/DependInfo.cmake --color= make[2]: Leaving directory '/tmp/B.0hvzpk35/BUILD/gl2ps-1.4.2/build' /usr/bin/make -f CMakeFiles/pdf.dir/build.make CMakeFiles/pdf.dir/build make[2]: Entering directory '/tmp/B.0hvzpk35/BUILD/gl2ps-1.4.2/build' cd /tmp/B.0hvzpk35/BUILD/gl2ps-1.4.2/build && /usr/bin/cmake -E cmake_depends "Unix Makefiles" /tmp/B.0hvzpk35/BUILD/gl2ps-1.4.2 /tmp/B.0hvzpk35/BUILD/gl2ps-1.4.2 /tmp/B.0hvzpk35/BUILD/gl2ps-1.4.2/build /tmp/B.0hvzpk35/BUILD/gl2ps-1.4.2/build /tmp/B.0hvzpk35/BUILD/gl2ps-1.4.2/build/CMakeFiles/lib.dir/DependInfo.cmake --color= make[2]: Leaving directory '/tmp/B.0hvzpk35/BUILD/gl2ps-1.4.2/build' /usr/bin/make -f CMakeFiles/lib.dir/build.make CMakeFiles/lib.dir/build /usr/bin/make -f CMakeFiles/shared.dir/build.make CMakeFiles/shared.dir/build make[2]: Entering directory '/tmp/B.0hvzpk35/BUILD/gl2ps-1.4.2/build' [ 11%] Generating gl2ps.pdf /usr/bin/pdflatex /tmp/B.0hvzpk35/BUILD/gl2ps-1.4.2/gl2ps.tex This is pdfTeXk, Version 3.1415926-1.40.9 (Web2C 7.5.7) %&-line parsing enabled. entering extended mode (/tmp/B.0hvzpk35/BUILD/gl2ps-1.4.2/gl2ps.tex LaTeX2e <2005/12/01> Babel <v3.8l> and hyphenation patterns for english, usenglishmax, dumylang, noh yphenation, german-x-2008-06-18, ngerman-x-2008-06-18, ancientgreek, ibycus, ar abic, basque, bulgarian, catalan, pinyin, coptic, croatian, czech, danish, dutc h, esperanto, estonian, farsi, finnish, french, galician, german, ngerman, mono greek, greek, hungarian, icelandic, indonesian, interlingua, irish, italian, la tin, mongolian, mongolian2a, bokmal, nynorsk, polish, portuguese, romanian, rus sian, sanskrit, serbian, slovak, slovenian, spanish, swedish, turkish, ukenglis h, ukrainian, uppersorbian, welsh, loaded. (/usr/share/texmf-dist/tex/latex/base/article.cls Document Class: article 2005/09/16 v1.4f Standard LaTeX document class (/usr/share/texmf-dist/tex/latex/base/size10.clo)) (/usr/share/texmf-dist/tex/latex/hyperref/hyperref.sty (/usr/share/texmf-dist/tex/latex/graphics/keyval.sty) (/usr/share/texmf-dist/tex/generic/oberdiek/ifpdf.sty) (/usr/share/texmf-dist/tex/generic/oberdiek/ifvtex.sty) ! LaTeX Error: File `ifxetex.sty' not found. Type X to quit or <RETURN> to proceed, or enter new name. (Default extension: sty) Enter file name: ! Emergency stop. <read *> l.100 \RequirePackage{ifxetex}[2006/08/21] ^^M ! ==> Fatal error occurred, no output PDF file produced! Transcript written on gl2ps.log. make[2]: *** [CMakeFiles/pdf.dir/build.make:76: gl2ps.pdf] Error 1 make[2]: Leaving directory '/tmp/B.0hvzpk35/BUILD/gl2ps-1.4.2/build' make[1]: *** [CMakeFiles/Makefile2:198: CMakeFiles/pdf.dir/all] Error 2 make[1]: *** Waiting for unfinished jobs.... make[2]: Entering directory '/tmp/B.0hvzpk35/BUILD/gl2ps-1.4.2/build' [ 33%] Building C object CMakeFiles/lib.dir/gl2ps.c.o /usr/bin/i686-pld-linux-gcc -DHAVE_PNG -DHAVE_ZLIB -O2 -fwrapv -pipe -Wformat -Werror=format-security -gdwarf-4 -fno-debug-types-section -fvar-tracking-assignments -g2 -Wp,-D_FORTIFY_SOURCE=2 -fstack-protector-strong --param=ssp-buffer-size=4 -Werror=trampolines -fomit-frame-pointer -march=i686 -fasynchronous-unwind-tables -mtune=pentium4 -gdwarf-4 -fno-debug-types-section -fvar-tracking-assignments -g2 -DNDEBUG -DQT_NO_DEBUG -MD -MT CMakeFiles/lib.dir/gl2ps.c.o -MF CMakeFiles/lib.dir/gl2ps.c.o.d -o CMakeFiles/lib.dir/gl2ps.c.o -c /tmp/B.0hvzpk35/BUILD/gl2ps-1.4.2/gl2ps.c make[2]: Leaving directory '/tmp/B.0hvzpk35/BUILD/gl2ps-1.4.2/build' make[2]: Entering directory '/tmp/B.0hvzpk35/BUILD/gl2ps-1.4.2/build' [ 44%] Linking C static library libgl2ps.a /usr/bin/cmake -P CMakeFiles/lib.dir/cmake_clean_target.cmake /usr/bin/cmake -E cmake_link_script CMakeFiles/lib.dir/link.txt --verbose=1 /usr/bin/ar qc libgl2ps.a CMakeFiles/lib.dir/gl2ps.c.o /usr/bin/ranlib libgl2ps.a make[2]: Leaving directory '/tmp/B.0hvzpk35/BUILD/gl2ps-1.4.2/build' make[1]: Entering directory '/tmp/B.0hvzpk35/BUILD/gl2ps-1.4.2/build' [ 44%] Built target lib make[1]: Leaving directory '/tmp/B.0hvzpk35/BUILD/gl2ps-1.4.2/build' make[2]: Entering directory '/tmp/B.0hvzpk35/BUILD/gl2ps-1.4.2/build' [ 22%] Building C object CMakeFiles/shared.dir/gl2ps.c.o /usr/bin/i686-pld-linux-gcc -DHAVE_PNG -DHAVE_ZLIB -Dshared_EXPORTS -O2 -fwrapv -pipe -Wformat -Werror=format-security -gdwarf-4 -fno-debug-types-section -fvar-tracking-assignments -g2 -Wp,-D_FORTIFY_SOURCE=2 -fstack-protector-strong --param=ssp-buffer-size=4 -Werror=trampolines -fomit-frame-pointer -march=i686 -fasynchronous-unwind-tables -mtune=pentium4 -gdwarf-4 -fno-debug-types-section -fvar-tracking-assignments -g2 -DNDEBUG -DQT_NO_DEBUG -fPIC -MD -MT CMakeFiles/shared.dir/gl2ps.c.o -MF CMakeFiles/shared.dir/gl2ps.c.o.d -o CMakeFiles/shared.dir/gl2ps.c.o -c /tmp/B.0hvzpk35/BUILD/gl2ps-1.4.2/gl2ps.c make[2]: Leaving directory '/tmp/B.0hvzpk35/BUILD/gl2ps-1.4.2/build' make[2]: Entering directory '/tmp/B.0hvzpk35/BUILD/gl2ps-1.4.2/build' [ 55%] Linking C shared library libgl2ps.so /usr/bin/cmake -E cmake_link_script CMakeFiles/shared.dir/link.txt --verbose=1 /usr/bin/i686-pld-linux-gcc -fPIC -O2 -fwrapv -pipe -Wformat -Werror=format-security -gdwarf-4 -fno-debug-types-section -fvar-tracking-assignments -g2 -Wp,-D_FORTIFY_SOURCE=2 -fstack-protector-strong --param=ssp-buffer-size=4 -Werror=trampolines -fomit-frame-pointer -march=i686 -fasynchronous-unwind-tables -mtune=pentium4 -gdwarf-4 -fno-debug-types-section -fvar-tracking-assignments -g2 -DNDEBUG -DQT_NO_DEBUG -Wl,--as-needed -Wl,--no-copy-dt-needed-entries -Wl,-z,relro -Wl,-z,combreloc -shared -Wl,-soname,libgl2ps.so.1 -o libgl2ps.so.1.4.2 CMakeFiles/shared.dir/gl2ps.c.o -lGL -lGLU -lglut -lz -lpng -lz -lm -lm -lpng -lm -lm /usr/bin/cmake -E cmake_symlink_library libgl2ps.so.1.4.2 libgl2ps.so.1 libgl2ps.so make[2]: Leaving directory '/tmp/B.0hvzpk35/BUILD/gl2ps-1.4.2/build' make[1]: Entering directory '/tmp/B.0hvzpk35/BUILD/gl2ps-1.4.2/build' [ 55%] Built target shared make[1]: Leaving directory '/tmp/B.0hvzpk35/BUILD/gl2ps-1.4.2/build' make: *** [Makefile:159: all] Error 2 error: Bad exit status from /tmp/B.0hvzpk35/BUILD/tmp/rpm-tmp.D9PxUO (%build) RPM build warnings: Could not canonicalize hostname: nereid RPM build errors: Bad exit status from /tmp/B.0hvzpk35/BUILD/tmp/rpm-tmp.D9PxUO (%build) ended at: Mon Sep 12 06:28:52 2022, done in 0:00:03.702392 error: No files produced. + chmod -R u+rwX /tmp/B.0hvzpk35/BUILD + rm -rf /tmp/B.0hvzpk35/tmp /tmp/B.0hvzpk35/BUILD + rm -rf /tmp/B.0hvzpk35 Begin-PLD-Builder-Info Build-Time: user:7.17s sys:1.09s real:5.70s (faults io:16 non-io:198556) End-PLD-Builder-Info
[Back to list of logs] [View rpm -qa of builder]