FailedOk

th/SRPMS[OK]
th/x32[OK]
th/i686[OK]
th/x86_64[OK]

ac/SRPMS[OK]
ac/i386[OK]
ac/i586[OK]
ac/i686[OK]
ac/alpha[OK]
ac/amd64[OK]
ac/athlon[OK]
ac/ppc[OK]
ac/sparc[OK]
ac/sparc64[OK]

Advanced Search
main()
Powered by PLD Linux
(c) 2002-2024 PLD Team
$Revision: 1.37 $
Powered by overclock.
Your IP: 44.213.60.33

gnucash e41e2ddf-3d6e-4024-9e58-d796431f150b

Status:Failed
Source URL:https://buildlogs.pld-linux.org/pld/th/i686/FAIL/gnucash,e41e2ddf-3d6e-4024-9e58-d796431f150b.bz2
text/plain URL:View!
full text:View!
rpm -qa of builder:View!
Date:2024/07/07 23:51:16
Runtime:0:00:26.177179

Toc:

  • error 1
  • make[2]: *** [bindings/python/CMakeFiles/swig-app-utils-python.dir/build.make:80: bindings/python/swig-app-utils-python.c] Error 1
  • error 2
  • make[1]: *** [CMakeFiles/Makefile2:10949: bindings/python/CMakeFiles/swig-app-utils-python.dir/all] Error 2
  • error 3
  • make[2]: *** [bindings/python/CMakeFiles/sw-app-utils-py.dir/build.make:78: bindings/python/swig-app-utils-python.c] Error 1
  • error 4
  • make[1]: *** [CMakeFiles/Makefile2:11189: bindings/python/CMakeFiles/sw-app-utils-py.dir/all] Error 2
  • error 5
  • make[2]: *** [bindings/python/CMakeFiles/gnucash-core-c-py.dir/build.make:109: bindings/python/gnucash_core.c] Error 1
  • error 6
  • make[1]: *** [CMakeFiles/Makefile2:11031: bindings/python/CMakeFiles/gnucash-core-c-py.dir/all] Error 2
  • error 7
  • make[2]: *** [bindings/python/CMakeFiles/swig-gnucash-core.dir/build.make:142: bindings/python/gnucash_core.c] Error 1
  • error 8
  • make[1]: *** [CMakeFiles/Makefile2:10897: bindings/python/CMakeFiles/swig-gnucash-core.dir/all] Error 2
  • error 9
  • error: Bad exit status from /tmp/B.ekzvm31q/BUILD/tmp/rpm-tmp.wMPr6V (%build)
  • error 10
  • RPM build errors:
  • error 11
  • error: No files produced.

Content:

make[2]: Leaving directory '/tmp/B.ekzvm31q/BUILD/gnucash-5.8/build'
make[2]: Entering directory '/tmp/B.ekzvm31q/BUILD/gnucash-5.8/build'
[ 22%] Generating ../share/locale/zh_TW/LC_MESSAGES/gnucash.mo
cd /tmp/B.ekzvm31q/BUILD/gnucash-5.8/build/po && /usr/bin/msgfmt -o /tmp/B.ekzvm31q/BUILD/gnucash-5.8/build/share/locale/zh_TW/LC_MESSAGES/gnucash.mo /tmp/B.ekzvm31q/BUILD/gnucash-5.8/po/zh_TW.po
make[2]: Leaving directory '/tmp/B.ekzvm31q/BUILD/gnucash-5.8/build'
make[2]: Entering directory '/tmp/B.ekzvm31q/BUILD/gnucash-5.8/build'
[ 21%] Generating ../share/locale/ru/LC_MESSAGES/gnucash.mo
cd /tmp/B.ekzvm31q/BUILD/gnucash-5.8/build/po && /usr/bin/msgfmt -o /tmp/B.ekzvm31q/BUILD/gnucash-5.8/build/share/locale/ru/LC_MESSAGES/gnucash.mo /tmp/B.ekzvm31q/BUILD/gnucash-5.8/po/ru.po
make[2]: Leaving directory '/tmp/B.ekzvm31q/BUILD/gnucash-5.8/build'
make[2]: Entering directory '/tmp/B.ekzvm31q/BUILD/gnucash-5.8/build'
cd /tmp/B.ekzvm31q/BUILD/gnucash-5.8/build/bindings/python && /usr/bin/cmake -E copy /tmp/B.ekzvm31q/BUILD/gnucash-5.8/build/bindings/python/sw_core_utils.py /tmp/B.ekzvm31q/BUILD/gnucash-5.8/build/lib/python3.10/site-packages/gnucash
make[2]: Leaving directory '/tmp/B.ekzvm31q/BUILD/gnucash-5.8/build'
make[2]: Entering directory '/tmp/B.ekzvm31q/BUILD/gnucash-5.8/build'
[  0%] Building C object common/test-core/CMakeFiles/jenny.dir/__/__/borrowed/jenny/jenny.c.o
cd /tmp/B.ekzvm31q/BUILD/gnucash-5.8/build/common/test-core && /usr/bin/i686-pld-linux-gcc -DHAVE_CONFIG_H -DHAVE_GUILE30 -D_GNU_SOURCE -I/tmp/B.ekzvm31q/BUILD/gnucash-5.8/build/common -I/tmp/B.ekzvm31q/BUILD/gnucash-5.8/common -I/tmp/B.ekzvm31q/BUILD/gnucash-5.8/libgnucash/engine -I/tmp/B.ekzvm31q/BUILD/gnucash-5.8/common/test-core -I/usr/include/guile/3.0 -I/usr -Werror -Wall -Wmissing-prototypes -Wmissing-declarations  -O2 -fwrapv -pipe -Wformat -Werror=format-security -gdwarf-4 -fno-debug-types-section -fvar-tracking-assignments -g2 -Wp,-D_FORTIFY_SOURCE=2 -fstack-protector-strong --param=ssp-buffer-size=4 -Werror=trampolines -fomit-frame-pointer -march=i686 -fasynchronous-unwind-tables -mtune=pentium4 -gdwarf-4 -fno-debug-types-section -fvar-tracking-assignments -g2  -DNDEBUG -DQT_NO_DEBUG -std=gnu11 -MD -MT common/test-core/CMakeFiles/jenny.dir/__/__/borrowed/jenny/jenny.c.o -MF CMakeFiles/jenny.dir/__/__/borrowed/jenny/jenny.c.o.d -o CMakeFiles/jenny.dir/__/__/borrowed/jenny/jenny.c.o -c /tmp/B.ekzvm31q/BUILD/gnucash-5.8/borrowed/jenny/jenny.c
make[2]: Leaving directory '/tmp/B.ekzvm31q/BUILD/gnucash-5.8/build'
make[2]: Entering directory '/tmp/B.ekzvm31q/BUILD/gnucash-5.8/build'
[ 22%] Generating ../share/locale/zh_CN/LC_MESSAGES/gnucash.mo
cd /tmp/B.ekzvm31q/BUILD/gnucash-5.8/build/po && /usr/bin/msgfmt -o /tmp/B.ekzvm31q/BUILD/gnucash-5.8/build/share/locale/zh_CN/LC_MESSAGES/gnucash.mo /tmp/B.ekzvm31q/BUILD/gnucash-5.8/po/zh_CN.po
make[2]: Leaving directory '/tmp/B.ekzvm31q/BUILD/gnucash-5.8/build'
make[2]: Entering directory '/tmp/B.ekzvm31q/BUILD/gnucash-5.8/build'
[ 21%] Generating ../share/locale/te/LC_MESSAGES/gnucash.mo
cd /tmp/B.ekzvm31q/BUILD/gnucash-5.8/build/po && /usr/bin/msgfmt -o /tmp/B.ekzvm31q/BUILD/gnucash-5.8/build/share/locale/te/LC_MESSAGES/gnucash.mo /tmp/B.ekzvm31q/BUILD/gnucash-5.8/po/te.po
make[2]: Leaving directory '/tmp/B.ekzvm31q/BUILD/gnucash-5.8/build'
make[2]: Entering directory '/tmp/B.ekzvm31q/BUILD/gnucash-5.8/build'
[ 21%] Generating ../share/locale/vi/LC_MESSAGES/gnucash.mo
cd /tmp/B.ekzvm31q/BUILD/gnucash-5.8/build/po && /usr/bin/msgfmt -o /tmp/B.ekzvm31q/BUILD/gnucash-5.8/build/share/locale/vi/LC_MESSAGES/gnucash.mo /tmp/B.ekzvm31q/BUILD/gnucash-5.8/po/vi.po
make[2]: Leaving directory '/tmp/B.ekzvm31q/BUILD/gnucash-5.8/build'
make[2]: Entering directory '/tmp/B.ekzvm31q/BUILD/gnucash-5.8/build'
[ 20%] Generating swig-core-utils-python.c, sw_core_utils.py
cd /tmp/B.ekzvm31q/BUILD/gnucash-5.8/build/bindings/python && /usr/bin/swig -python -Wall -Werror -I/usr/include/glib-2.0 -I/usr/lib/glib-2.0/include -I/usr/include -I/tmp/B.ekzvm31q/BUILD/gnucash-5.8/common -I/tmp/B.ekzvm31q/BUILD/gnucash-5.8/libgnucash/engine -I/tmp/B.ekzvm31q/BUILD/gnucash-5.8/libgnucash/app-utils -I/tmp/B.ekzvm31q/BUILD/gnucash-5.8/bindings -I/tmp/B.ekzvm31q/BUILD/gnucash-5.8/bindings/python -I/tmp/B.ekzvm31q/BUILD/gnucash-5.8/libgnucash/core-utils -o /tmp/B.ekzvm31q/BUILD/gnucash-5.8/build/bindings/python/swig-core-utils-python.c /tmp/B.ekzvm31q/BUILD/gnucash-5.8/bindings/core-utils.i
make[2]: Leaving directory '/tmp/B.ekzvm31q/BUILD/gnucash-5.8/build'
make[1]: Entering directory '/tmp/B.ekzvm31q/BUILD/gnucash-5.8/build'
[ 25%] Built target sw-core-utils-py
make[1]: Leaving directory '/tmp/B.ekzvm31q/BUILD/gnucash-5.8/build'
make[2]: Entering directory '/tmp/B.ekzvm31q/BUILD/gnucash-5.8/build'
[ 21%] Generating ../share/locale/ta/LC_MESSAGES/gnucash.mo
cd /tmp/B.ekzvm31q/BUILD/gnucash-5.8/build/po && /usr/bin/msgfmt -o /tmp/B.ekzvm31q/BUILD/gnucash-5.8/build/share/locale/ta/LC_MESSAGES/gnucash.mo /tmp/B.ekzvm31q/BUILD/gnucash-5.8/po/ta.po
make[2]: Leaving directory '/tmp/B.ekzvm31q/BUILD/gnucash-5.8/build'
make[2]: Entering directory '/tmp/B.ekzvm31q/BUILD/gnucash-5.8/build'
[ 22%] Building C object libgnucash/core-utils/CMakeFiles/gnc-core-utils.dir/binreloc.c.o
cd /tmp/B.ekzvm31q/BUILD/gnucash-5.8/build/libgnucash/core-utils && /usr/bin/i686-pld-linux-gcc -DGLIB_VERSION_MAX_ALLOWED=GLIB_VERSION_2_56 -DGLIB_VERSION_MIN_REQUIRED=GLIB_VERSION_2_56 -DG_LOG_DOMAIN=\"gnc.core-utils\" -DHAVE_CONFIG_H -DHAVE_GUILE30 -D_GNU_SOURCE -Dgnc_core_utils_EXPORTS -I/tmp/B.ekzvm31q/BUILD/gnucash-5.8/common -I/tmp/B.ekzvm31q/BUILD/gnucash-5.8/build/common -I/tmp/B.ekzvm31q/BUILD/gnucash-5.8/build/libgnucash/core-utils -I/tmp/B.ekzvm31q/BUILD/gnucash-5.8/libgnucash/core-utils -isystem /usr/include/glib-2.0 -isystem /usr/lib/glib-2.0/include -Werror -Wall -Wmissing-prototypes -Wmissing-declarations  -O2 -fwrapv -pipe -Wformat -Werror=format-security -gdwarf-4 -fno-debug-types-section -fvar-tracking-assignments -g2 -Wp,-D_FORTIFY_SOURCE=2 -fstack-protector-strong --param=ssp-buffer-size=4 -Werror=trampolines -fomit-frame-pointer -march=i686 -fasynchronous-unwind-tables -mtune=pentium4 -gdwarf-4 -fno-debug-types-section -fvar-tracking-assignments -g2  -DNDEBUG -DQT_NO_DEBUG -std=gnu11 -fPIC -MD -MT libgnucash/core-utils/CMakeFiles/gnc-core-utils.dir/binreloc.c.o -MF CMakeFiles/gnc-core-utils.dir/binreloc.c.o.d -o CMakeFiles/gnc-core-utils.dir/binreloc.c.o -c /tmp/B.ekzvm31q/BUILD/gnucash-5.8/libgnucash/core-utils/binreloc.c
make[2]: Leaving directory '/tmp/B.ekzvm31q/BUILD/gnucash-5.8/build'
make[2]: Entering directory '/tmp/B.ekzvm31q/BUILD/gnucash-5.8/build'
[ 25%] Building C object libgnucash/core-utils/CMakeFiles/gnc-core-utils.dir/gnc-version.c.o
cd /tmp/B.ekzvm31q/BUILD/gnucash-5.8/build/libgnucash/core-utils && /usr/bin/i686-pld-linux-gcc -DGLIB_VERSION_MAX_ALLOWED=GLIB_VERSION_2_56 -DGLIB_VERSION_MIN_REQUIRED=GLIB_VERSION_2_56 -DG_LOG_DOMAIN=\"gnc.core-utils\" -DHAVE_CONFIG_H -DHAVE_GUILE30 -D_GNU_SOURCE -Dgnc_core_utils_EXPORTS -I/tmp/B.ekzvm31q/BUILD/gnucash-5.8/common -I/tmp/B.ekzvm31q/BUILD/gnucash-5.8/build/common -I/tmp/B.ekzvm31q/BUILD/gnucash-5.8/build/libgnucash/core-utils -I/tmp/B.ekzvm31q/BUILD/gnucash-5.8/libgnucash/core-utils -isystem /usr/include/glib-2.0 -isystem /usr/lib/glib-2.0/include -Werror -Wall -Wmissing-prototypes -Wmissing-declarations  -O2 -fwrapv -pipe -Wformat -Werror=format-security -gdwarf-4 -fno-debug-types-section -fvar-tracking-assignments -g2 -Wp,-D_FORTIFY_SOURCE=2 -fstack-protector-strong --param=ssp-buffer-size=4 -Werror=trampolines -fomit-frame-pointer -march=i686 -fasynchronous-unwind-tables -mtune=pentium4 -gdwarf-4 -fno-debug-types-section -fvar-tracking-assignments -g2  -DNDEBUG -DQT_NO_DEBUG -std=gnu11 -fPIC -MD -MT libgnucash/core-utils/CMakeFiles/gnc-core-utils.dir/gnc-version.c.o -MF CMakeFiles/gnc-core-utils.dir/gnc-version.c.o.d -o CMakeFiles/gnc-core-utils.dir/gnc-version.c.o -c /tmp/B.ekzvm31q/BUILD/gnucash-5.8/libgnucash/core-utils/gnc-version.c
make[2]: Leaving directory '/tmp/B.ekzvm31q/BUILD/gnucash-5.8/build'
make[1]: Entering directory '/tmp/B.ekzvm31q/BUILD/gnucash-5.8/build'
[ 25%] Built target swig-core-utils-python
make[1]: Leaving directory '/tmp/B.ekzvm31q/BUILD/gnucash-5.8/build'
make[2]: Entering directory '/tmp/B.ekzvm31q/BUILD/gnucash-5.8/build'
[ 21%] Generating ../share/locale/ur/LC_MESSAGES/gnucash.mo
cd /tmp/B.ekzvm31q/BUILD/gnucash-5.8/build/po && /usr/bin/msgfmt -o /tmp/B.ekzvm31q/BUILD/gnucash-5.8/build/share/locale/ur/LC_MESSAGES/gnucash.mo /tmp/B.ekzvm31q/BUILD/gnucash-5.8/po/ur.po
make[2]: Leaving directory '/tmp/B.ekzvm31q/BUILD/gnucash-5.8/build'
make[2]: Entering directory '/tmp/B.ekzvm31q/BUILD/gnucash-5.8/build'
[ 25%] Linking C executable ../../bin/jenny
cd /tmp/B.ekzvm31q/BUILD/gnucash-5.8/build/common/test-core && /usr/bin/cmake -E cmake_link_script CMakeFiles/jenny.dir/link.txt --verbose=1
/usr/bin/i686-pld-linux-gcc -Werror -Wall -Wmissing-prototypes -Wmissing-declarations  -O2 -fwrapv -pipe -Wformat -Werror=format-security -gdwarf-4 -fno-debug-types-section -fvar-tracking-assignments -g2 -Wp,-D_FORTIFY_SOURCE=2 -fstack-protector-strong --param=ssp-buffer-size=4 -Werror=trampolines -fomit-frame-pointer -march=i686 -fasynchronous-unwind-tables -mtune=pentium4 -gdwarf-4 -fno-debug-types-section -fvar-tracking-assignments -g2  -DNDEBUG -DQT_NO_DEBUG -Wl,--as-needed -Wl,--no-copy-dt-needed-entries -Wl,-z,relro -Wl,-z,combreloc CMakeFiles/jenny.dir/__/__/borrowed/jenny/jenny.c.o -o ../../bin/jenny 
make[2]: Leaving directory '/tmp/B.ekzvm31q/BUILD/gnucash-5.8/build'
make[1]: Entering directory '/tmp/B.ekzvm31q/BUILD/gnucash-5.8/build'
[ 25%] Built target po-gmo
make[1]: Leaving directory '/tmp/B.ekzvm31q/BUILD/gnucash-5.8/build'
make[1]: Entering directory '/tmp/B.ekzvm31q/BUILD/gnucash-5.8/build'
[ 25%] Built target jenny
make[1]: Leaving directory '/tmp/B.ekzvm31q/BUILD/gnucash-5.8/build'
make[2]: Entering directory '/tmp/B.ekzvm31q/BUILD/gnucash-5.8/build'
[ 22%] Building C object libgnucash/core-utils/CMakeFiles/gnc-core-utils.dir/gnc-environment.c.o
cd /tmp/B.ekzvm31q/BUILD/gnucash-5.8/build/libgnucash/core-utils && /usr/bin/i686-pld-linux-gcc -DGLIB_VERSION_MAX_ALLOWED=GLIB_VERSION_2_56 -DGLIB_VERSION_MIN_REQUIRED=GLIB_VERSION_2_56 -DG_LOG_DOMAIN=\"gnc.core-utils\" -DHAVE_CONFIG_H -DHAVE_GUILE30 -D_GNU_SOURCE -Dgnc_core_utils_EXPORTS -I/tmp/B.ekzvm31q/BUILD/gnucash-5.8/common -I/tmp/B.ekzvm31q/BUILD/gnucash-5.8/build/common -I/tmp/B.ekzvm31q/BUILD/gnucash-5.8/build/libgnucash/core-utils -I/tmp/B.ekzvm31q/BUILD/gnucash-5.8/libgnucash/core-utils -isystem /usr/include/glib-2.0 -isystem /usr/lib/glib-2.0/include -Werror -Wall -Wmissing-prototypes -Wmissing-declarations  -O2 -fwrapv -pipe -Wformat -Werror=format-security -gdwarf-4 -fno-debug-types-section -fvar-tracking-assignments -g2 -Wp,-D_FORTIFY_SOURCE=2 -fstack-protector-strong --param=ssp-buffer-size=4 -Werror=trampolines -fomit-frame-pointer -march=i686 -fasynchronous-unwind-tables -mtune=pentium4 -gdwarf-4 -fno-debug-types-section -fvar-tracking-assignments -g2  -DNDEBUG -DQT_NO_DEBUG -std=gnu11 -fPIC -MD -MT libgnucash/core-utils/CMakeFiles/gnc-core-utils.dir/gnc-environment.c.o -MF CMakeFiles/gnc-core-utils.dir/gnc-environment.c.o.d -o CMakeFiles/gnc-core-utils.dir/gnc-environment.c.o -c /tmp/B.ekzvm31q/BUILD/gnucash-5.8/libgnucash/core-utils/gnc-environment.c
make[2]: Leaving directory '/tmp/B.ekzvm31q/BUILD/gnucash-5.8/build'
make[2]: Entering directory '/tmp/B.ekzvm31q/BUILD/gnucash-5.8/build'
[ 21%] Generating ../../lib/guile/3.0/site-ccache/gnucash/json/syntax.go
cd /tmp/B.ekzvm31q/BUILD/gnucash-5.8/build/borrowed/guile-json && /usr/bin/cmake -E env LD_LIBRARY_PATH=/tmp/B.ekzvm31q/BUILD/gnucash-5.8/build//lib:/tmp/B.ekzvm31q/BUILD/gnucash-5.8/build//lib/gnucash:/home/users/builder/GNUstep/Library/Libraries:/usr/local/lib:/usr/lib GNC_UNINSTALLED=YES GNC_BUILDDIR=/tmp/B.ekzvm31q/BUILD/gnucash-5.8/build GUILE_LOAD_PATH=/tmp/B.ekzvm31q/BUILD/gnucash-5.8/borrowed/guile-json:/tmp/B.ekzvm31q/BUILD/gnucash-5.8/build/borrowed/guile-json:/tmp/B.ekzvm31q/BUILD/gnucash-5.8/build/borrowed/guile-json/deprecated:/tmp/B.ekzvm31q/BUILD/gnucash-5.8/build/share/guile/site/3.0 GUILE_LOAD_COMPILED_PATH=/tmp/B.ekzvm31q/BUILD/gnucash-5.8/build/borrowed/guile-json:/tmp/B.ekzvm31q/BUILD/gnucash-5.8/build/lib/guile/3.0/site-ccache:/tmp/B.ekzvm31q/BUILD/gnucash-5.8/build/lib/guile/3.0/site-ccache/gnucash/deprecated GNC_MODULE_PATH=/tmp/B.ekzvm31q/BUILD/gnucash-5.8/build//lib:/tmp/B.ekzvm31q/BUILD/gnucash-5.8/build//lib/gnucash: /usr/bin/guile -e "(@@ (guild) main)" -s /usr/bin/guild compile -o /tmp/B.ekzvm31q/BUILD/gnucash-5.8/build/lib/guile/3.0/site-ccache/gnucash/json/syntax.go /tmp/B.ekzvm31q/BUILD/gnucash-5.8/borrowed/guile-json/json/syntax.scm
wrote `/tmp/B.ekzvm31q/BUILD/gnucash-5.8/build/lib/guile/3.0/site-ccache/gnucash/json/syntax.go'
make[2]: Leaving directory '/tmp/B.ekzvm31q/BUILD/gnucash-5.8/build'
make[2]: Entering directory '/tmp/B.ekzvm31q/BUILD/gnucash-5.8/build'
[ 22%] Building C object libgnucash/core-utils/CMakeFiles/gnc-core-utils.dir/gnc-prefs.c.o
cd /tmp/B.ekzvm31q/BUILD/gnucash-5.8/build/libgnucash/core-utils && /usr/bin/i686-pld-linux-gcc -DGLIB_VERSION_MAX_ALLOWED=GLIB_VERSION_2_56 -DGLIB_VERSION_MIN_REQUIRED=GLIB_VERSION_2_56 -DG_LOG_DOMAIN=\"gnc.core-utils\" -DHAVE_CONFIG_H -DHAVE_GUILE30 -D_GNU_SOURCE -Dgnc_core_utils_EXPORTS -I/tmp/B.ekzvm31q/BUILD/gnucash-5.8/common -I/tmp/B.ekzvm31q/BUILD/gnucash-5.8/build/common -I/tmp/B.ekzvm31q/BUILD/gnucash-5.8/build/libgnucash/core-utils -I/tmp/B.ekzvm31q/BUILD/gnucash-5.8/libgnucash/core-utils -isystem /usr/include/glib-2.0 -isystem /usr/lib/glib-2.0/include -Werror -Wall -Wmissing-prototypes -Wmissing-declarations  -O2 -fwrapv -pipe -Wformat -Werror=format-security -gdwarf-4 -fno-debug-types-section -fvar-tracking-assignments -g2 -Wp,-D_FORTIFY_SOURCE=2 -fstack-protector-strong --param=ssp-buffer-size=4 -Werror=trampolines -fomit-frame-pointer -march=i686 -fasynchronous-unwind-tables -mtune=pentium4 -gdwarf-4 -fno-debug-types-section -fvar-tracking-assignments -g2  -DNDEBUG -DQT_NO_DEBUG -std=gnu11 -fPIC -MD -MT libgnucash/core-utils/CMakeFiles/gnc-core-utils.dir/gnc-prefs.c.o -MF CMakeFiles/gnc-core-utils.dir/gnc-prefs.c.o.d -o CMakeFiles/gnc-core-utils.dir/gnc-prefs.c.o -c /tmp/B.ekzvm31q/BUILD/gnucash-5.8/libgnucash/core-utils/gnc-prefs.c
make[2]: Leaving directory '/tmp/B.ekzvm31q/BUILD/gnucash-5.8/build'
make[2]: Entering directory '/tmp/B.ekzvm31q/BUILD/gnucash-5.8/build'
[ 24%] Building C object libgnucash/core-utils/CMakeFiles/gnc-core-utils.dir/gnc-gkeyfile-utils.c.o
cd /tmp/B.ekzvm31q/BUILD/gnucash-5.8/build/libgnucash/core-utils && /usr/bin/i686-pld-linux-gcc -DGLIB_VERSION_MAX_ALLOWED=GLIB_VERSION_2_56 -DGLIB_VERSION_MIN_REQUIRED=GLIB_VERSION_2_56 -DG_LOG_DOMAIN=\"gnc.core-utils\" -DHAVE_CONFIG_H -DHAVE_GUILE30 -D_GNU_SOURCE -Dgnc_core_utils_EXPORTS -I/tmp/B.ekzvm31q/BUILD/gnucash-5.8/common -I/tmp/B.ekzvm31q/BUILD/gnucash-5.8/build/common -I/tmp/B.ekzvm31q/BUILD/gnucash-5.8/build/libgnucash/core-utils -I/tmp/B.ekzvm31q/BUILD/gnucash-5.8/libgnucash/core-utils -isystem /usr/include/glib-2.0 -isystem /usr/lib/glib-2.0/include -Werror -Wall -Wmissing-prototypes -Wmissing-declarations  -O2 -fwrapv -pipe -Wformat -Werror=format-security -gdwarf-4 -fno-debug-types-section -fvar-tracking-assignments -g2 -Wp,-D_FORTIFY_SOURCE=2 -fstack-protector-strong --param=ssp-buffer-size=4 -Werror=trampolines -fomit-frame-pointer -march=i686 -fasynchronous-unwind-tables -mtune=pentium4 -gdwarf-4 -fno-debug-types-section -fvar-tracking-assignments -g2  -DNDEBUG -DQT_NO_DEBUG -std=gnu11 -fPIC -MD -MT libgnucash/core-utils/CMakeFiles/gnc-core-utils.dir/gnc-gkeyfile-utils.c.o -MF CMakeFiles/gnc-core-utils.dir/gnc-gkeyfile-utils.c.o.d -o CMakeFiles/gnc-core-utils.dir/gnc-gkeyfile-utils.c.o -c /tmp/B.ekzvm31q/BUILD/gnucash-5.8/libgnucash/core-utils/gnc-gkeyfile-utils.c
make[2]: Leaving directory '/tmp/B.ekzvm31q/BUILD/gnucash-5.8/build'
make[2]: Entering directory '/tmp/B.ekzvm31q/BUILD/gnucash-5.8/build'
[ 25%] Building C object libgnucash/core-utils/CMakeFiles/gnc-core-utils.dir/gnc-locale-utils.c.o
cd /tmp/B.ekzvm31q/BUILD/gnucash-5.8/build/libgnucash/core-utils && /usr/bin/i686-pld-linux-gcc -DGLIB_VERSION_MAX_ALLOWED=GLIB_VERSION_2_56 -DGLIB_VERSION_MIN_REQUIRED=GLIB_VERSION_2_56 -DG_LOG_DOMAIN=\"gnc.core-utils\" -DHAVE_CONFIG_H -DHAVE_GUILE30 -D_GNU_SOURCE -Dgnc_core_utils_EXPORTS -I/tmp/B.ekzvm31q/BUILD/gnucash-5.8/common -I/tmp/B.ekzvm31q/BUILD/gnucash-5.8/build/common -I/tmp/B.ekzvm31q/BUILD/gnucash-5.8/build/libgnucash/core-utils -I/tmp/B.ekzvm31q/BUILD/gnucash-5.8/libgnucash/core-utils -isystem /usr/include/glib-2.0 -isystem /usr/lib/glib-2.0/include -Werror -Wall -Wmissing-prototypes -Wmissing-declarations  -O2 -fwrapv -pipe -Wformat -Werror=format-security -gdwarf-4 -fno-debug-types-section -fvar-tracking-assignments -g2 -Wp,-D_FORTIFY_SOURCE=2 -fstack-protector-strong --param=ssp-buffer-size=4 -Werror=trampolines -fomit-frame-pointer -march=i686 -fasynchronous-unwind-tables -mtune=pentium4 -gdwarf-4 -fno-debug-types-section -fvar-tracking-assignments -g2  -DNDEBUG -DQT_NO_DEBUG -std=gnu11 -fPIC -MD -MT libgnucash/core-utils/CMakeFiles/gnc-core-utils.dir/gnc-locale-utils.c.o -MF CMakeFiles/gnc-core-utils.dir/gnc-locale-utils.c.o.d -o CMakeFiles/gnc-core-utils.dir/gnc-locale-utils.c.o -c /tmp/B.ekzvm31q/BUILD/gnucash-5.8/libgnucash/core-utils/gnc-locale-utils.c
make[2]: Leaving directory '/tmp/B.ekzvm31q/BUILD/gnucash-5.8/build'
make[2]: Entering directory '/tmp/B.ekzvm31q/BUILD/gnucash-5.8/build'
[ 25%] Building C object libgnucash/core-utils/CMakeFiles/gnc-core-utils.dir/gnc-path.c.o
cd /tmp/B.ekzvm31q/BUILD/gnucash-5.8/build/libgnucash/core-utils && /usr/bin/i686-pld-linux-gcc -DGLIB_VERSION_MAX_ALLOWED=GLIB_VERSION_2_56 -DGLIB_VERSION_MIN_REQUIRED=GLIB_VERSION_2_56 -DG_LOG_DOMAIN=\"gnc.core-utils\" -DHAVE_CONFIG_H -DHAVE_GUILE30 -D_GNU_SOURCE -Dgnc_core_utils_EXPORTS -I/tmp/B.ekzvm31q/BUILD/gnucash-5.8/common -I/tmp/B.ekzvm31q/BUILD/gnucash-5.8/build/common -I/tmp/B.ekzvm31q/BUILD/gnucash-5.8/build/libgnucash/core-utils -I/tmp/B.ekzvm31q/BUILD/gnucash-5.8/libgnucash/core-utils -isystem /usr/include/glib-2.0 -isystem /usr/lib/glib-2.0/include -Werror -Wall -Wmissing-prototypes -Wmissing-declarations  -O2 -fwrapv -pipe -Wformat -Werror=format-security -gdwarf-4 -fno-debug-types-section -fvar-tracking-assignments -g2 -Wp,-D_FORTIFY_SOURCE=2 -fstack-protector-strong --param=ssp-buffer-size=4 -Werror=trampolines -fomit-frame-pointer -march=i686 -fasynchronous-unwind-tables -mtune=pentium4 -gdwarf-4 -fno-debug-types-section -fvar-tracking-assignments -g2  -DNDEBUG -DQT_NO_DEBUG -std=gnu11 -fPIC -MD -MT libgnucash/core-utils/CMakeFiles/gnc-core-utils.dir/gnc-path.c.o -MF CMakeFiles/gnc-core-utils.dir/gnc-path.c.o.d -o CMakeFiles/gnc-core-utils.dir/gnc-path.c.o -c /tmp/B.ekzvm31q/BUILD/gnucash-5.8/libgnucash/core-utils/gnc-path.c
make[2]: Leaving directory '/tmp/B.ekzvm31q/BUILD/gnucash-5.8/build'
make[2]: Entering directory '/tmp/B.ekzvm31q/BUILD/gnucash-5.8/build'
[ 25%] Building C object libgnucash/core-utils/CMakeFiles/gnc-core-utils.dir/gnc-glib-utils.c.o
cd /tmp/B.ekzvm31q/BUILD/gnucash-5.8/build/libgnucash/core-utils && /usr/bin/i686-pld-linux-gcc -DGLIB_VERSION_MAX_ALLOWED=GLIB_VERSION_2_56 -DGLIB_VERSION_MIN_REQUIRED=GLIB_VERSION_2_56 -DG_LOG_DOMAIN=\"gnc.core-utils\" -DHAVE_CONFIG_H -DHAVE_GUILE30 -D_GNU_SOURCE -Dgnc_core_utils_EXPORTS -I/tmp/B.ekzvm31q/BUILD/gnucash-5.8/common -I/tmp/B.ekzvm31q/BUILD/gnucash-5.8/build/common -I/tmp/B.ekzvm31q/BUILD/gnucash-5.8/build/libgnucash/core-utils -I/tmp/B.ekzvm31q/BUILD/gnucash-5.8/libgnucash/core-utils -isystem /usr/include/glib-2.0 -isystem /usr/lib/glib-2.0/include -Werror -Wall -Wmissing-prototypes -Wmissing-declarations  -O2 -fwrapv -pipe -Wformat -Werror=format-security -gdwarf-4 -fno-debug-types-section -fvar-tracking-assignments -g2 -Wp,-D_FORTIFY_SOURCE=2 -fstack-protector-strong --param=ssp-buffer-size=4 -Werror=trampolines -fomit-frame-pointer -march=i686 -fasynchronous-unwind-tables -mtune=pentium4 -gdwarf-4 -fno-debug-types-section -fvar-tracking-assignments -g2  -DNDEBUG -DQT_NO_DEBUG -std=gnu11 -fPIC -MD -MT libgnucash/core-utils/CMakeFiles/gnc-core-utils.dir/gnc-glib-utils.c.o -MF CMakeFiles/gnc-core-utils.dir/gnc-glib-utils.c.o.d -o CMakeFiles/gnc-core-utils.dir/gnc-glib-utils.c.o -c /tmp/B.ekzvm31q/BUILD/gnucash-5.8/libgnucash/core-utils/gnc-glib-utils.c
make[2]: Leaving directory '/tmp/B.ekzvm31q/BUILD/gnucash-5.8/build'
make[2]: Entering directory '/tmp/B.ekzvm31q/BUILD/gnucash-5.8/build'
[ 20%] Generating swig-app-utils-python.c, sw_app_utils.py
cd /tmp/B.ekzvm31q/BUILD/gnucash-5.8/build/bindings/python && /usr/bin/swig -python -Wall -Werror -I/usr/include/glib-2.0 -I/usr/lib/glib-2.0/include -I/usr/include -I/tmp/B.ekzvm31q/BUILD/gnucash-5.8/common -I/tmp/B.ekzvm31q/BUILD/gnucash-5.8/libgnucash/engine -I/tmp/B.ekzvm31q/BUILD/gnucash-5.8/libgnucash/app-utils -I/tmp/B.ekzvm31q/BUILD/gnucash-5.8/bindings -I/tmp/B.ekzvm31q/BUILD/gnucash-5.8/bindings/python -o /tmp/B.ekzvm31q/BUILD/gnucash-5.8/build/bindings/python/swig-app-utils-python.c /tmp/B.ekzvm31q/BUILD/gnucash-5.8/bindings/python/../app-utils.i
/usr/include/guid.h:41: Warning 301: class keyword used, but not in C++ mode.
/usr/include/guid.h:83: Warning 301: class keyword used, but not in C++ mode.
make[2]: *** [bindings/python/CMakeFiles/swig-app-utils-python.dir/build.make:80: bindings/python/swig-app-utils-python.c] Error 1
make[2]: Leaving directory '/tmp/B.ekzvm31q/BUILD/gnucash-5.8/build'
make[1]: *** [CMakeFiles/Makefile2:10949: bindings/python/CMakeFiles/swig-app-utils-python.dir/all] Error 2
make[1]: *** Waiting for unfinished jobs....
make[2]: Entering directory '/tmp/B.ekzvm31q/BUILD/gnucash-5.8/build'
[ 20%] Generating swig-app-utils-python.c, sw_app_utils.py
cd /tmp/B.ekzvm31q/BUILD/gnucash-5.8/build/bindings/python && /usr/bin/swig -python -Wall -Werror -I/usr/include/glib-2.0 -I/usr/lib/glib-2.0/include -I/usr/include -I/tmp/B.ekzvm31q/BUILD/gnucash-5.8/common -I/tmp/B.ekzvm31q/BUILD/gnucash-5.8/libgnucash/engine -I/tmp/B.ekzvm31q/BUILD/gnucash-5.8/libgnucash/app-utils -I/tmp/B.ekzvm31q/BUILD/gnucash-5.8/bindings -I/tmp/B.ekzvm31q/BUILD/gnucash-5.8/bindings/python -o /tmp/B.ekzvm31q/BUILD/gnucash-5.8/build/bindings/python/swig-app-utils-python.c /tmp/B.ekzvm31q/BUILD/gnucash-5.8/bindings/python/../app-utils.i
/usr/include/guid.h:41: Warning 301: class keyword used, but not in C++ mode.
/usr/include/guid.h:83: Warning 301: class keyword used, but not in C++ mode.
make[2]: *** [bindings/python/CMakeFiles/sw-app-utils-py.dir/build.make:78: bindings/python/swig-app-utils-python.c] Error 1
make[2]: Leaving directory '/tmp/B.ekzvm31q/BUILD/gnucash-5.8/build'
make[1]: *** [CMakeFiles/Makefile2:11189: bindings/python/CMakeFiles/sw-app-utils-py.dir/all] Error 2
make[2]: Entering directory '/tmp/B.ekzvm31q/BUILD/gnucash-5.8/build'
[ 20%] Generating ../../lib/guile/3.0/site-ccache/gnucash/json/builder.go
cd /tmp/B.ekzvm31q/BUILD/gnucash-5.8/build/borrowed/guile-json && /usr/bin/cmake -E env LD_LIBRARY_PATH=/tmp/B.ekzvm31q/BUILD/gnucash-5.8/build//lib:/tmp/B.ekzvm31q/BUILD/gnucash-5.8/build//lib/gnucash:/home/users/builder/GNUstep/Library/Libraries:/usr/local/lib:/usr/lib GNC_UNINSTALLED=YES GNC_BUILDDIR=/tmp/B.ekzvm31q/BUILD/gnucash-5.8/build GUILE_LOAD_PATH=/tmp/B.ekzvm31q/BUILD/gnucash-5.8/borrowed/guile-json:/tmp/B.ekzvm31q/BUILD/gnucash-5.8/build/borrowed/guile-json:/tmp/B.ekzvm31q/BUILD/gnucash-5.8/build/borrowed/guile-json/deprecated:/tmp/B.ekzvm31q/BUILD/gnucash-5.8/build/share/guile/site/3.0 GUILE_LOAD_COMPILED_PATH=/tmp/B.ekzvm31q/BUILD/gnucash-5.8/build/borrowed/guile-json:/tmp/B.ekzvm31q/BUILD/gnucash-5.8/build/lib/guile/3.0/site-ccache:/tmp/B.ekzvm31q/BUILD/gnucash-5.8/build/lib/guile/3.0/site-ccache/gnucash/deprecated GNC_MODULE_PATH=/tmp/B.ekzvm31q/BUILD/gnucash-5.8/build//lib:/tmp/B.ekzvm31q/BUILD/gnucash-5.8/build//lib/gnucash: /usr/bin/guile -e "(@@ (guild) main)" -s /usr/bin/guild compile -o /tmp/B.ekzvm31q/BUILD/gnucash-5.8/build/lib/guile/3.0/site-ccache/gnucash/json/builder.go /tmp/B.ekzvm31q/BUILD/gnucash-5.8/borrowed/guile-json/json/builder.scm
json/builder.scm:198:37: warning: possibly wrong number of arguments to `#<<parameter> ce600 proc: #<procedure d2ae0>>'
json/builder.scm:171:6: warning: possibly wrong number of arguments to `#<procedure d7a00>'
json/builder.scm:138:16: warning: possibly wrong number of arguments to `#<procedure d7b40>'
json/builder.scm:36:2: warning: possibly wrong number of arguments to `#<procedure d7a00>'
wrote `/tmp/B.ekzvm31q/BUILD/gnucash-5.8/build/lib/guile/3.0/site-ccache/gnucash/json/builder.go'
make[2]: Leaving directory '/tmp/B.ekzvm31q/BUILD/gnucash-5.8/build'
make[2]: Entering directory '/tmp/B.ekzvm31q/BUILD/gnucash-5.8/build'
[  2%] Generating swig-engine.cpp
cd /tmp/B.ekzvm31q/BUILD/gnucash-5.8/build/bindings/guile && /usr/bin/swig -guile -Linkage module -c++ -procdoc sw-gnc-option-doc -procdocformat plain -I/tmp/B.ekzvm31q/BUILD/gnucash-5.8/common -I/tmp/B.ekzvm31q/BUILD/gnucash-5.8/libgnucash/engine -I/tmp/B.ekzvm31q/BUILD/gnucash-5.8/bindings/guile -I/tmp/B.ekzvm31q/BUILD/gnucash-5.8/libgnucash/engine -o /tmp/B.ekzvm31q/BUILD/gnucash-5.8/build/bindings/guile/swig-engine.cpp /tmp/B.ekzvm31q/BUILD/gnucash-5.8/bindings/engine.i
make[2]: Leaving directory '/tmp/B.ekzvm31q/BUILD/gnucash-5.8/build'
make[1]: Entering directory '/tmp/B.ekzvm31q/BUILD/gnucash-5.8/build'
[ 25%] Built target swig-engine-cpp
make[1]: Leaving directory '/tmp/B.ekzvm31q/BUILD/gnucash-5.8/build'
make[2]: Entering directory '/tmp/B.ekzvm31q/BUILD/gnucash-5.8/build'
[ 21%] Generating ../../lib/guile/3.0/site-ccache/gnucash/json/parser.go
cd /tmp/B.ekzvm31q/BUILD/gnucash-5.8/build/borrowed/guile-json && /usr/bin/cmake -E env LD_LIBRARY_PATH=/tmp/B.ekzvm31q/BUILD/gnucash-5.8/build//lib:/tmp/B.ekzvm31q/BUILD/gnucash-5.8/build//lib/gnucash:/home/users/builder/GNUstep/Library/Libraries:/usr/local/lib:/usr/lib GNC_UNINSTALLED=YES GNC_BUILDDIR=/tmp/B.ekzvm31q/BUILD/gnucash-5.8/build GUILE_LOAD_PATH=/tmp/B.ekzvm31q/BUILD/gnucash-5.8/borrowed/guile-json:/tmp/B.ekzvm31q/BUILD/gnucash-5.8/build/borrowed/guile-json:/tmp/B.ekzvm31q/BUILD/gnucash-5.8/build/borrowed/guile-json/deprecated:/tmp/B.ekzvm31q/BUILD/gnucash-5.8/build/share/guile/site/3.0 GUILE_LOAD_COMPILED_PATH=/tmp/B.ekzvm31q/BUILD/gnucash-5.8/build/borrowed/guile-json:/tmp/B.ekzvm31q/BUILD/gnucash-5.8/build/lib/guile/3.0/site-ccache:/tmp/B.ekzvm31q/BUILD/gnucash-5.8/build/lib/guile/3.0/site-ccache/gnucash/deprecated GNC_MODULE_PATH=/tmp/B.ekzvm31q/BUILD/gnucash-5.8/build//lib:/tmp/B.ekzvm31q/BUILD/gnucash-5.8/build//lib/gnucash: /usr/bin/guile -e "(@@ (guild) main)" -s /usr/bin/guild compile -o /tmp/B.ekzvm31q/BUILD/gnucash-5.8/build/lib/guile/3.0/site-ccache/gnucash/json/parser.go /tmp/B.ekzvm31q/BUILD/gnucash-5.8/borrowed/guile-json/json/parser.scm
json/parser.scm:345:37: warning: possibly wrong number of arguments to `#<<parameter> ce610 proc: #<procedure d2b10>>'
json/parser.scm:235:3: warning: possibly wrong number of arguments to `#<procedure f776b198>'
wrote `/tmp/B.ekzvm31q/BUILD/gnucash-5.8/build/lib/guile/3.0/site-ccache/gnucash/json/parser.go'
make[2]: Leaving directory '/tmp/B.ekzvm31q/BUILD/gnucash-5.8/build'
make[1]: Entering directory '/tmp/B.ekzvm31q/BUILD/gnucash-5.8/build'
[ 25%] Built target guile-json-details
make[1]: Leaving directory '/tmp/B.ekzvm31q/BUILD/gnucash-5.8/build'
make[2]: Entering directory '/tmp/B.ekzvm31q/BUILD/gnucash-5.8/build'
[ 25%] Building CXX object libgnucash/core-utils/CMakeFiles/gnc-core-utils.dir/gnc-locale-utils.cpp.o
cd /tmp/B.ekzvm31q/BUILD/gnucash-5.8/build/libgnucash/core-utils && /usr/bin/i686-pld-linux-g++ -DGLIB_VERSION_MAX_ALLOWED=GLIB_VERSION_2_56 -DGLIB_VERSION_MIN_REQUIRED=GLIB_VERSION_2_56 -DG_LOG_DOMAIN=\"gnc.core-utils\" -DHAVE_CONFIG_H -DHAVE_GUILE30 -D_GNU_SOURCE -Dgnc_core_utils_EXPORTS -I/tmp/B.ekzvm31q/BUILD/gnucash-5.8/common -I/tmp/B.ekzvm31q/BUILD/gnucash-5.8/build/common -I/tmp/B.ekzvm31q/BUILD/gnucash-5.8/build/libgnucash/core-utils -I/tmp/B.ekzvm31q/BUILD/gnucash-5.8/libgnucash/core-utils -isystem /usr/include/glib-2.0 -isystem /usr/lib/glib-2.0/include -Werror -Wall -Wmissing-declarations  -O2 -fwrapv -pipe -Wformat -Werror=format-security -gdwarf-4 -fno-debug-types-section -fvar-tracking-assignments -g2 -Wp,-D_FORTIFY_SOURCE=2 -fstack-protector-strong --param=ssp-buffer-size=4 -Werror=trampolines -fomit-frame-pointer -march=i686 -fasynchronous-unwind-tables -mtune=pentium4 -gdwarf-4 -fno-debug-types-section -fvar-tracking-assignments -g2  -DNDEBUG -DQT_NO_DEBUG -std=c++17 -fPIC -MD -MT libgnucash/core-utils/CMakeFiles/gnc-core-utils.dir/gnc-locale-utils.cpp.o -MF CMakeFiles/gnc-core-utils.dir/gnc-locale-utils.cpp.o.d -o CMakeFiles/gnc-core-utils.dir/gnc-locale-utils.cpp.o -c /tmp/B.ekzvm31q/BUILD/gnucash-5.8/libgnucash/core-utils/gnc-locale-utils.cpp
make[2]: Leaving directory '/tmp/B.ekzvm31q/BUILD/gnucash-5.8/build'
make[2]: Entering directory '/tmp/B.ekzvm31q/BUILD/gnucash-5.8/build'
[  2%] Building CXX object libgnucash/engine/test-core/CMakeFiles/gnc-test-engine.dir/test-engine-stuff.cpp.o
cd /tmp/B.ekzvm31q/BUILD/gnucash-5.8/build/libgnucash/engine/test-core && /usr/bin/i686-pld-linux-g++ -DHAVE_CONFIG_H -DHAVE_GUILE30 -D_GNU_SOURCE -I/usr/include/glib-2.0 -I/usr/lib/glib-2.0/include -I/tmp/B.ekzvm31q/BUILD/gnucash-5.8/build/common -I/tmp/B.ekzvm31q/BUILD/gnucash-5.8/common -I/tmp/B.ekzvm31q/BUILD/gnucash-5.8/libgnucash/engine -I/tmp/B.ekzvm31q/BUILD/gnucash-5.8/common/test-core -Werror -Wall -Wmissing-declarations  -O2 -fwrapv -pipe -Wformat -Werror=format-security -gdwarf-4 -fno-debug-types-section -fvar-tracking-assignments -g2 -Wp,-D_FORTIFY_SOURCE=2 -fstack-protector-strong --param=ssp-buffer-size=4 -Werror=trampolines -fomit-frame-pointer -march=i686 -fasynchronous-unwind-tables -mtune=pentium4 -gdwarf-4 -fno-debug-types-section -fvar-tracking-assignments -g2  -DNDEBUG -DQT_NO_DEBUG -std=c++17 -MD -MT libgnucash/engine/test-core/CMakeFiles/gnc-test-engine.dir/test-engine-stuff.cpp.o -MF CMakeFiles/gnc-test-engine.dir/test-engine-stuff.cpp.o.d -o CMakeFiles/gnc-test-engine.dir/test-engine-stuff.cpp.o -c /tmp/B.ekzvm31q/BUILD/gnucash-5.8/libgnucash/engine/test-core/test-engine-stuff.cpp
make[2]: Leaving directory '/tmp/B.ekzvm31q/BUILD/gnucash-5.8/build'
make[2]: Entering directory '/tmp/B.ekzvm31q/BUILD/gnucash-5.8/build'
[ 25%] Linking CXX static library libgnc-test-engine.a
cd /tmp/B.ekzvm31q/BUILD/gnucash-5.8/build/libgnucash/engine/test-core && /usr/bin/cmake -P CMakeFiles/gnc-test-engine.dir/cmake_clean_target.cmake
cd /tmp/B.ekzvm31q/BUILD/gnucash-5.8/build/libgnucash/engine/test-core && /usr/bin/cmake -E cmake_link_script CMakeFiles/gnc-test-engine.dir/link.txt --verbose=1
/usr/bin/ar qc libgnc-test-engine.a "CMakeFiles/gnc-test-engine.dir/test-engine-stuff.cpp.o"
/usr/bin/ranlib libgnc-test-engine.a
make[2]: Leaving directory '/tmp/B.ekzvm31q/BUILD/gnucash-5.8/build'
make[1]: Entering directory '/tmp/B.ekzvm31q/BUILD/gnucash-5.8/build'
[ 25%] Built target gnc-test-engine
make[1]: Leaving directory '/tmp/B.ekzvm31q/BUILD/gnucash-5.8/build'
make[2]: Entering directory '/tmp/B.ekzvm31q/BUILD/gnucash-5.8/build'
[ 20%] Generating gnucash_core.c, gnucash_core_c.py
cd /tmp/B.ekzvm31q/BUILD/gnucash-5.8/build/bindings/python && /usr/bin/swig -python -Wall -Werror -I/usr/include/glib-2.0 -I/usr/lib/glib-2.0/include -I/usr/include -I/tmp/B.ekzvm31q/BUILD/gnucash-5.8/common -I/tmp/B.ekzvm31q/BUILD/gnucash-5.8/libgnucash/engine -I/tmp/B.ekzvm31q/BUILD/gnucash-5.8/libgnucash/app-utils -I/tmp/B.ekzvm31q/BUILD/gnucash-5.8/bindings -I/tmp/B.ekzvm31q/BUILD/gnucash-5.8/bindings/python -I/tmp/B.ekzvm31q/BUILD/gnucash-5.8/bindings -o /tmp/B.ekzvm31q/BUILD/gnucash-5.8/build/bindings/python/gnucash_core.c /tmp/B.ekzvm31q/BUILD/gnucash-5.8/bindings/python/gnucash_core.i
/usr/include/guid.h:41: Warning 301: class keyword used, but not in C++ mode.
/usr/include/guid.h:83: Warning 301: class keyword used, but not in C++ mode.
make[2]: *** [bindings/python/CMakeFiles/gnucash-core-c-py.dir/build.make:109: bindings/python/gnucash_core.c] Error 1
make[2]: Leaving directory '/tmp/B.ekzvm31q/BUILD/gnucash-5.8/build'
make[1]: *** [CMakeFiles/Makefile2:11031: bindings/python/CMakeFiles/gnucash-core-c-py.dir/all] Error 2
make[2]: Entering directory '/tmp/B.ekzvm31q/BUILD/gnucash-5.8/build'
[ 20%] Generating gnucash_core.c, gnucash_core_c.py
cd /tmp/B.ekzvm31q/BUILD/gnucash-5.8/build/bindings/python && /usr/bin/swig -python -Wall -Werror -I/usr/include/glib-2.0 -I/usr/lib/glib-2.0/include -I/usr/include -I/tmp/B.ekzvm31q/BUILD/gnucash-5.8/common -I/tmp/B.ekzvm31q/BUILD/gnucash-5.8/libgnucash/engine -I/tmp/B.ekzvm31q/BUILD/gnucash-5.8/libgnucash/app-utils -I/tmp/B.ekzvm31q/BUILD/gnucash-5.8/bindings -I/tmp/B.ekzvm31q/BUILD/gnucash-5.8/bindings/python -I/tmp/B.ekzvm31q/BUILD/gnucash-5.8/bindings -o /tmp/B.ekzvm31q/BUILD/gnucash-5.8/build/bindings/python/gnucash_core.c /tmp/B.ekzvm31q/BUILD/gnucash-5.8/bindings/python/gnucash_core.i
/usr/include/guid.h:41: Warning 301: class keyword used, but not in C++ mode.
/usr/include/guid.h:83: Warning 301: class keyword used, but not in C++ mode.
On exit, could not delete file /tmp/B.ekzvm31q/BUILD/gnucash-5.8/build/bindings/python/gnucash_core.c: No such file or directory
On exit, could not delete file /tmp/B.ekzvm31q/BUILD/gnucash-5.8/build/bindings/python/gnucash_core_c.py: No such file or directory
make[2]: *** [bindings/python/CMakeFiles/swig-gnucash-core.dir/build.make:142: bindings/python/gnucash_core.c] Error 1
make[2]: Leaving directory '/tmp/B.ekzvm31q/BUILD/gnucash-5.8/build'
make[1]: *** [CMakeFiles/Makefile2:10897: bindings/python/CMakeFiles/swig-gnucash-core.dir/all] Error 2
make[2]: Entering directory '/tmp/B.ekzvm31q/BUILD/gnucash-5.8/build'
[  4%] Generating gnucash.desktop.in
cd /tmp/B.ekzvm31q/BUILD/gnucash-5.8/build/gnucash/gnome && /usr/bin/cmake -E env /usr/bin/msgfmt --desktop --template /tmp/B.ekzvm31q/BUILD/gnucash-5.8/gnucash/gnome/gnucash.desktop.in.in -d /tmp/B.ekzvm31q/BUILD/gnucash-5.8/po -o /tmp/B.ekzvm31q/BUILD/gnucash-5.8/build/gnucash/gnome/gnucash.desktop.in
make[2]: Leaving directory '/tmp/B.ekzvm31q/BUILD/gnucash-5.8/build'
make[2]: Entering directory '/tmp/B.ekzvm31q/BUILD/gnucash-5.8/build'
[ 25%] Generating gnucash.desktop
cd /tmp/B.ekzvm31q/BUILD/gnucash-5.8/build/gnucash/gnome && /usr/bin/cmake -D SRC=/tmp/B.ekzvm31q/BUILD/gnucash-5.8/build/gnucash/gnome/gnucash.desktop.in -D DST=/tmp/B.ekzvm31q/BUILD/gnucash-5.8/build/gnucash/gnome/gnucash.desktop -D VCS_INFO_FILE=/tmp/B.ekzvm31q/BUILD/gnucash-5.8/build/libgnucash/core-utils/gnc-vcs-info.h -D PROJECT_VERSION=5.8 -D SRC_DIR=/tmp/B.ekzvm31q/BUILD/gnucash-5.8 -P /tmp/B.ekzvm31q/BUILD/gnucash-5.8/cmake/configure-gnucash-desktop.cmake
make[2]: Leaving directory '/tmp/B.ekzvm31q/BUILD/gnucash-5.8/build'
make[1]: Entering directory '/tmp/B.ekzvm31q/BUILD/gnucash-5.8/build'
[ 25%] Built target gnucash-desktop
make[1]: Leaving directory '/tmp/B.ekzvm31q/BUILD/gnucash-5.8/build'
make[2]: Entering directory '/tmp/B.ekzvm31q/BUILD/gnucash-5.8/build'
[  4%] Generating gnucash.appdata.xml.in
cd /tmp/B.ekzvm31q/BUILD/gnucash-5.8/build/gnucash/gnome && /usr/bin/msgfmt --xml --template /tmp/B.ekzvm31q/BUILD/gnucash-5.8/gnucash/gnome/gnucash.appdata.xml.in.in -d /tmp/B.ekzvm31q/BUILD/gnucash-5.8/po -o /tmp/B.ekzvm31q/BUILD/gnucash-5.8/build/gnucash/gnome/gnucash.appdata.xml.in
make[2]: Leaving directory '/tmp/B.ekzvm31q/BUILD/gnucash-5.8/build'
make[1]: Entering directory '/tmp/B.ekzvm31q/BUILD/gnucash-5.8/build'
[ 25%] Built target dist-gnucash-gnome-gnucash-appdata-xml-in
make[1]: Leaving directory '/tmp/B.ekzvm31q/BUILD/gnucash-5.8/build'
make[2]: Entering directory '/tmp/B.ekzvm31q/BUILD/gnucash-5.8/build'
[ 22%] Building CXX object libgnucash/core-utils/CMakeFiles/gnc-core-utils.dir/gnc-filepath-utils.cpp.o
cd /tmp/B.ekzvm31q/BUILD/gnucash-5.8/build/libgnucash/core-utils && /usr/bin/i686-pld-linux-g++ -DGLIB_VERSION_MAX_ALLOWED=GLIB_VERSION_2_56 -DGLIB_VERSION_MIN_REQUIRED=GLIB_VERSION_2_56 -DG_LOG_DOMAIN=\"gnc.core-utils\" -DHAVE_CONFIG_H -DHAVE_GUILE30 -D_GNU_SOURCE -Dgnc_core_utils_EXPORTS -I/tmp/B.ekzvm31q/BUILD/gnucash-5.8/common -I/tmp/B.ekzvm31q/BUILD/gnucash-5.8/build/common -I/tmp/B.ekzvm31q/BUILD/gnucash-5.8/build/libgnucash/core-utils -I/tmp/B.ekzvm31q/BUILD/gnucash-5.8/libgnucash/core-utils -isystem /usr/include/glib-2.0 -isystem /usr/lib/glib-2.0/include -Werror -Wall -Wmissing-declarations  -O2 -fwrapv -pipe -Wformat -Werror=format-security -gdwarf-4 -fno-debug-types-section -fvar-tracking-assignments -g2 -Wp,-D_FORTIFY_SOURCE=2 -fstack-protector-strong --param=ssp-buffer-size=4 -Werror=trampolines -fomit-frame-pointer -march=i686 -fasynchronous-unwind-tables -mtune=pentium4 -gdwarf-4 -fno-debug-types-section -fvar-tracking-assignments -g2  -DNDEBUG -DQT_NO_DEBUG -std=c++17 -fPIC -MD -MT libgnucash/core-utils/CMakeFiles/gnc-core-utils.dir/gnc-filepath-utils.cpp.o -MF CMakeFiles/gnc-core-utils.dir/gnc-filepath-utils.cpp.o.d -o CMakeFiles/gnc-core-utils.dir/gnc-filepath-utils.cpp.o -c /tmp/B.ekzvm31q/BUILD/gnucash-5.8/libgnucash/core-utils/gnc-filepath-utils.cpp
make[2]: Leaving directory '/tmp/B.ekzvm31q/BUILD/gnucash-5.8/build'
make[2]: Entering directory '/tmp/B.ekzvm31q/BUILD/gnucash-5.8/build'
[ 25%] Linking CXX shared library ../../lib/libgnc-core-utils.so
cd /tmp/B.ekzvm31q/BUILD/gnucash-5.8/build/libgnucash/core-utils && /usr/bin/cmake -E cmake_link_script CMakeFiles/gnc-core-utils.dir/link.txt --verbose=1
/usr/bin/i686-pld-linux-g++ -fPIC -Werror -Wall -Wmissing-declarations  -O2 -fwrapv -pipe -Wformat -Werror=format-security -gdwarf-4 -fno-debug-types-section -fvar-tracking-assignments -g2 -Wp,-D_FORTIFY_SOURCE=2 -fstack-protector-strong --param=ssp-buffer-size=4 -Werror=trampolines -fomit-frame-pointer -march=i686 -fasynchronous-unwind-tables -mtune=pentium4 -gdwarf-4 -fno-debug-types-section -fvar-tracking-assignments -g2  -DNDEBUG -DQT_NO_DEBUG -Wl,--as-needed -Wl,--no-copy-dt-needed-entries -Wl,-z,relro -Wl,-z,combreloc -shared -Wl,-soname,libgnc-core-utils.so -o ../../lib/libgnc-core-utils.so "CMakeFiles/gnc-core-utils.dir/binreloc.c.o" "CMakeFiles/gnc-core-utils.dir/gnc-prefs.c.o" "CMakeFiles/gnc-core-utils.dir/gnc-environment.c.o" "CMakeFiles/gnc-core-utils.dir/gnc-filepath-utils.cpp.o" "CMakeFiles/gnc-core-utils.dir/gnc-gkeyfile-utils.c.o" "CMakeFiles/gnc-core-utils.dir/gnc-glib-utils.c.o" "CMakeFiles/gnc-core-utils.dir/gnc-locale-utils.c.o" "CMakeFiles/gnc-core-utils.dir/gnc-locale-utils.cpp.o" "CMakeFiles/gnc-core-utils.dir/gnc-path.c.o" "CMakeFiles/gnc-core-utils.dir/gnc-version.c.o"  -Wl,-rpath,::::::::::::::::::::::::: /usr/lib/libboost_date_time.so /usr/lib/libboost_filesystem.so /usr/lib/libboost_locale.so /usr/lib/libboost_program_options.so /usr/lib/libboost_regex.so /usr/lib/libboost_system.so -L/usr/lib -lgobject-2.0 -lglib-2.0 /usr/lib/libglib-2.0.so 
make[2]: Leaving directory '/tmp/B.ekzvm31q/BUILD/gnucash-5.8/build'
make[1]: Entering directory '/tmp/B.ekzvm31q/BUILD/gnucash-5.8/build'
[ 25%] Built target gnc-core-utils
make[1]: Leaving directory '/tmp/B.ekzvm31q/BUILD/gnucash-5.8/build'
make: *** [Makefile:169: all] Error 2
error: Bad exit status from /tmp/B.ekzvm31q/BUILD/tmp/rpm-tmp.wMPr6V (%build)

RPM build warnings:
    Could not canonicalize hostname: nereid

RPM build errors:
    Bad exit status from /tmp/B.ekzvm31q/BUILD/tmp/rpm-tmp.wMPr6V (%build)
ended at: Sun Jul  7 23:51:15 2024, done in 0:00:26.177179
error: No files produced.
+ chmod -R u+rwX /tmp/B.ekzvm31q/BUILD
+ rm -rf /tmp/B.ekzvm31q/tmp /tmp/B.ekzvm31q/BUILD
+ rm -rf /tmp/B.ekzvm31q
Begin-PLD-Builder-Info
Build-Time: user:77.15s sys:15.61s real:30.02s (faults io:65 non-io:1401497)

End-PLD-Builder-Info
[Back to list of logs] [View rpm -qa of builder]