FailedOk

th/SRPMS[OK]
th/x32[OK]
th/i686[OK]
th/x86_64[OK]

ac/SRPMS[OK]
ac/i386[OK]
ac/i586[OK]
ac/i686[OK]
ac/alpha[OK]
ac/amd64[OK]
ac/athlon[OK]
ac/ppc[OK]
ac/sparc[OK]
ac/sparc64[OK]

Advanced Search
main()
Powered by PLD Linux
(c) 2002-2024 PLD Team
$Revision: 1.37 $
Powered by Leppe'.
Your IP: 3.233.242.67

libaio 3af6d9d9-489c-402b-96f7-a66fb823bb89

Status:Failed
Source URL:https://buildlogs.pld-linux.org/pld/th/i686/FAIL/libaio,3af6d9d9-489c-402b-96f7-a66fb823bb89.bz2
text/plain URL:View!
rpm -qa of builder:View!
Date:2024/02/11 09:45:52
Runtime:0:01:43.241189

Toc:

  • prep
  • Executing(%prep): /bin/sh -e /tmp/B.j9vx7ghf/BUILD/tmp/rpm-tmp.AhCWYA
  • build
  • Executing(%build): /bin/sh -e /tmp/B.j9vx7ghf/BUILD/tmp/rpm-tmp.62lK0r
  • error 1
  • Pass: 18 Fail: 1 Skip: 0
  • error 2
  • make[1]: *** [Makefile:53: partcheck] Error 1
  • error 3
  • error: Bad exit status from /tmp/B.j9vx7ghf/BUILD/tmp/rpm-tmp.62lK0r (%build)
  • error 4
  • RPM build errors:
  • error 5
  • error: No files produced.

Content:

request from: qboosh
checking if we should skip the build
started at: Sun Feb 11 09:44:06 2024
killing old processes on a builder
sending signal 9 to pid -1
cleaning up /tmp
fetching https://srcbuilder.pld-linux.org/th//srpms/3af6d9d9-489c-402b-96f7-a66fb823bb89/libaio-0.3.113-1.src.rpm
fetched 62076 bytes, 249.5 K/s
installing srpm: libaio-0.3.113-1.src.rpm
+ install -d /tmp/B.j9vx7ghf/BUILD /tmp/B.j9vx7ghf/RPMS
+ LC_ALL=en_US.UTF-8
+ rpm -qp --changelog libaio-0.3.113-1.src.rpm
* Sun Feb 11 2024 PLD Linux Team <feedback@pld-linux.org>
- For complete changelog see: http://git.pld-linux.org/?p=packages/libaio.git;a=log;h=master
* Sun May 08 2022 Jakub Bogusz <qboosh@pld-linux.org> 495ca9d
- updated to 0.3.113 * Sun Dec 01 2019 Jakub Bogusz <qboosh@pld-linux.org> 171550b
- updated to 0.3.112 - updated DESTDIR patch - removed outdated link patch * Tue Apr 17 2018 Jakub Bogusz <qboosh@pld-linux.org> 3ef0e52
- cleanup; when linking with libc, SSP can be enabled * Mon Apr 16 2018 Jakub Bogusz <qboosh@pld-linux.org> 4e305c8
- new URLs, updated to 0.3.111 - updated Werror,x32 patches - added link patch (link with libc as now it uses syscall() symbol) * Wed Jan 20 2016 Jakub Bogusz <qboosh@pld-linux.org> 2c47660
- new Source0 URL, updated to 0.3.110 - updated Werror patch * Tue Feb 24 2015 Jan Rękorajski <baggins@pld-linux.org> d3c205e
- x32 rebuild - release 2 (by relup.sh) * Tue Dec 30 2014 Jan Rękorajski <baggins@pld-linux.org> 3bbf7e3
- fix building on x32 * Sat Feb 16 2013 Arkadiusz Miśkiewicz <arekm@maven.pl> c772505
- drop Werror from test suite * Sun Jan 24 2010 Jakub Bogusz <qboosh@pld-linux.org> 382975a
- updated DESTDIR patch to use relative soname symlink (same directory) - dropped outdated rpm-utils BR * Mon Jan 18 2010 Arkadiusz Miśkiewicz <arekm@maven.pl> 8b5c9a1
- no need for src.rpm, use tarball * Mon Jan 18 2010 Arkadiusz Miśkiewicz <arekm@maven.pl> 450ab93
- run test suite * Mon Jan 18 2010 Arkadiusz Miśkiewicz <arekm@maven.pl> 9d12856
- up to 0.3.109 (use src.rpm as source) * Wed Oct 28 2009 Elan Ruusamäe <glen@pld-linux.org> 981bb88
- release 2 * Tue Oct 27 2009 Elan Ruusamäe <glen@pld-linux.org> 3f1eec6
- lib64 fix * Tue Oct 27 2009 Elan Ruusamäe <glen@pld-linux.org> c44802e
- add -DESTDIR.patch * Fri Jul 25 2008 Elan Ruusamäe <glen@pld-linux.org> a822ab9
- uploaded tarball to df * Fri Jul 11 2008 Jakub Bogusz <qboosh@pld-linux.org> c862da4
- updated to 0.3.107 (from Fedora) - added arches patch (m68k/sparc/arm/misc/hppa support) from Debian - ghost soname symlink * Fri Jul 11 2008 Jakub Bogusz <qboosh@pld-linux.org> 5e23096
- m68k/sparc/arm/misc/hppa support from Debian * Thu Oct 25 2007 Elan Ruusamäe <glen@pld-linux.org> 3ebe367
- move libaio to /%{_lib}; rel 2 * Mon Sep 10 2007 Jakub Bogusz <qboosh@pld-linux.org> 48e3947
- resolve manuals conflict with man-pages and glibc-devel-doc + rpm -Uhv --nodeps --define '_topdir /tmp/B.j9vx7ghf' --define '_specdir %{_topdir}' --define '_sourcedir %{_specdir}' --define '_rpmdir %{_topdir}/RPMS' --define '_builddir %{_topdir}/BUILD' libaio-0.3.113-1.src.rpm Updating / installing... libaio-0.3.113-1 ######################################## + rm -f libaio-0.3.113-1.src.rpm + install -m 700 -d /tmp/B.j9vx7ghf/BUILD/tmp + TMPDIR=/tmp/B.j9vx7ghf/BUILD/tmp + exec nice -n 0 rpmbuild -bp --short-circuit --nodeps --define '_topdir /tmp/B.j9vx7ghf' --define '_specdir %{_topdir}' --define '_sourcedir %{_specdir}' --define '_rpmdir %{_topdir}/RPMS' --define '_builddir %{_topdir}/BUILD' --target i686-pld-linux --define 'prep exit 0' /tmp/B.j9vx7ghf/libaio.spec warning: Could not canonicalize hostname: nereid Building target platforms: i686-pld-linux Building for target i686-pld-linux RPM build warnings: Could not canonicalize hostname: nereid checking BuildConflict-ing packages rpm: warning: Could not canonicalize hostname: nereid rpm: Building target platforms: i686-pld-linux rpm: Building for target i686-pld-linux rpm: rpm: RPM build warnings: rpm: Could not canonicalize hostname: nereid no BuildConflicts found checking BR rpm: warning: Could not canonicalize hostname: nereid rpm: Building target platforms: i686-pld-linux rpm: Building for target i686-pld-linux rpm: rpm: RPM build warnings: rpm: Could not canonicalize hostname: nereid no BR needed building RPM using: set -ex; : build-id: 3af6d9d9-489c-402b-96f7-a66fb823bb89; TMPDIR=/tmp/B.j9vx7ghf/BUILD/tmp exec nice -n 0 rpmbuild -bb --define '__jobs 28' --define '_smp_mflags -j28' --define '_make_opts -Otarget' --define '_pld_builder 1' --define '_topdir /tmp/B.j9vx7ghf' --define '_specdir %{_topdir}' --define '_sourcedir %{_specdir}' --define '_rpmdir %{_topdir}/RPMS' --define '_builddir %{_topdir}/BUILD' --target i686-pld-linux /tmp/B.j9vx7ghf/libaio.spec + : build-id: 3af6d9d9-489c-402b-96f7-a66fb823bb89 + TMPDIR=/tmp/B.j9vx7ghf/BUILD/tmp + exec nice -n 0 rpmbuild -bb --define '__jobs 28' --define '_smp_mflags -j28' --define '_make_opts -Otarget' --define '_pld_builder 1' --define '_topdir /tmp/B.j9vx7ghf' --define '_specdir %{_topdir}' --define '_sourcedir %{_specdir}' --define '_rpmdir %{_topdir}/RPMS' --define '_builddir %{_topdir}/BUILD' --target i686-pld-linux /tmp/B.j9vx7ghf/libaio.spec warning: Could not canonicalize hostname: nereid Building target platforms: i686-pld-linux Building for target i686-pld-linux Executing(%prep): /bin/sh -e /tmp/B.j9vx7ghf/BUILD/tmp/rpm-tmp.AhCWYA + umask 022 + cd /tmp/B.j9vx7ghf/BUILD + cd /tmp/B.j9vx7ghf/BUILD + rm -rf libaio-0.3.113 + /bin/gzip -dc /tmp/B.j9vx7ghf/libaio-0.3.113.tar.gz + /bin/tar -xof - + STATUS=0 + '[' 0 -ne 0 ']' + cd libaio-0.3.113 + /bin/chmod -Rf a+rX,u+w,g-w,o-w . + echo 'Patch #0 (libaio-DESTDIR.patch):' Patch #0 (libaio-DESTDIR.patch): + </tmp/B.j9vx7ghf/libaio-DESTDIR.patch + /usr/bin/patch -s -f -p1 '--fuzz=0' + echo 'Patch #1 (libaio-Werror.patch):' Patch #1 (libaio-Werror.patch): + </tmp/B.j9vx7ghf/libaio-Werror.patch + /usr/bin/patch -s -f -p1 '--fuzz=0' + echo 'Patch #2 (x32.patch):' Patch #2 (x32.patch): + </tmp/B.j9vx7ghf/x32.patch + /usr/bin/patch -s -f -p1 '--fuzz=0' + RPM_EC=0 + jobs -p + exit 0 Executing(%build): /bin/sh -e /tmp/B.j9vx7ghf/BUILD/tmp/rpm-tmp.62lK0r TMP=/home/users/builder/tmp HOME=/home/users/builder PATH=/home/users/builder/GNUstep/Tools:/bin:/usr/bin:/usr/local/bin:/home/users/builder/bin TMPDIR=/tmp/B.j9vx7ghf/BUILD/tmp + umask 022 + cd /tmp/B.j9vx7ghf/BUILD + cd libaio-0.3.113 + CFLAGS=' -O2 -fwrapv -pipe -Wformat -Werror=format-security -gdwarf-4 -fno-debug-types-section -fvar-tracking-assignments -g2 -Wp,-D_FORTIFY_SOURCE=2 -fomit-frame-pointer -fstack-protector-strong --param=ssp-buffer-size=4 -Werror=trampolines -fomit-frame-pointer -march=i686 -fasynchronous-unwind-tables -mtune=pentium4 -gdwarf-4 -fno-debug-types-section -fvar-tracking-assignments -g2 ' /usr/bin/make -Otarget -j28 'CC=i686-pld-linux-gcc' make[1]: Entering directory '/tmp/B.j9vx7ghf/BUILD/libaio-0.3.113/src' i686-pld-linux-gcc -O2 -fwrapv -pipe -Wformat -Werror=format-security -gdwarf-4 -fno-debug-types-section -fvar-tracking-assignments -g2 -Wp,-D_FORTIFY_SOURCE=2 -fomit-frame-pointer -fstack-protector-strong --param=ssp-buffer-size=4 -Werror=trampolines -fomit-frame-pointer -march=i686 -fasynchronous-unwind-tables -mtune=pentium4 -gdwarf-4 -fno-debug-types-section -fvar-tracking-assignments -g2 -Wall -I. -fPIC -c -o raw_syscall.ol raw_syscall.c make[1]: Leaving directory '/tmp/B.j9vx7ghf/BUILD/libaio-0.3.113/src' make[1]: Entering directory '/tmp/B.j9vx7ghf/BUILD/libaio-0.3.113/src' i686-pld-linux-gcc -O2 -fwrapv -pipe -Wformat -Werror=format-security -gdwarf-4 -fno-debug-types-section -fvar-tracking-assignments -g2 -Wp,-D_FORTIFY_SOURCE=2 -fomit-frame-pointer -fstack-protector-strong --param=ssp-buffer-size=4 -Werror=trampolines -fomit-frame-pointer -march=i686 -fasynchronous-unwind-tables -mtune=pentium4 -gdwarf-4 -fno-debug-types-section -fvar-tracking-assignments -g2 -Wall -I. -fPIC -c -o io_queue_release.ol io_queue_release.c make[1]: Leaving directory '/tmp/B.j9vx7ghf/BUILD/libaio-0.3.113/src' make[1]: Entering directory '/tmp/B.j9vx7ghf/BUILD/libaio-0.3.113/src' i686-pld-linux-gcc -shared -O2 -fwrapv -pipe -Wformat -Werror=format-security -gdwarf-4 -fno-debug-types-section -fvar-tracking-assignments -g2 -Wp,-D_FORTIFY_SOURCE=2 -fomit-frame-pointer -fstack-protector-strong --param=ssp-buffer-size=4 -Werror=trampolines -fomit-frame-pointer -march=i686 -fasynchronous-unwind-tables -mtune=pentium4 -gdwarf-4 -fno-debug-types-section -fvar-tracking-assignments -g2 -Wall -I. -fPIC -c -o io_queue_release.os io_queue_release.c make[1]: Leaving directory '/tmp/B.j9vx7ghf/BUILD/libaio-0.3.113/src' make[1]: Entering directory '/tmp/B.j9vx7ghf/BUILD/libaio-0.3.113/src' i686-pld-linux-gcc -shared -O2 -fwrapv -pipe -Wformat -Werror=format-security -gdwarf-4 -fno-debug-types-section -fvar-tracking-assignments -g2 -Wp,-D_FORTIFY_SOURCE=2 -fomit-frame-pointer -fstack-protector-strong --param=ssp-buffer-size=4 -Werror=trampolines -fomit-frame-pointer -march=i686 -fasynchronous-unwind-tables -mtune=pentium4 -gdwarf-4 -fno-debug-types-section -fvar-tracking-assignments -g2 -Wall -I. -fPIC -c -o raw_syscall.os raw_syscall.c make[1]: Leaving directory '/tmp/B.j9vx7ghf/BUILD/libaio-0.3.113/src' make[1]: Entering directory '/tmp/B.j9vx7ghf/BUILD/libaio-0.3.113/src' i686-pld-linux-gcc -O2 -fwrapv -pipe -Wformat -Werror=format-security -gdwarf-4 -fno-debug-types-section -fvar-tracking-assignments -g2 -Wp,-D_FORTIFY_SOURCE=2 -fomit-frame-pointer -fstack-protector-strong --param=ssp-buffer-size=4 -Werror=trampolines -fomit-frame-pointer -march=i686 -fasynchronous-unwind-tables -mtune=pentium4 -gdwarf-4 -fno-debug-types-section -fvar-tracking-assignments -g2 -Wall -I. -fPIC -c -o io_queue_init.ol io_queue_init.c make[1]: Leaving directory '/tmp/B.j9vx7ghf/BUILD/libaio-0.3.113/src' make[1]: Entering directory '/tmp/B.j9vx7ghf/BUILD/libaio-0.3.113/src' i686-pld-linux-gcc -O2 -fwrapv -pipe -Wformat -Werror=format-security -gdwarf-4 -fno-debug-types-section -fvar-tracking-assignments -g2 -Wp,-D_FORTIFY_SOURCE=2 -fomit-frame-pointer -fstack-protector-strong --param=ssp-buffer-size=4 -Werror=trampolines -fomit-frame-pointer -march=i686 -fasynchronous-unwind-tables -mtune=pentium4 -gdwarf-4 -fno-debug-types-section -fvar-tracking-assignments -g2 -Wall -I. -fPIC -c -o io_submit.ol io_submit.c make[1]: Leaving directory '/tmp/B.j9vx7ghf/BUILD/libaio-0.3.113/src' make[1]: Entering directory '/tmp/B.j9vx7ghf/BUILD/libaio-0.3.113/src' i686-pld-linux-gcc -O2 -fwrapv -pipe -Wformat -Werror=format-security -gdwarf-4 -fno-debug-types-section -fvar-tracking-assignments -g2 -Wp,-D_FORTIFY_SOURCE=2 -fomit-frame-pointer -fstack-protector-strong --param=ssp-buffer-size=4 -Werror=trampolines -fomit-frame-pointer -march=i686 -fasynchronous-unwind-tables -mtune=pentium4 -gdwarf-4 -fno-debug-types-section -fvar-tracking-assignments -g2 -Wall -I. -fPIC -c -o io_cancel.ol io_cancel.c make[1]: Leaving directory '/tmp/B.j9vx7ghf/BUILD/libaio-0.3.113/src' make[1]: Entering directory '/tmp/B.j9vx7ghf/BUILD/libaio-0.3.113/src' i686-pld-linux-gcc -O2 -fwrapv -pipe -Wformat -Werror=format-security -gdwarf-4 -fno-debug-types-section -fvar-tracking-assignments -g2 -Wp,-D_FORTIFY_SOURCE=2 -fomit-frame-pointer -fstack-protector-strong --param=ssp-buffer-size=4 -Werror=trampolines -fomit-frame-pointer -march=i686 -fasynchronous-unwind-tables -mtune=pentium4 -gdwarf-4 -fno-debug-types-section -fvar-tracking-assignments -g2 -Wall -I. -fPIC -c -o io_queue_wait.ol io_queue_wait.c make[1]: Leaving directory '/tmp/B.j9vx7ghf/BUILD/libaio-0.3.113/src' make[1]: Entering directory '/tmp/B.j9vx7ghf/BUILD/libaio-0.3.113/src' i686-pld-linux-gcc -shared -O2 -fwrapv -pipe -Wformat -Werror=format-security -gdwarf-4 -fno-debug-types-section -fvar-tracking-assignments -g2 -Wp,-D_FORTIFY_SOURCE=2 -fomit-frame-pointer -fstack-protector-strong --param=ssp-buffer-size=4 -Werror=trampolines -fomit-frame-pointer -march=i686 -fasynchronous-unwind-tables -mtune=pentium4 -gdwarf-4 -fno-debug-types-section -fvar-tracking-assignments -g2 -Wall -I. -fPIC -c -o io_setup.os io_setup.c make[1]: Leaving directory '/tmp/B.j9vx7ghf/BUILD/libaio-0.3.113/src' make[1]: Entering directory '/tmp/B.j9vx7ghf/BUILD/libaio-0.3.113/src' i686-pld-linux-gcc -O2 -fwrapv -pipe -Wformat -Werror=format-security -gdwarf-4 -fno-debug-types-section -fvar-tracking-assignments -g2 -Wp,-D_FORTIFY_SOURCE=2 -fomit-frame-pointer -fstack-protector-strong --param=ssp-buffer-size=4 -Werror=trampolines -fomit-frame-pointer -march=i686 -fasynchronous-unwind-tables -mtune=pentium4 -gdwarf-4 -fno-debug-types-section -fvar-tracking-assignments -g2 -Wall -I. -fPIC -c -o io_destroy.ol io_destroy.c make[1]: Leaving directory '/tmp/B.j9vx7ghf/BUILD/libaio-0.3.113/src' make[1]: Entering directory '/tmp/B.j9vx7ghf/BUILD/libaio-0.3.113/src' i686-pld-linux-gcc -O2 -fwrapv -pipe -Wformat -Werror=format-security -gdwarf-4 -fno-debug-types-section -fvar-tracking-assignments -g2 -Wp,-D_FORTIFY_SOURCE=2 -fomit-frame-pointer -fstack-protector-strong --param=ssp-buffer-size=4 -Werror=trampolines -fomit-frame-pointer -march=i686 -fasynchronous-unwind-tables -mtune=pentium4 -gdwarf-4 -fno-debug-types-section -fvar-tracking-assignments -g2 -Wall -I. -fPIC -c -o io_getevents.ol io_getevents.c make[1]: Leaving directory '/tmp/B.j9vx7ghf/BUILD/libaio-0.3.113/src' make[1]: Entering directory '/tmp/B.j9vx7ghf/BUILD/libaio-0.3.113/src' i686-pld-linux-gcc -O2 -fwrapv -pipe -Wformat -Werror=format-security -gdwarf-4 -fno-debug-types-section -fvar-tracking-assignments -g2 -Wp,-D_FORTIFY_SOURCE=2 -fomit-frame-pointer -fstack-protector-strong --param=ssp-buffer-size=4 -Werror=trampolines -fomit-frame-pointer -march=i686 -fasynchronous-unwind-tables -mtune=pentium4 -gdwarf-4 -fno-debug-types-section -fvar-tracking-assignments -g2 -Wall -I. -fPIC -c -o io_queue_run.ol io_queue_run.c make[1]: Leaving directory '/tmp/B.j9vx7ghf/BUILD/libaio-0.3.113/src' make[1]: Entering directory '/tmp/B.j9vx7ghf/BUILD/libaio-0.3.113/src' i686-pld-linux-gcc -O2 -fwrapv -pipe -Wformat -Werror=format-security -gdwarf-4 -fno-debug-types-section -fvar-tracking-assignments -g2 -Wp,-D_FORTIFY_SOURCE=2 -fomit-frame-pointer -fstack-protector-strong --param=ssp-buffer-size=4 -Werror=trampolines -fomit-frame-pointer -march=i686 -fasynchronous-unwind-tables -mtune=pentium4 -gdwarf-4 -fno-debug-types-section -fvar-tracking-assignments -g2 -Wall -I. -fPIC -c -o compat-0_1.ol compat-0_1.c make[1]: Leaving directory '/tmp/B.j9vx7ghf/BUILD/libaio-0.3.113/src' make[1]: Entering directory '/tmp/B.j9vx7ghf/BUILD/libaio-0.3.113/src' i686-pld-linux-gcc -shared -O2 -fwrapv -pipe -Wformat -Werror=format-security -gdwarf-4 -fno-debug-types-section -fvar-tracking-assignments -g2 -Wp,-D_FORTIFY_SOURCE=2 -fomit-frame-pointer -fstack-protector-strong --param=ssp-buffer-size=4 -Werror=trampolines -fomit-frame-pointer -march=i686 -fasynchronous-unwind-tables -mtune=pentium4 -gdwarf-4 -fno-debug-types-section -fvar-tracking-assignments -g2 -Wall -I. -fPIC -c -o io_cancel.os io_cancel.c make[1]: Leaving directory '/tmp/B.j9vx7ghf/BUILD/libaio-0.3.113/src' make[1]: Entering directory '/tmp/B.j9vx7ghf/BUILD/libaio-0.3.113/src' i686-pld-linux-gcc -shared -O2 -fwrapv -pipe -Wformat -Werror=format-security -gdwarf-4 -fno-debug-types-section -fvar-tracking-assignments -g2 -Wp,-D_FORTIFY_SOURCE=2 -fomit-frame-pointer -fstack-protector-strong --param=ssp-buffer-size=4 -Werror=trampolines -fomit-frame-pointer -march=i686 -fasynchronous-unwind-tables -mtune=pentium4 -gdwarf-4 -fno-debug-types-section -fvar-tracking-assignments -g2 -Wall -I. -fPIC -c -o io_queue_init.os io_queue_init.c make[1]: Leaving directory '/tmp/B.j9vx7ghf/BUILD/libaio-0.3.113/src' make[1]: Entering directory '/tmp/B.j9vx7ghf/BUILD/libaio-0.3.113/src' i686-pld-linux-gcc -shared -O2 -fwrapv -pipe -Wformat -Werror=format-security -gdwarf-4 -fno-debug-types-section -fvar-tracking-assignments -g2 -Wp,-D_FORTIFY_SOURCE=2 -fomit-frame-pointer -fstack-protector-strong --param=ssp-buffer-size=4 -Werror=trampolines -fomit-frame-pointer -march=i686 -fasynchronous-unwind-tables -mtune=pentium4 -gdwarf-4 -fno-debug-types-section -fvar-tracking-assignments -g2 -Wall -I. -fPIC -c -o io_getevents.os io_getevents.c make[1]: Leaving directory '/tmp/B.j9vx7ghf/BUILD/libaio-0.3.113/src' make[1]: Entering directory '/tmp/B.j9vx7ghf/BUILD/libaio-0.3.113/src' i686-pld-linux-gcc -shared -O2 -fwrapv -pipe -Wformat -Werror=format-security -gdwarf-4 -fno-debug-types-section -fvar-tracking-assignments -g2 -Wp,-D_FORTIFY_SOURCE=2 -fomit-frame-pointer -fstack-protector-strong --param=ssp-buffer-size=4 -Werror=trampolines -fomit-frame-pointer -march=i686 -fasynchronous-unwind-tables -mtune=pentium4 -gdwarf-4 -fno-debug-types-section -fvar-tracking-assignments -g2 -Wall -I. -fPIC -c -o compat-0_1.os compat-0_1.c make[1]: Leaving directory '/tmp/B.j9vx7ghf/BUILD/libaio-0.3.113/src' make[1]: Entering directory '/tmp/B.j9vx7ghf/BUILD/libaio-0.3.113/src' i686-pld-linux-gcc -O2 -fwrapv -pipe -Wformat -Werror=format-security -gdwarf-4 -fno-debug-types-section -fvar-tracking-assignments -g2 -Wp,-D_FORTIFY_SOURCE=2 -fomit-frame-pointer -fstack-protector-strong --param=ssp-buffer-size=4 -Werror=trampolines -fomit-frame-pointer -march=i686 -fasynchronous-unwind-tables -mtune=pentium4 -gdwarf-4 -fno-debug-types-section -fvar-tracking-assignments -g2 -Wall -I. -fPIC -c -o io_setup.ol io_setup.c make[1]: Leaving directory '/tmp/B.j9vx7ghf/BUILD/libaio-0.3.113/src' make[1]: Entering directory '/tmp/B.j9vx7ghf/BUILD/libaio-0.3.113/src' i686-pld-linux-gcc -shared -O2 -fwrapv -pipe -Wformat -Werror=format-security -gdwarf-4 -fno-debug-types-section -fvar-tracking-assignments -g2 -Wp,-D_FORTIFY_SOURCE=2 -fomit-frame-pointer -fstack-protector-strong --param=ssp-buffer-size=4 -Werror=trampolines -fomit-frame-pointer -march=i686 -fasynchronous-unwind-tables -mtune=pentium4 -gdwarf-4 -fno-debug-types-section -fvar-tracking-assignments -g2 -Wall -I. -fPIC -c -o io_queue_wait.os io_queue_wait.c make[1]: Leaving directory '/tmp/B.j9vx7ghf/BUILD/libaio-0.3.113/src' make[1]: Entering directory '/tmp/B.j9vx7ghf/BUILD/libaio-0.3.113/src' i686-pld-linux-gcc -shared -O2 -fwrapv -pipe -Wformat -Werror=format-security -gdwarf-4 -fno-debug-types-section -fvar-tracking-assignments -g2 -Wp,-D_FORTIFY_SOURCE=2 -fomit-frame-pointer -fstack-protector-strong --param=ssp-buffer-size=4 -Werror=trampolines -fomit-frame-pointer -march=i686 -fasynchronous-unwind-tables -mtune=pentium4 -gdwarf-4 -fno-debug-types-section -fvar-tracking-assignments -g2 -Wall -I. -fPIC -c -o io_queue_run.os io_queue_run.c make[1]: Leaving directory '/tmp/B.j9vx7ghf/BUILD/libaio-0.3.113/src' make[1]: Entering directory '/tmp/B.j9vx7ghf/BUILD/libaio-0.3.113/src' i686-pld-linux-gcc -shared -O2 -fwrapv -pipe -Wformat -Werror=format-security -gdwarf-4 -fno-debug-types-section -fvar-tracking-assignments -g2 -Wp,-D_FORTIFY_SOURCE=2 -fomit-frame-pointer -fstack-protector-strong --param=ssp-buffer-size=4 -Werror=trampolines -fomit-frame-pointer -march=i686 -fasynchronous-unwind-tables -mtune=pentium4 -gdwarf-4 -fno-debug-types-section -fvar-tracking-assignments -g2 -Wall -I. -fPIC -c -o io_submit.os io_submit.c make[1]: Leaving directory '/tmp/B.j9vx7ghf/BUILD/libaio-0.3.113/src' make[1]: Entering directory '/tmp/B.j9vx7ghf/BUILD/libaio-0.3.113/src' i686-pld-linux-gcc -shared -O2 -fwrapv -pipe -Wformat -Werror=format-security -gdwarf-4 -fno-debug-types-section -fvar-tracking-assignments -g2 -Wp,-D_FORTIFY_SOURCE=2 -fomit-frame-pointer -fstack-protector-strong --param=ssp-buffer-size=4 -Werror=trampolines -fomit-frame-pointer -march=i686 -fasynchronous-unwind-tables -mtune=pentium4 -gdwarf-4 -fno-debug-types-section -fvar-tracking-assignments -g2 -Wall -I. -fPIC -c -o io_pgetevents.os io_pgetevents.c make[1]: Leaving directory '/tmp/B.j9vx7ghf/BUILD/libaio-0.3.113/src' make[1]: Entering directory '/tmp/B.j9vx7ghf/BUILD/libaio-0.3.113/src' i686-pld-linux-gcc -shared -O2 -fwrapv -pipe -Wformat -Werror=format-security -gdwarf-4 -fno-debug-types-section -fvar-tracking-assignments -g2 -Wp,-D_FORTIFY_SOURCE=2 -fomit-frame-pointer -fstack-protector-strong --param=ssp-buffer-size=4 -Werror=trampolines -fomit-frame-pointer -march=i686 -fasynchronous-unwind-tables -mtune=pentium4 -gdwarf-4 -fno-debug-types-section -fvar-tracking-assignments -g2 -Wall -I. -fPIC -c -o io_destroy.os io_destroy.c make[1]: Leaving directory '/tmp/B.j9vx7ghf/BUILD/libaio-0.3.113/src' make[1]: Entering directory '/tmp/B.j9vx7ghf/BUILD/libaio-0.3.113/src' i686-pld-linux-gcc -O2 -fwrapv -pipe -Wformat -Werror=format-security -gdwarf-4 -fno-debug-types-section -fvar-tracking-assignments -g2 -Wp,-D_FORTIFY_SOURCE=2 -fomit-frame-pointer -fstack-protector-strong --param=ssp-buffer-size=4 -Werror=trampolines -fomit-frame-pointer -march=i686 -fasynchronous-unwind-tables -mtune=pentium4 -gdwarf-4 -fno-debug-types-section -fvar-tracking-assignments -g2 -Wall -I. -fPIC -c struct_offsets.c i686-pld-linux-gcc -shared -O2 -fwrapv -pipe -Wformat -Werror=format-security -gdwarf-4 -fno-debug-types-section -fvar-tracking-assignments -g2 -Wp,-D_FORTIFY_SOURCE=2 -fomit-frame-pointer -fstack-protector-strong --param=ssp-buffer-size=4 -Werror=trampolines -fomit-frame-pointer -march=i686 -fasynchronous-unwind-tables -mtune=pentium4 -gdwarf-4 -fno-debug-types-section -fvar-tracking-assignments -g2 -Wall -I. -fPIC -Wl,--version-script=libaio.map -Wl,-soname=libaio.so.1 -o libaio.so.1.0.2 io_queue_init.os io_queue_release.os io_queue_wait.os io_queue_run.os io_getevents.os io_submit.os io_cancel.os io_setup.os io_destroy.os io_pgetevents.os raw_syscall.os compat-0_1.os make[1]: Leaving directory '/tmp/B.j9vx7ghf/BUILD/libaio-0.3.113/src' make[1]: Entering directory '/tmp/B.j9vx7ghf/BUILD/libaio-0.3.113/src' i686-pld-linux-gcc -O2 -fwrapv -pipe -Wformat -Werror=format-security -gdwarf-4 -fno-debug-types-section -fvar-tracking-assignments -g2 -Wp,-D_FORTIFY_SOURCE=2 -fomit-frame-pointer -fstack-protector-strong --param=ssp-buffer-size=4 -Werror=trampolines -fomit-frame-pointer -march=i686 -fasynchronous-unwind-tables -mtune=pentium4 -gdwarf-4 -fno-debug-types-section -fvar-tracking-assignments -g2 -Wall -I. -fPIC -c -o io_pgetevents.ol io_pgetevents.c make[1]: Leaving directory '/tmp/B.j9vx7ghf/BUILD/libaio-0.3.113/src' make[1]: Entering directory '/tmp/B.j9vx7ghf/BUILD/libaio-0.3.113/src' rm -f libaio.a ar r libaio.a io_queue_init.ol io_queue_release.ol io_queue_wait.ol io_queue_run.ol io_getevents.ol io_submit.ol io_cancel.ol io_setup.ol io_destroy.ol io_pgetevents.ol raw_syscall.ol compat-0_1.ol ar: creating libaio.a ranlib libaio.a make[1]: Leaving directory '/tmp/B.j9vx7ghf/BUILD/libaio-0.3.113/src' + /usr/bin/make -Otarget -j28 'CC=i686-pld-linux-gcc' partcheck make[1]: Nothing to be done for 'all'. make[1]: Entering directory '/tmp/B.j9vx7ghf/BUILD/libaio-0.3.113/harness' mkdir testdir make[1]: Leaving directory '/tmp/B.j9vx7ghf/BUILD/libaio-0.3.113/harness' make[1]: Entering directory '/tmp/B.j9vx7ghf/BUILD/libaio-0.3.113/harness' rm -f testdir/rofile echo "test" >testdir/rofile chmod 400 testdir/rofile make[1]: Leaving directory '/tmp/B.j9vx7ghf/BUILD/libaio-0.3.113/harness' make[1]: Entering directory '/tmp/B.j9vx7ghf/BUILD/libaio-0.3.113/harness' rm -f testdir/wofile echo "test" >testdir/wofile chmod 200 testdir/wofile make[1]: Leaving directory '/tmp/B.j9vx7ghf/BUILD/libaio-0.3.113/harness' make[1]: Entering directory '/tmp/B.j9vx7ghf/BUILD/libaio-0.3.113/harness' rm -f testdir/rwfile echo "test" >testdir/rwfile chmod 600 testdir/rwfile make[1]: Leaving directory '/tmp/B.j9vx7ghf/BUILD/libaio-0.3.113/harness' make[1]: Entering directory '/tmp/B.j9vx7ghf/BUILD/libaio-0.3.113/harness' i686-pld-linux-gcc -Wall -I../src -DTEST_NAME=\"cases/2.t\" -o cases/2.p main.c ../src/libaio.a -lpthread make[1]: Leaving directory '/tmp/B.j9vx7ghf/BUILD/libaio-0.3.113/harness' make[1]: Entering directory '/tmp/B.j9vx7ghf/BUILD/libaio-0.3.113/harness' i686-pld-linux-gcc -Wall -I../src -Wno-stringop-overflow -DTEST_NAME=\"cases/3.t\" -o cases/3.p main.c ../src/libaio.a -lpthread make[1]: Leaving directory '/tmp/B.j9vx7ghf/BUILD/libaio-0.3.113/harness' make[1]: Entering directory '/tmp/B.j9vx7ghf/BUILD/libaio-0.3.113/harness' i686-pld-linux-gcc -Wall -I../src -DTEST_NAME=\"cases/6.t\" -o cases/6.p main.c ../src/libaio.a -lpthread make[1]: Leaving directory '/tmp/B.j9vx7ghf/BUILD/libaio-0.3.113/harness' make[1]: Entering directory '/tmp/B.j9vx7ghf/BUILD/libaio-0.3.113/harness' i686-pld-linux-gcc -Wall -I../src -DTEST_NAME=\"cases/21.t\" -o cases/21.p main.c ../src/libaio.a -lpthread make[1]: Leaving directory '/tmp/B.j9vx7ghf/BUILD/libaio-0.3.113/harness' make[1]: Entering directory '/tmp/B.j9vx7ghf/BUILD/libaio-0.3.113/harness' i686-pld-linux-gcc -Wall -I../src -DTEST_NAME=\"cases/5.t\" -o cases/5.p main.c ../src/libaio.a -lpthread make[1]: Leaving directory '/tmp/B.j9vx7ghf/BUILD/libaio-0.3.113/harness' make[1]: Entering directory '/tmp/B.j9vx7ghf/BUILD/libaio-0.3.113/harness' i686-pld-linux-gcc -Wall -I../src -DTEST_NAME=\"cases/19.t\" -o cases/19.p main.c ../src/libaio.a -lpthread make[1]: Leaving directory '/tmp/B.j9vx7ghf/BUILD/libaio-0.3.113/harness' make[1]: Entering directory '/tmp/B.j9vx7ghf/BUILD/libaio-0.3.113/harness' i686-pld-linux-gcc -Wall -I../src -DTEST_NAME=\"cases/12.t\" -o cases/12.p main.c ../src/libaio.a -lpthread make[1]: Leaving directory '/tmp/B.j9vx7ghf/BUILD/libaio-0.3.113/harness' make[1]: Entering directory '/tmp/B.j9vx7ghf/BUILD/libaio-0.3.113/harness' i686-pld-linux-gcc -Wall -I../src -DTEST_NAME=\"cases/4.t\" -o cases/4.p main.c ../src/libaio.a -lpthread make[1]: Leaving directory '/tmp/B.j9vx7ghf/BUILD/libaio-0.3.113/harness' make[1]: Entering directory '/tmp/B.j9vx7ghf/BUILD/libaio-0.3.113/harness' i686-pld-linux-gcc -Wall -I../src -DTEST_NAME=\"cases/11.t\" -o cases/11.p main.c ../src/libaio.a -lpthread make[1]: Leaving directory '/tmp/B.j9vx7ghf/BUILD/libaio-0.3.113/harness' make[1]: Entering directory '/tmp/B.j9vx7ghf/BUILD/libaio-0.3.113/harness' i686-pld-linux-gcc -Wall -I../src -DTEST_NAME=\"cases/16.t\" -o cases/16.p main.c ../src/libaio.a -lpthread make[1]: Leaving directory '/tmp/B.j9vx7ghf/BUILD/libaio-0.3.113/harness' make[1]: Entering directory '/tmp/B.j9vx7ghf/BUILD/libaio-0.3.113/harness' i686-pld-linux-gcc -Wall -I../src -DTEST_NAME=\"cases/20.t\" -o cases/20.p main.c ../src/libaio.a -lpthread make[1]: Leaving directory '/tmp/B.j9vx7ghf/BUILD/libaio-0.3.113/harness' make[1]: Entering directory '/tmp/B.j9vx7ghf/BUILD/libaio-0.3.113/harness' i686-pld-linux-gcc -Wall -I../src -DTEST_NAME=\"cases/22.t\" -o cases/22.p main.c ../src/libaio.a -lpthread make[1]: Leaving directory '/tmp/B.j9vx7ghf/BUILD/libaio-0.3.113/harness' make[1]: Entering directory '/tmp/B.j9vx7ghf/BUILD/libaio-0.3.113/harness' i686-pld-linux-gcc -Wall -I../src -DTEST_NAME=\"cases/14.t\" -o cases/14.p main.c ../src/libaio.a -lpthread make[1]: Leaving directory '/tmp/B.j9vx7ghf/BUILD/libaio-0.3.113/harness' make[1]: Entering directory '/tmp/B.j9vx7ghf/BUILD/libaio-0.3.113/harness' i686-pld-linux-gcc -Wall -I../src -DTEST_NAME=\"cases/15.t\" -o cases/15.p main.c ../src/libaio.a -lpthread make[1]: Leaving directory '/tmp/B.j9vx7ghf/BUILD/libaio-0.3.113/harness' make[1]: Entering directory '/tmp/B.j9vx7ghf/BUILD/libaio-0.3.113/harness' i686-pld-linux-gcc -Wall -I../src -DTEST_NAME=\"cases/13.t\" -o cases/13.p main.c ../src/libaio.a -lpthread make[1]: Leaving directory '/tmp/B.j9vx7ghf/BUILD/libaio-0.3.113/harness' make[1]: Entering directory '/tmp/B.j9vx7ghf/BUILD/libaio-0.3.113/harness' i686-pld-linux-gcc -Wall -I../src -DTEST_NAME=\"cases/17.t\" -o cases/17.p main.c ../src/libaio.a -lpthread make[1]: Leaving directory '/tmp/B.j9vx7ghf/BUILD/libaio-0.3.113/harness' make[1]: Entering directory '/tmp/B.j9vx7ghf/BUILD/libaio-0.3.113/harness' i686-pld-linux-gcc -Wall -I../src -DTEST_NAME=\"cases/23.t\" -o cases/23.p main.c ../src/libaio.a -lpthread In file included from main.c:24: cases/23.t: In function 'thrproc2': cases/23.t:82:35: warning: passing argument 2 of 'splice' from incompatible pointer type [-Wincompatible-pointer-types] 82 | if (splice(tmpfd, &offset, pipefds[1], NULL, 1, 0) != 1) | ^~~~~~~ | | | off_t * {aka long int *} In file included from /usr/include/bits/fcntl.h:61, from /usr/include/fcntl.h:35, from main.c:9: /usr/include/bits/fcntl-linux.h:398:49: note: expected '__off64_t *' {aka 'long long int *'} but argument is of type 'off_t *' {aka 'long int *'} 398 | extern __ssize_t splice (int __fdin, __off64_t *__offin, int __fdout, | ~~~~~~~~~~~^~~~~~~ cases/23.t: In function 'thrproc3': cases/23.t:106:35: warning: passing argument 2 of 'splice' from incompatible pointer type [-Wincompatible-pointer-types] 106 | if (splice(tmpfd, &offset, pipefds[1], NULL, 1, 0) != 1) | ^~~~~~~ | | | off_t * {aka long int *} /usr/include/bits/fcntl-linux.h:398:49: note: expected '__off64_t *' {aka 'long long int *'} but argument is of type 'off_t *' {aka 'long int *'} 398 | extern __ssize_t splice (int __fdin, __off64_t *__offin, int __fdout, | ~~~~~~~~~~~^~~~~~~ make[1]: Leaving directory '/tmp/B.j9vx7ghf/BUILD/libaio-0.3.113/harness' make[1]: Entering directory '/tmp/B.j9vx7ghf/BUILD/libaio-0.3.113/harness' i686-pld-linux-gcc -Wall -I../src -DTEST_NAME=\"cases/18.t\" -o cases/18.p main.c ../src/libaio.a -lpthread make[1]: Leaving directory '/tmp/B.j9vx7ghf/BUILD/libaio-0.3.113/harness' make[1]: Entering directory '/tmp/B.j9vx7ghf/BUILD/libaio-0.3.113/harness' i686-pld-linux-gcc -Wall -I../src -DTEST_NAME=\"cases/7.t\" -o cases/7.p main.c ../src/libaio.a -lpthread make[1]: Leaving directory '/tmp/B.j9vx7ghf/BUILD/libaio-0.3.113/harness' make[1]: Entering directory '/tmp/B.j9vx7ghf/BUILD/libaio-0.3.113/harness' ./runtests.sh cases/2.p cases/3.p cases/4.p cases/5.p cases/6.p cases/7.p cases/11.p cases/12.p cases/13.p cases/14.p cases/15.p cases/16.p cases/17.p cases/18.p cases/19.p cases/20.p cases/21.p cases/22.p cases/23.p Test run starting at Sun Feb 11 09:44:09 CET 2024 Starting cases/2.p expect -14: io_setup(-1000, 0xc0010000) = -14 [Bad address] expect -14: io_setup( 1000, 0xc0010000) = -14 [Bad address] expect -14: io_setup( 0, 0xc0010000) = -14 [Bad address] expect -22: io_setup(-1000, 0xffdc6758) = -22 [Invalid argument] expect -22: io_setup( -1, 0xffdc6758) = -22 [Invalid argument] expect -22: io_setup( 0, 0xffdc6758) = -22 [Invalid argument] expect 0: io_setup( 1, 0xffdc6758) = 0 [Success] expect -22: io_setup( 1, 0xffdc6758) = -22 [Invalid argument] test cases/2.t completed PASSED. Completed cases/2.p with 0. Starting cases/3.p expect -22: io_submit(0xffffffff, 1, 0xff8c8a74) = -22 [Invalid argument] expect 0: io_submit(0xf7f2c000, 0, 0xff8c8a74) = 0 [Success] expect -14: io_submit(0xf7f2c000, 1, (nil)) = -14 [Bad address] expect -14: io_submit(0xf7f2c000, 1, 0xffffffff) = -14 [Bad address] expect -14: io_submit(0xf7f2c000, 2, 0xff8c8a6c) = -14 [Bad address] expect -14: io_submit(0xf7f2c000, 2, 0xff8c8a64) = -14 [Bad address] expect -22: io_submit(0xf7f2c000, -1, 0xff8c8a74) = -22 [Invalid argument] test cases/3.t completed PASSED. Completed cases/3.p with 0. Starting cases/4.p expect -9: (w), res = sync_submit: io_submit res=-9 [Bad file descriptor] -9 [Bad file descriptor] expect -9: (r), res = sync_submit: io_submit res=-9 [Bad file descriptor] -9 [Bad file descriptor] expect 512: (w), res = 512 [Success] expect 512: (r), res = 512 [Success] expect -22: (r), res = sync_submit: io_submit res=-22 [Invalid argument] -22 [Invalid argument] expect -22: (w), res = sync_submit: io_submit res=-22 [Invalid argument] -22 [Invalid argument] expect 0: (r), res = 0 [Success] expect 4: (w), res = 4 [Success] expect 4: (w), res = 4 [Success] expect 8: (r), res = 8 [Success] read after append: [12345678] expect -14: (r), res = -14 [Bad address] expect -14: (w), res = -14 [Bad address] expect -14: (w), res = -14 [Bad address] test cases/4.t completed PASSED. Completed cases/4.p with 0. Starting cases/5.p expect 512: (w), res = 512 [Success] expect 512: (r), res = 512 [Success] expect 512: (r), res = 512 [Success] expect 512: (w), res = 512 [Success] expect 512: (w), res = 512 [Success] expect -14: (r), res = -14 [Bad address] expect 512: (r), res = 512 [Success] expect 512: (w), res = 512 [Success] test cases/5.t completed PASSED. Completed cases/5.p with 0. Starting cases/6.p size = 131898052 expect 805306368: (w), res = 805306368 [Success] expect 805306368: (r), res = 805306368 [Success] test cases/6.t completed PASSED. Completed cases/6.p with 0. Starting cases/7.p expect 512: (w), res = 512 [Success] expect 512: (r), res = 512 [Success] expect 511: (w), res = 511 [Success] expect 511: (r), res = 511 [Success] expect -27: (w), res = -27 [File too large] expect 0: (r), res = 0 [Success] expect 0: (w), res = 0 [Success] test cases/7.t completed PASSED. Completed cases/7.p with 0. Starting cases/11.p completed 1000000 out of 1000000 writes completed 1000000 out of 1000000 reads test cases/11.t completed PASSED. Completed cases/11.p with 0. Starting cases/12.p expect 0: io_submit(0xf7f53000, 0, (nil)) = 0 [Success] expect -22: io_submit(0xf7f53000, 0, (nil)) = -22 [Invalid argument] child exited with status 0 test cases/12.t completed PASSED. Completed cases/12.p with 0. Starting cases/13.p expect 8: io_submit(0xf7ed9000, 8, 0xff8ab71c) = 8 [] event[0]: write[0] okay, returned: 1048576 [okay] event[1]: write[1] okay, returned: 1048576 [okay] event[2]: write[2] okay, returned: 1048576 [okay] event[3]: write[3] okay, returned: 1048576 [okay] event[4]: write[4] okay, returned: 1048576 [okay] event[5]: write[5] okay, returned: 1048576 [okay] event[6]: write[6] okay, returned: 1048576 [okay] event[7]: write[7] okay, returned: 1048576 [okay] test cases/13.t completed PASSED. Completed cases/13.p with 0. Starting cases/14.p expect 0: io_submit(0xf7eff000, 0, (nil)) = 0 [Success] child exited with status 0 test cases/14.t completed PASSED. Completed cases/14.p with 0. Starting cases/15.p expect 5120: (>), res = 5120 [Success] Checking memory: [Success] expect 5120: (<), res = 5120 [Success] expect 4608: (>), res = 4608 [Success] Checking memory: [Success] expect 4608: (<), res = 4608 [Success] Checking memory: [Success] test cases/15.t completed PASSED. Completed cases/15.p with 0. Starting cases/16.p eventfd write test [SUCCESS] eventfd read test [SUCCESS] test cases/16.t completed PASSED. Completed cases/16.p with 0. Starting cases/17.p aio ring size: 511 MAX_IOS: 510, IO_GETEVENTS Submitting: 510 Submitted: 510 Completed: 510 Verifying... OK MAX_IOS: 511, IO_GETEVENTS Submitting: 511 Submitted: 510 Submitting: 1 Submitted too much, that's okay Completed: 510 Submitting: 1 Submitted: 1 Completed: 1 Verifying... OK MAX_IOS: 512, IO_GETEVENTS Submitting: 512 Submitted: 510 Submitting: 2 Submitted too much, that's okay Completed: 510 Submitting: 2 Submitted: 2 Completed: 2 Verifying... OK MAX_IOS: 1022, IO_GETEVENTS Submitting: 1022 Submitted: 510 Submitting: 512 Submitted too much, that's okay Completed: 510 Submitting: 512 Submitted: 510 Submitting: 2 Submitted too much, that's okay Completed: 510 Submitting: 2 Submitted: 2 Completed: 2 Verifying... OK MAX_IOS: 2044, IO_GETEVENTS Submitting: 2044 Submitted: 510 Submitting: 1534 Submitted too much, that's okay Completed: 510 Submitting: 1534 Submitted: 510 Submitting: 1024 Submitted too much, that's okay Completed: 510 Submitting: 1024 Submitted: 510 Submitting: 514 Submitted too much, that's okay Completed: 510 Submitting: 514 Submitted: 510 Submitting: 4 Submitted too much, that's okay Completed: 510 Submitting: 4 Submitted: 4 Completed: 4 Verifying... OK MAX_IOS: 510, USER_GETEVENTS Submitting: 510 Submitted: 510 Completed: 510 Verifying... OK MAX_IOS: 511, USER_GETEVENTS Submitting: 511 Submitted: 510 Submitting: 1 Submitted too much, that's okay Completed: 510 Submitting: 1 Submitted: 1 Completed: 1 Verifying... OK MAX_IOS: 512, USER_GETEVENTS Submitting: 512 Submitted: 510 Submitting: 2 Submitted too much, that's okay Completed: 510 Submitting: 2 Submitted: 2 Completed: 2 Verifying... OK MAX_IOS: 1022, USER_GETEVENTS Submitting: 1022 Submitted: 510 Submitting: 512 Submitted too much, that's okay Completed: 510 Submitting: 512 Submitted: 510 Submitting: 2 Submitted too much, that's okay Completed: 510 Submitting: 2 Submitted: 2 Completed: 2 Verifying... OK MAX_IOS: 2044, USER_GETEVENTS Submitting: 2044 Submitted: 510 Submitting: 1534 Submitted too much, that's okay Completed: 510 Submitting: 1534 Submitted: 510 Submitting: 1024 Submitted too much, that's okay Completed: 510 Submitting: 1024 Submitted: 510 Submitting: 514 Submitted too much, that's okay Completed: 510 Submitting: 514 Submitted: 510 Submitting: 4 Submitted too much, that's okay Completed: 510 Submitting: 4 Submitted: 4 Completed: 4 Verifying... OK test cases/17.t completed PASSED. Completed cases/17.p with 0. Starting cases/18.p test cases/18.t completed PASSED. Completed cases/18.p with 0. Starting cases/19.p test cases/19.t completed PASSED. Completed cases/19.p with 0. Starting cases/20.p aio_max_nr: 65536 Creating 65536 ioctx-s with 1 events each... Successfully created 65509 io_context-s Last io_setup call returned -12 (Cannot allocate memory) Creating 32768 ioctx-s with 2 events each... Successfully created 32768 io_context-s Creating 16384 ioctx-s with 4 events each... Successfully created 16384 io_context-s Creating 8192 ioctx-s with 8 events each... Successfully created 8192 io_context-s Creating 4096 ioctx-s with 16 events each... Successfully created 4096 io_context-s Creating 2048 ioctx-s with 32 events each... Successfully created 2048 io_context-s Creating 1024 ioctx-s with 64 events each... Successfully created 1024 io_context-s Creating 512 ioctx-s with 128 events each... Successfully created 512 io_context-s Creating 256 ioctx-s with 256 events each... Successfully created 256 io_context-s Creating 128 ioctx-s with 512 events each... Successfully created 128 io_context-s Creating 64 ioctx-s with 1024 events each... Successfully created 64 io_context-s Creating 32 ioctx-s with 2048 events each... Successfully created 32 io_context-s Creating 16 ioctx-s with 4096 events each... Successfully created 16 io_context-s Creating 8 ioctx-s with 8192 events each... Successfully created 8 io_context-s Creating 4 ioctx-s with 16384 events each... Successfully created 4 io_context-s Creating 2 ioctx-s with 32768 events each... Successfully created 2 io_context-s Creating 1 ioctx-s with 65536 events each... Successfully created 1 io_context-s test cases/20.t completed PASSED. Completed cases/20.p with 0. Starting cases/21.p test cases/21.t completed PASSED. Completed cases/21.p with 0. Starting cases/22.p test cases/22.t completed PASSED. Completed cases/22.p with 0. Starting cases/23.p splice failed in thread 2: Invalid argument splice failed in thread 2: Invalid argument splice failed in thread 2splice failed in thread 2: Invalid argument : Invalid argument splice failed in thread 2: Invalid argumentsplice failed in thread 2 : Invalid argument splice failed in thread 2: Invalid argument splice failed in thread 2: Invalid argument splice failed in thread 2: Invalid argument splice failed in thread 2: Invalid argument splice failed in thread 2: Invalid argument splice failed in thread 2: Invalid argument splice failed in thread 2: Invalid argument splice failed in thread 2: Invalid argument splice failed in thread 2: Invalid argument splice failed in thread 2: Invalid argument splice failed in thread 2splice failed in thread 2: Invalid argument: Invalid argument splice failed in thread 2: Invalid argument splice failed in thread 2: Invalid argument splice failed in thread 2splice failed in thread 2splice failed in thread 2: Invalid argument: Invalid argument : Invalid argumentsplice failed in thread 2 : Invalid argument splice failed in thread 2: Invalid argument splice failed in thread 2: Invalid argument splice failed in thread 2: Invalid argument splice failed in thread 2splice failed in thread 2: Invalid argument : Invalid argument splice failed in thread 2: Invalid argument splice failed in thread 2: Invalid argument splice failed in thread 2: Invalid argument splice failed in thread 2splice failed in thread 2: Invalid argument : Invalid argument splice failed in thread 2: Invalid argument splice failed in thread 2: Invalid argument splice failed in thread 2: Invalid argument splice failed in thread 2: Invalid argument splice failed in thread 2: Invalid argument splice failed in thread 2: Invalid argument splice failed in thread 2: Invalid argument splice failed in thread 2: Invalid argument splice failed in thread 2splice failed in thread 2splice failed in thread 2: Invalid argumentsplice failed in thread 2: Invalid argumentsplice failed in thread 2: Invalid argumentsplice failed in thread 2 : Invalid argument: Invalid argument: Invalid argument splice failed in thread 2: Invalid argument splice failed in thread 2: Invalid argument splice failed in thread 2: Invalid argument splice failed in thread 2: Invalid argument splice failed in thread 2: Invalid argument splice failed in thread 2: Invalid argument splice failed in thread 2: Invalid argument splice failed in thread 2: Invalid argument test cases/23.t completed FAILED. Completed cases/23.p with 1 -- FAILED. Pass: 18 Fail: 1 Skip: 0 Test run complete at Sun Feb 11 09:45:51 CET 2024 make[1]: *** [Makefile:53: partcheck] Error 1 make[1]: Leaving directory '/tmp/B.j9vx7ghf/BUILD/libaio-0.3.113/harness' make: *** [Makefile:23: partcheck] Error 2 error: Bad exit status from /tmp/B.j9vx7ghf/BUILD/tmp/rpm-tmp.62lK0r (%build) RPM build warnings: Could not canonicalize hostname: nereid RPM build errors: Bad exit status from /tmp/B.j9vx7ghf/BUILD/tmp/rpm-tmp.62lK0r (%build) ended at: Sun Feb 11 09:45:51 2024, done in 0:01:43.241189 error: No files produced. + chmod -R u+rwX /tmp/B.j9vx7ghf/BUILD + rm -rf /tmp/B.j9vx7ghf/tmp /tmp/B.j9vx7ghf/BUILD + rm -rf /tmp/B.j9vx7ghf Begin-PLD-Builder-Info Build-Time: user:8.03s sys:44.00s real:105.41s (faults io:7 non-io:721663) End-PLD-Builder-Info
[Back to list of logs] [View rpm -qa of builder]