FailedOk

th/SRPMS[OK]
th/x32[OK]
th/i686[OK]
th/x86_64[OK]

ac/SRPMS[OK]
ac/i386[OK]
ac/i586[OK]
ac/i686[OK]
ac/alpha[OK]
ac/amd64[OK]
ac/athlon[OK]
ac/ppc[OK]
ac/sparc[OK]
ac/sparc64[OK]

Advanced Search
main()
Powered by PLD Linux
(c) 2002-2024 PLD Team
$Revision: 1.37 $
Powered by /dev/zero.
Your IP: 3.238.235.248

libaio 3af6d9d9-489c-402b-96f7-a66fb823bb89

Status:Failed
Source URL:https://buildlogs.pld-linux.org/pld/th/i686/FAIL/libaio,3af6d9d9-489c-402b-96f7-a66fb823bb89.bz2
text/plain URL:View!
full text:View!
rpm -qa of builder:View!
Date:2024/02/11 09:45:52
Runtime:0:01:43.241189

Toc:

  • error 1
  • Pass: 18 Fail: 1 Skip: 0
  • error 2
  • make[1]: *** [Makefile:53: partcheck] Error 1
  • error 3
  • error: Bad exit status from /tmp/B.j9vx7ghf/BUILD/tmp/rpm-tmp.62lK0r (%build)
  • error 4
  • RPM build errors:
  • error 5
  • error: No files produced.

Content:

Creating 32768 ioctx-s with 2 events each...
Successfully created 32768 io_context-s
Creating 16384 ioctx-s with 4 events each...
Successfully created 16384 io_context-s
Creating 8192 ioctx-s with 8 events each...
Successfully created 8192 io_context-s
Creating 4096 ioctx-s with 16 events each...
Successfully created 4096 io_context-s
Creating 2048 ioctx-s with 32 events each...
Successfully created 2048 io_context-s
Creating 1024 ioctx-s with 64 events each...
Successfully created 1024 io_context-s
Creating 512 ioctx-s with 128 events each...
Successfully created 512 io_context-s
Creating 256 ioctx-s with 256 events each...
Successfully created 256 io_context-s
Creating 128 ioctx-s with 512 events each...
Successfully created 128 io_context-s
Creating 64 ioctx-s with 1024 events each...
Successfully created 64 io_context-s
Creating 32 ioctx-s with 2048 events each...
Successfully created 32 io_context-s
Creating 16 ioctx-s with 4096 events each...
Successfully created 16 io_context-s
Creating 8 ioctx-s with 8192 events each...
Successfully created 8 io_context-s
Creating 4 ioctx-s with 16384 events each...
Successfully created 4 io_context-s
Creating 2 ioctx-s with 32768 events each...
Successfully created 2 io_context-s
Creating 1 ioctx-s with 65536 events each...
Successfully created 1 io_context-s
test cases/20.t completed PASSED.
Completed cases/20.p with 0.
Starting cases/21.p
test cases/21.t completed PASSED.
Completed cases/21.p with 0.
Starting cases/22.p
test cases/22.t completed PASSED.
Completed cases/22.p with 0.
Starting cases/23.p
splice failed in thread 2: Invalid argument
splice failed in thread 2: Invalid argument
splice failed in thread 2splice failed in thread 2: Invalid argument
: Invalid argument
splice failed in thread 2: Invalid argumentsplice failed in thread 2
: Invalid argument
splice failed in thread 2: Invalid argument
splice failed in thread 2: Invalid argument
splice failed in thread 2: Invalid argument
splice failed in thread 2: Invalid argument
splice failed in thread 2: Invalid argument
splice failed in thread 2: Invalid argument
splice failed in thread 2: Invalid argument
splice failed in thread 2: Invalid argument
splice failed in thread 2: Invalid argument
splice failed in thread 2: Invalid argument
splice failed in thread 2splice failed in thread 2: Invalid argument: Invalid argument

splice failed in thread 2: Invalid argument
splice failed in thread 2: Invalid argument
splice failed in thread 2splice failed in thread 2splice failed in thread 2: Invalid argument: Invalid argument

: Invalid argumentsplice failed in thread 2
: Invalid argument
splice failed in thread 2: Invalid argument
splice failed in thread 2: Invalid argument
splice failed in thread 2: Invalid argument
splice failed in thread 2splice failed in thread 2: Invalid argument
: Invalid argument
splice failed in thread 2: Invalid argument
splice failed in thread 2: Invalid argument
splice failed in thread 2: Invalid argument
splice failed in thread 2splice failed in thread 2: Invalid argument
: Invalid argument
splice failed in thread 2: Invalid argument
splice failed in thread 2: Invalid argument
splice failed in thread 2: Invalid argument
splice failed in thread 2: Invalid argument
splice failed in thread 2: Invalid argument
splice failed in thread 2: Invalid argument
splice failed in thread 2: Invalid argument
splice failed in thread 2: Invalid argument
splice failed in thread 2splice failed in thread 2splice failed in thread 2: Invalid argumentsplice failed in thread 2: Invalid argumentsplice failed in thread 2: Invalid argumentsplice failed in thread 2


: Invalid argument: Invalid argument: Invalid argument


splice failed in thread 2: Invalid argument
splice failed in thread 2: Invalid argument
splice failed in thread 2: Invalid argument
splice failed in thread 2: Invalid argument
splice failed in thread 2: Invalid argument
splice failed in thread 2: Invalid argument
splice failed in thread 2: Invalid argument
splice failed in thread 2: Invalid argument
test cases/23.t completed FAILED.
Completed cases/23.p with 1 -- FAILED.
Pass: 18  Fail: 1  Skip: 0
Test run complete at Sun Feb 11 09:45:51 CET 2024
make[1]: *** [Makefile:53: partcheck] Error 1
make[1]: Leaving directory '/tmp/B.j9vx7ghf/BUILD/libaio-0.3.113/harness'
make: *** [Makefile:23: partcheck] Error 2
error: Bad exit status from /tmp/B.j9vx7ghf/BUILD/tmp/rpm-tmp.62lK0r (%build)

RPM build warnings:
    Could not canonicalize hostname: nereid

RPM build errors:
    Bad exit status from /tmp/B.j9vx7ghf/BUILD/tmp/rpm-tmp.62lK0r (%build)
ended at: Sun Feb 11 09:45:51 2024, done in 0:01:43.241189
error: No files produced.
+ chmod -R u+rwX /tmp/B.j9vx7ghf/BUILD
+ rm -rf /tmp/B.j9vx7ghf/tmp /tmp/B.j9vx7ghf/BUILD
+ rm -rf /tmp/B.j9vx7ghf
Begin-PLD-Builder-Info
Build-Time: user:8.03s sys:44.00s real:105.41s (faults io:7 non-io:721663)

End-PLD-Builder-Info
[Back to list of logs] [View rpm -qa of builder]