FailedOk

th/SRPMS[OK]
th/x32[OK]
th/i686[OK]
th/x86_64[OK]

ac/SRPMS[OK]
ac/i386[OK]
ac/i586[OK]
ac/i686[OK]
ac/alpha[OK]
ac/amd64[OK]
ac/athlon[OK]
ac/ppc[OK]
ac/sparc[OK]
ac/sparc64[OK]

Advanced Search
main()
Powered by PLD Linux
(c) 2002-2022 PLD Team
$Revision: 1.37 $
Powered by Leppe'.
Your IP: 3.238.176.43

libaio 59e11da2-0fe2-453e-b3bf-254513f8e5f7

Status:Failed
Source URL:https://buildlogs.pld-linux.org/pld/th/i686/FAIL/libaio,59e11da2-0fe2-453e-b3bf-254513f8e5f7.bz2
text/plain URL:View!
full text:View!
rpm -qa of builder:View!
Date:2022/05/08 21:57:34
Runtime:0:01:08.664889

Toc:

  • error 1
  • Pass: 18 Fail: 1 Skip: 0
  • error 2
  • make[1]: *** [Makefile:53: partcheck] Error 1
  • error 3
  • error: Bad exit status from /tmp/B.q0t9alqr/BUILD/tmp/rpm-tmp.FyFroa (%build)
  • error 4
  • RPM build errors:
  • error 5
  • error: No files produced.

Content:

Submitted: 126
Submitting: 2
Submitted too much, that's okay
Completed: 126
Submitting: 2
Submitted: 2
Completed: 2
Verifying...
OK
MAX_IOS: 508, USER_GETEVENTS
Submitting: 508
Submitted: 126
Submitting: 382
Submitted too much, that's okay
Completed: 126
Submitting: 382
Submitted: 126
Submitting: 256
Submitted too much, that's okay
Completed: 126
Submitting: 256
Submitted: 126
Submitting: 130
Submitted too much, that's okay
Completed: 126
Submitting: 130
Submitted: 126
Submitting: 4
Submitted too much, that's okay
Completed: 126
Submitting: 4
Submitted: 4
Completed: 4
Verifying...
OK
test cases/17.t completed PASSED.
Completed cases/17.p with 0.
Starting cases/18.p
test cases/18.t completed PASSED.
Completed cases/18.p with 0.
Starting cases/19.p
test cases/19.t completed PASSED.
Completed cases/19.p with 0.
Starting cases/20.p
aio_max_nr: 65536
Creating 65536 ioctx-s with 1 events each...
Successfully created 65509 io_context-s
Last io_setup call returned -12 (Cannot allocate memory)
Creating 32768 ioctx-s with 2 events each...
Successfully created 32768 io_context-s
Creating 16384 ioctx-s with 4 events each...
Successfully created 16384 io_context-s
Creating 8192 ioctx-s with 8 events each...
Successfully created 8192 io_context-s
Creating 4096 ioctx-s with 16 events each...
Successfully created 4096 io_context-s
Creating 2048 ioctx-s with 32 events each...
Successfully created 2048 io_context-s
Creating 1024 ioctx-s with 64 events each...
Successfully created 1024 io_context-s
Creating 512 ioctx-s with 128 events each...
Successfully created 512 io_context-s
Creating 256 ioctx-s with 256 events each...
Successfully created 256 io_context-s
Creating 128 ioctx-s with 512 events each...
Successfully created 128 io_context-s
Creating 64 ioctx-s with 1024 events each...
Successfully created 64 io_context-s
Creating 32 ioctx-s with 2048 events each...
Successfully created 32 io_context-s
Creating 16 ioctx-s with 4096 events each...
Successfully created 16 io_context-s
Creating 8 ioctx-s with 8192 events each...
Successfully created 8 io_context-s
Creating 4 ioctx-s with 16384 events each...
Successfully created 4 io_context-s
Creating 2 ioctx-s with 32768 events each...
Successfully created 2 io_context-s
Creating 1 ioctx-s with 65536 events each...
Successfully created 1 io_context-s
test cases/20.t completed PASSED.
Completed cases/20.p with 0.
Starting cases/21.p
test cases/21.t completed PASSED.
Completed cases/21.p with 0.
Starting cases/22.p
test cases/22.t completed PASSED.
Completed cases/22.p with 0.
Starting cases/23.p
splice failed in thread 2: Invalid argument
splice failed in thread 2: Invalid argument
splice failed in thread 2: Invalid argument
splice failed in thread 2: Invalid argument
splice failed in thread 2: Invalid argument
splice failed in thread 2splice failed in thread 2: Invalid argument
: Invalid argument
splice failed in thread 2: Invalid argument
test cases/23.t completed FAILED.
Completed cases/23.p with 1 -- FAILED.
Pass: 18  Fail: 1  Skip: 0
Test run complete at Sun May 8 21:57:34 CEST 2022
make[1]: *** [Makefile:53: partcheck] Error 1
make[1]: Leaving directory '/tmp/B.q0t9alqr/BUILD/libaio-0.3.113/harness'
make: *** [Makefile:23: partcheck] Error 2
error: Bad exit status from /tmp/B.q0t9alqr/BUILD/tmp/rpm-tmp.FyFroa (%build)


RPM build errors:
    Could not canonicalize hostname: nereid
    Bad exit status from /tmp/B.q0t9alqr/BUILD/tmp/rpm-tmp.FyFroa (%build)
ended at: Sun May  8 21:57:34 2022, done in 0:01:08.664889
error: No files produced.
+ chmod -R u+rwX /tmp/B.q0t9alqr/BUILD
+ rm -rf /tmp/B.q0t9alqr/tmp /tmp/B.q0t9alqr/BUILD
+ rm -rf /tmp/B.q0t9alqr
Begin-PLD-Builder-Info
Build-Time: user:7.36s sys:27.47s real:70.60s (faults io:54 non-io:744720)

End-PLD-Builder-Info
[Back to list of logs] [View rpm -qa of builder]