FailedOk

th/SRPMS[OK]
th/x32[OK]
th/i686[OK]
th/x86_64[OK]

ac/SRPMS[OK]
ac/i386[OK]
ac/i586[OK]
ac/i686[OK]
ac/alpha[OK]
ac/amd64[OK]
ac/athlon[OK]
ac/ppc[OK]
ac/sparc[OK]
ac/sparc64[OK]

Advanced Search
main()
Powered by PLD Linux
(c) 2002-2021 PLD Team
$Revision: 1.37 $
Powered by coffee.
Your IP: 3.238.95.208

lin_tape 89d89b03-601d-4745-9724-99a569140bb4

Status:Failed
Source URL:https://buildlogs.pld-linux.org/pld/th/i686/FAIL/lin_tape,89d89b03-601d-4745-9724-99a569140bb4.bz2
text/plain URL:View!
full text:View!
rpm -qa of builder:View!
Date:2021/09/11 19:34:05
Runtime:0:00:27.624831

Toc:

  • error 1
  • /tmp/B.ifnh6_81/BUILD/lin_tape-3.0.57/lin_tape_scsi_tape.c:4668:29: error: implicit declaration of function 'status_byte'; did you mean 'get_status_byte'? [-Werror=implicit-function-declaration]
  • error 2
  • /tmp/B.ifnh6_81/BUILD/lin_tape-3.0.57/lin_tape_scsi_tape.c:4669:30: error: implicit declaration of function 'msg_byte'; did you mean 'host_byte'? [-Werror=implicit-function-declaration]
  • error 3
  • /tmp/B.ifnh6_81/BUILD/lin_tape-3.0.57/lin_tape_scsi_tape.c:4671:29: error: implicit declaration of function 'driver_byte' [-Werror=implicit-function-declaration]
  • error 4
  • /tmp/B.ifnh6_81/BUILD/lin_tape-3.0.57/lin_tape_scsi_tape.c:8879:43: error: 'DRIVER_SENSE' undeclared (first use in this function)
  • error 5
  • /tmp/B.ifnh6_81/BUILD/lin_tape-3.0.57/lin_tape_scsi_tape.c:9019:50: error: 'DRIVER_SENSE' undeclared (first use in this function)
  • error 6
  • make[1]: *** [scripts/Makefile.build:271: /tmp/B.ifnh6_81/BUILD/lin_tape-3.0.57/lin_tape_scsi_tape.o] Error 1
  • error 7
  • /tmp/B.ifnh6_81/BUILD/lin_tape-3.0.57/lin_tape_ioctl_changer.c:2281:13: error: implicit declaration of function 'driver_byte' [-Werror=implicit-function-declaration]
  • error 8
  • /tmp/B.ifnh6_81/BUILD/lin_tape-3.0.57/lin_tape_ioctl_changer.c:2281:36: error: 'DRIVER_SENSE' undeclared (first use in this function)
  • error 9
  • /tmp/B.ifnh6_81/BUILD/lin_tape-3.0.57/lin_tape_ioctl_changer.c:2292:25: error: implicit declaration of function 'msg_byte'; did you mean 'host_byte'? [-Werror=implicit-function-declaration]
  • error 10
  • /tmp/B.ifnh6_81/BUILD/lin_tape-3.0.57/lin_tape_ioctl_changer.c:2292:44: error: implicit declaration of function 'status_byte'; did you mean 'get_status_byte'? [-Werror=implicit-function-declaration]
  • error 11
  • /tmp/B.ifnh6_81/BUILD/lin_tape-3.0.57/lin_tape_ioctl_changer.c:2297:44: error: 'DRIVER_TIMEOUT' undeclared (first use in this function); did you mean 'DID_TIME_OUT'?
  • error 12
  • /tmp/B.ifnh6_81/BUILD/lin_tape-3.0.57/lin_tape_ioctl_changer.c:2298:36: error: 'DRIVER_ERROR' undeclared (first use in this function); did you mean 'DID_ERROR'?
  • error 13
  • /tmp/B.ifnh6_81/BUILD/lin_tape-3.0.57/lin_tape_ioctl_changer.c:2515:33: error: 'DRIVER_ERROR' undeclared (first use in this function); did you mean 'DID_ERROR'?
  • error 14
  • /tmp/B.ifnh6_81/BUILD/lin_tape-3.0.57/lin_tape_ioctl_changer.c:2746:35: error: 'DRIVER_SENSE' undeclared (first use in this function)
  • error 15
  • /tmp/B.ifnh6_81/BUILD/lin_tape-3.0.57/lin_tape_ioctl_changer.c:2757:43: error: 'RESERVATION_CONFLICT' undeclared (first use in this function); did you mean 'SAM_STAT_RESERVATION_CONFLICT'?
  • error 16
  • /tmp/B.ifnh6_81/BUILD/lin_tape-3.0.57/lin_tape_ioctl_changer.c:2764:51: error: 'DRIVER_TIMEOUT' undeclared (first use in this function); did you mean 'DID_TIME_OUT'?
  • error 17
  • /tmp/B.ifnh6_81/BUILD/lin_tape-3.0.57/lin_tape_ioctl_changer.c:2765:39: error: 'DRIVER_ERROR' undeclared (first use in this function); did you mean 'DID_ERROR'?
  • error 18
  • /tmp/B.ifnh6_81/BUILD/lin_tape-3.0.57/lin_tape_ioctl_changer.c:2796:35: error: 'DRIVER_SENSE' undeclared (first use in this function)
  • error 19
  • /tmp/B.ifnh6_81/BUILD/lin_tape-3.0.57/lin_tape_ioctl_changer.c:3292:25: error: 'DRIVER_SENSE' undeclared (first use in this function)
  • error 20
  • /tmp/B.ifnh6_81/BUILD/lin_tape-3.0.57/lin_tape_ioctl_changer.c:3315:36: error: 'RESERVATION_CONFLICT' undeclared (first use in this function); did you mean 'SAM_STAT_RESERVATION_CONFLICT'?
  • error 21
  • make[1]: *** [scripts/Makefile.build:271: /tmp/B.ifnh6_81/BUILD/lin_tape-3.0.57/lin_tape_ioctl_changer.o] Error 1
  • error 22
  • /tmp/B.ifnh6_81/BUILD/lin_tape-3.0.57/upper.c:128:32: error: 'DRIVER_ERROR' undeclared (first use in this function); did you mean 'DID_ERROR'?
  • error 23
  • /tmp/B.ifnh6_81/BUILD/lin_tape-3.0.57/upper.c:317:27: error: implicit declaration of function 'msg_byte'; did you mean 'host_byte'? [-Werror=implicit-function-declaration]
  • error 24
  • make[1]: *** [scripts/Makefile.build:271: /tmp/B.ifnh6_81/BUILD/lin_tape-3.0.57/upper.o] Error 1
  • error 25
  • /tmp/B.ifnh6_81/BUILD/lin_tape-3.0.57/lower.c:96:25: error: implicit declaration of function 'driver_byte' [-Werror=implicit-function-declaration]
  • error 26
  • /tmp/B.ifnh6_81/BUILD/lin_tape-3.0.57/lower.c:97:30: error: 'DRIVER_ERROR' undeclared (first use in this function); did you mean 'DID_ERROR'?
  • error 27
  • /tmp/B.ifnh6_81/BUILD/lin_tape-3.0.57/lower.c:126:30: error: 'DRIVER_TIMEOUT' undeclared (first use in this function); did you mean 'DID_TIME_OUT'?
  • error 28
  • /tmp/B.ifnh6_81/BUILD/lin_tape-3.0.57/lower.c:439:24: error: 'DRIVER_ERROR' undeclared (first use in this function); did you mean 'DID_ERROR'?
  • error 29
  • make[1]: *** [scripts/Makefile.build:271: /tmp/B.ifnh6_81/BUILD/lin_tape-3.0.57/lower.o] Error 1
  • error 30
  • /tmp/B.ifnh6_81/BUILD/lin_tape-3.0.57/lin_tape_ioctl_tape.c:6065:29: error: implicit declaration of function 'status_byte'; did you mean 'get_status_byte'? [-Werror=implicit-function-declaration]
  • error 31
  • /tmp/B.ifnh6_81/BUILD/lin_tape-3.0.57/lin_tape_ioctl_tape.c:6066:72: error: 'BUSY' undeclared (first use in this function); did you mean 'EBUSY'?
  • error 32
  • /tmp/B.ifnh6_81/BUILD/lin_tape-3.0.57/lin_tape_ioctl_tape.c:6452:56: error: 'REQ_OP_SCSI_OUT' undeclared (first use in this function); did you mean 'REQ_OP_DRV_OUT'?
  • error 33
  • /tmp/B.ifnh6_81/BUILD/lin_tape-3.0.57/lin_tape_ioctl_tape.c:6452:74: error: 'REQ_OP_SCSI_IN' undeclared (first use in this function); did you mean 'REQ_OP_DRV_IN'?
  • error 34
  • /tmp/B.ifnh6_81/BUILD/lin_tape-3.0.57/lin_tape_ioctl_tape.c:6460:32: error: 'DRIVER_ERROR' undeclared (first use in this function); did you mean 'DID_ERROR'?
  • error 35
  • /tmp/B.ifnh6_81/BUILD/lin_tape-3.0.57/lin_tape_ioctl_tape.c:6736:37: error: implicit declaration of function 'driver_byte' [-Werror=implicit-function-declaration]
  • error 36
  • /tmp/B.ifnh6_81/BUILD/lin_tape-3.0.57/lin_tape_ioctl_tape.c:6737:44: error: implicit declaration of function 'msg_byte'; did you mean 'host_byte'? [-Werror=implicit-function-declaration]
  • error 37
  • /tmp/B.ifnh6_81/BUILD/lin_tape-3.0.57/lin_tape_ioctl_tape.c:6741:44: error: 'DRIVER_SENSE' undeclared (first use in this function)
  • error 38
  • /tmp/B.ifnh6_81/BUILD/lin_tape-3.0.57/lin_tape_ioctl_tape.c:6743:45: error: 'CHECK_CONDITION' undeclared (first use in this function)
  • error 39
  • /tmp/B.ifnh6_81/BUILD/lin_tape-3.0.57/lin_tape_ioctl_tape.c:6802:43: error: 'DRIVER_SENSE' undeclared (first use in this function)
  • error 40
  • /tmp/B.ifnh6_81/BUILD/lin_tape-3.0.57/lin_tape_ioctl_tape.c:6977:43: error: 'RESERVATION_CONFLICT' undeclared (first use in this function); did you mean 'SAM_STAT_RESERVATION_CONFLICT'?
  • error 41
  • /tmp/B.ifnh6_81/BUILD/lin_tape-3.0.57/lin_tape_ioctl_tape.c:6993:43: error: 'DRIVER_TIMEOUT' undeclared (first use in this function); did you mean 'DID_TIME_OUT'?
  • error 42
  • /tmp/B.ifnh6_81/BUILD/lin_tape-3.0.57/lin_tape_ioctl_tape.c:6995:43: error: 'DRIVER_ERROR' undeclared (first use in this function); did you mean 'DID_ERROR'?
  • error 43
  • /tmp/B.ifnh6_81/BUILD/lin_tape-3.0.57/lin_tape_ioctl_tape.c:9883:32: error: 'DRIVER_SENSE' undeclared (first use in this function)
  • error 44
  • /tmp/B.ifnh6_81/BUILD/lin_tape-3.0.57/lin_tape_ioctl_tape.c:9896:36: error: 'RESERVATION_CONFLICT' undeclared (first use in this function); did you mean 'SAM_STAT_RESERVATION_CONFLICT'?
  • error 45
  • make[1]: *** [scripts/Makefile.build:271: /tmp/B.ifnh6_81/BUILD/lin_tape-3.0.57/lin_tape_ioctl_tape.o] Error 1
  • error 46
  • error: Bad exit status from /tmp/B.ifnh6_81/BUILD/tmp/rpm-tmp.NiDyN5 (%build)
  • error 47
  • RPM build errors:
  • error 48
  • error: No files produced.

Content:

+ ln -sf /usr/src/linux-4.14/scripts o/scripts
+ /usr/bin/make -Otarget -j9 -C /usr/src/linux-4.14 clean 'RCS_FIND_IGNORE=-name '\''*.[ks]o'\'' -o' 'M=/tmp/B.ifnh6_81/BUILD/lin_tape-3.0.57' 'HOSTCC=i686-pld-linux-gcc' 'SYSSRC=/usr/src/linux-4.14' 'SYSOUT=/tmp/B.ifnh6_81/BUILD/lin_tape-3.0.57/o' 'ARCH=i386'
+ CC=i686-pld-linux-gcc 
+ /usr/bin/make -Otarget -j9 -C /usr/src/linux-4.14 modules 'M=/tmp/B.ifnh6_81/BUILD/lin_tape-3.0.57' 'CONSTIFY_PLUGIN=' 'HOSTCC=i686-pld-linux-gcc' 'SYSSRC=/usr/src/linux-4.14' 'SYSOUT=/tmp/B.ifnh6_81/BUILD/lin_tape-3.0.57/o' 'ARCH=i386'
  CC [M]  /tmp/B.ifnh6_81/BUILD/lin_tape-3.0.57/fo_util.o
  CC [M]  /tmp/B.ifnh6_81/BUILD/lin_tape-3.0.57/lin_tape_scsi_trace.o
  CC [M]  /tmp/B.ifnh6_81/BUILD/lin_tape-3.0.57/join.o
  CC [M]  /tmp/B.ifnh6_81/BUILD/lin_tape-3.0.57/lin_tape_extra_ioctl.o
  CC [M]  /tmp/B.ifnh6_81/BUILD/lin_tape-3.0.57/lower.o
  CC [M]  /tmp/B.ifnh6_81/BUILD/lin_tape-3.0.57/resolve_ibm_hp.o
  CC [M]  /tmp/B.ifnh6_81/BUILD/lin_tape-3.0.57/lin_tape_ioctl_changer.o
  CC [M]  /tmp/B.ifnh6_81/BUILD/lin_tape-3.0.57/upper.o
  CC [M]  /tmp/B.ifnh6_81/BUILD/lin_tape-3.0.57/trace.o
  CC [M]  /tmp/B.ifnh6_81/BUILD/lin_tape-3.0.57/intercept.o
  LD [M]  /tmp/B.ifnh6_81/BUILD/lin_tape-3.0.57/pfo.o
  CC [M]  /tmp/B.ifnh6_81/BUILD/lin_tape-3.0.57/lin_tape_scsi_config.o
  CC [M]  /tmp/B.ifnh6_81/BUILD/lin_tape-3.0.57/lin_tape_scsi_tape.o
  CC [M]  /tmp/B.ifnh6_81/BUILD/lin_tape-3.0.57/lin_tape_ioctl_tape.o
  LD [M]  /tmp/B.ifnh6_81/BUILD/lin_tape-3.0.57/lin_tape.o
make: Entering directory '/usr/src/linux-4.14-4.14.246'
  Building modules, stage 2.
make: Leaving directory '/usr/src/linux-4.14-4.14.246'
  MODPOST 2 modules
  CC      /tmp/B.ifnh6_81/BUILD/lin_tape-3.0.57/pfo.mod.o
  CC      /tmp/B.ifnh6_81/BUILD/lin_tape-3.0.57/lin_tape.mod.o
  LD [M]  /tmp/B.ifnh6_81/BUILD/lin_tape-3.0.57/pfo.ko
  LD [M]  /tmp/B.ifnh6_81/BUILD/lin_tape-3.0.57/lin_tape.ko
+ CC=i686-pld-linux-gcc 
+ INSTALLROOT=installed 
+ '[' -n installed ']'
+ set +x
+ '[' -r /usr/src/linux-5.10/.config ']'
+ rm -rf o
+ install -d o/include/linux o/include/generated o/arch/x86/include o/arch/powerpc/lib
+ ln -sf /usr/src/linux-5.10/.config o/.config
+ ln -sf /usr/src/linux-5.10/Module.symvers o/Module.symvers
+ '[' -f /usr/src/linux-5.10/include/generated/autoconf.h ']'
+ ln -sf /usr/src/linux-5.10/include/generated/autoconf.h o/include/generated/autoconf.h
+ ln -s ../generated/autoconf.h o/include/linux/autoconf.h
+ '[' -d /usr/src/linux-5.10/arch/x86/include/generated ']'
+ ln -s /usr/src/linux-5.10/arch/x86/include/generated o/arch/x86/include
+ set +x
+ install -d o/include/config
+ touch o/include/config/MARKER
+ ln -sf /usr/src/linux-5.10/include/config/auto.conf o/include/config/auto.conf
+ ln -sf /usr/src/linux-5.10/scripts o/scripts
+ /usr/bin/make -Otarget -j9 -C /usr/src/linux-5.10 clean 'RCS_FIND_IGNORE=-name '\''*.[ks]o'\'' -o' 'M=/tmp/B.ifnh6_81/BUILD/lin_tape-3.0.57' 'HOSTCC=i686-pld-linux-gcc' 'SYSSRC=/usr/src/linux-5.10' 'SYSOUT=/tmp/B.ifnh6_81/BUILD/lin_tape-3.0.57/o' 'ARCH=i386'
make: Entering directory '/usr/src/linux-5.10-5.10.62'
  CLEAN   /tmp/B.ifnh6_81/BUILD/lin_tape-3.0.57/Module.symvers
make: Leaving directory '/usr/src/linux-5.10-5.10.62'
+ CC=i686-pld-linux-gcc 
+ /usr/bin/make -Otarget -j9 -C /usr/src/linux-5.10 modules 'M=/tmp/B.ifnh6_81/BUILD/lin_tape-3.0.57' 'CONSTIFY_PLUGIN=' 'HOSTCC=i686-pld-linux-gcc' 'SYSSRC=/usr/src/linux-5.10' 'SYSOUT=/tmp/B.ifnh6_81/BUILD/lin_tape-3.0.57/o' 'ARCH=i386'
  CC [M]  /tmp/B.ifnh6_81/BUILD/lin_tape-3.0.57/lin_tape_scsi_trace.o
  CC [M]  /tmp/B.ifnh6_81/BUILD/lin_tape-3.0.57/fo_util.o
  CC [M]  /tmp/B.ifnh6_81/BUILD/lin_tape-3.0.57/join.o
  CC [M]  /tmp/B.ifnh6_81/BUILD/lin_tape-3.0.57/resolve_ibm_hp.o
  CC [M]  /tmp/B.ifnh6_81/BUILD/lin_tape-3.0.57/lower.o
  CC [M]  /tmp/B.ifnh6_81/BUILD/lin_tape-3.0.57/upper.o
  CC [M]  /tmp/B.ifnh6_81/BUILD/lin_tape-3.0.57/lin_tape_extra_ioctl.o
  CC [M]  /tmp/B.ifnh6_81/BUILD/lin_tape-3.0.57/trace.o
  CC [M]  /tmp/B.ifnh6_81/BUILD/lin_tape-3.0.57/lin_tape_ioctl_changer.o
  CC [M]  /tmp/B.ifnh6_81/BUILD/lin_tape-3.0.57/intercept.o
  LD [M]  /tmp/B.ifnh6_81/BUILD/lin_tape-3.0.57/pfo.o
  CC [M]  /tmp/B.ifnh6_81/BUILD/lin_tape-3.0.57/lin_tape_scsi_config.o
  CC [M]  /tmp/B.ifnh6_81/BUILD/lin_tape-3.0.57/lin_tape_scsi_tape.o
  CC [M]  /tmp/B.ifnh6_81/BUILD/lin_tape-3.0.57/lin_tape_ioctl_tape.o
  LD [M]  /tmp/B.ifnh6_81/BUILD/lin_tape-3.0.57/lin_tape.o
  MODPOST /tmp/B.ifnh6_81/BUILD/lin_tape-3.0.57/Module.symvers
  CC [M]  /tmp/B.ifnh6_81/BUILD/lin_tape-3.0.57/lin_tape.mod.o
  LD [M]  /tmp/B.ifnh6_81/BUILD/lin_tape-3.0.57/lin_tape.ko
  CC [M]  /tmp/B.ifnh6_81/BUILD/lin_tape-3.0.57/pfo.mod.o
  LD [M]  /tmp/B.ifnh6_81/BUILD/lin_tape-3.0.57/pfo.ko
+ CC=i686-pld-linux-gcc 
+ '[' -r /usr/src/linux/.config ']'
+ rm -rf o
+ install -d o/include/linux o/include/generated o/arch/x86/include o/arch/powerpc/lib
+ ln -sf /usr/src/linux/.config o/.config
+ ln -sf /usr/src/linux/Module.symvers o/Module.symvers
+ '[' -f /usr/src/linux/include/generated/autoconf.h ']'
+ ln -sf /usr/src/linux/include/generated/autoconf.h o/include/generated/autoconf.h
+ ln -s ../generated/autoconf.h o/include/linux/autoconf.h
+ '[' -d /usr/src/linux/arch/x86/include/generated ']'
+ ln -s /usr/src/linux/arch/x86/include/generated o/arch/x86/include
+ set +x
+ install -d o/include/config
+ touch o/include/config/MARKER
+ ln -sf /usr/src/linux/include/config/auto.conf o/include/config/auto.conf
+ ln -sf /usr/src/linux/scripts o/scripts
+ /usr/bin/make -Otarget -j9 -C /usr/src/linux clean 'RCS_FIND_IGNORE=-name '\''*.[ks]o'\'' -o' 'M=/tmp/B.ifnh6_81/BUILD/lin_tape-3.0.57' 'HOSTCC=i686-pld-linux-gcc' 'SYSSRC=/usr/src/linux' 'SYSOUT=/tmp/B.ifnh6_81/BUILD/lin_tape-3.0.57/o' 'ARCH=i386'
make: Entering directory '/usr/src/linux-5.14.1'
  CLEAN   /tmp/B.ifnh6_81/BUILD/lin_tape-3.0.57/Module.symvers
make: Leaving directory '/usr/src/linux-5.14.1'
+ CC=i686-pld-linux-gcc 
+ /usr/bin/make -Otarget -j9 -C /usr/src/linux modules 'M=/tmp/B.ifnh6_81/BUILD/lin_tape-3.0.57' 'CONSTIFY_PLUGIN=' 'HOSTCC=i686-pld-linux-gcc' 'SYSSRC=/usr/src/linux' 'SYSOUT=/tmp/B.ifnh6_81/BUILD/lin_tape-3.0.57/o' 'ARCH=i386'
  CC [M]  /tmp/B.ifnh6_81/BUILD/lin_tape-3.0.57/fo_util.o
  CC [M]  /tmp/B.ifnh6_81/BUILD/lin_tape-3.0.57/lin_tape_scsi_trace.o
  CC [M]  /tmp/B.ifnh6_81/BUILD/lin_tape-3.0.57/join.o
  CC [M]  /tmp/B.ifnh6_81/BUILD/lin_tape-3.0.57/lin_tape_scsi_tape.o
/tmp/B.ifnh6_81/BUILD/lin_tape-3.0.57/lin_tape_scsi_tape.c: In function 'lin_tape_tscsi_pass_through':
/tmp/B.ifnh6_81/BUILD/lin_tape-3.0.57/lin_tape_scsi_tape.c:4668:29: error: implicit declaration of function 'status_byte'; did you mean 'get_status_byte'? [-Werror=implicit-function-declaration]
 4668 |         buf->TargetStatus = status_byte(result);
      |                             ^~~~~~~~~~~
      |                             get_status_byte
/tmp/B.ifnh6_81/BUILD/lin_tape-3.0.57/lin_tape_scsi_tape.c:4669:30: error: implicit declaration of function 'msg_byte'; did you mean 'host_byte'? [-Werror=implicit-function-declaration]
 4669 |         buf->MessageStatus = msg_byte(result);
      |                              ^~~~~~~~
      |                              host_byte
/tmp/B.ifnh6_81/BUILD/lin_tape-3.0.57/lin_tape_scsi_tape.c:4671:29: error: implicit declaration of function 'driver_byte' [-Werror=implicit-function-declaration]
 4671 |         buf->DriverStatus = driver_byte(result);
      |                             ^~~~~~~~~~~
/tmp/B.ifnh6_81/BUILD/lin_tape-3.0.57/lin_tape_scsi_tape.c: In function 'lin_tape_send_cmd_drive':
/tmp/B.ifnh6_81/BUILD/lin_tape-3.0.57/lin_tape_scsi_tape.c:8879:43: error: 'DRIVER_SENSE' undeclared (first use in this function)
 8879 |                 if((driver_byte(result) & DRIVER_SENSE) && sense_buffer) {
      |                                           ^~~~~~~~~~~~
/tmp/B.ifnh6_81/BUILD/lin_tape-3.0.57/lin_tape_scsi_tape.c:8879:43: note: each undeclared identifier is reported only once for each function it appears in
/tmp/B.ifnh6_81/BUILD/lin_tape-3.0.57/lin_tape_scsi_tape.c: In function 'lin_tape_send_cmd_changer':
/tmp/B.ifnh6_81/BUILD/lin_tape-3.0.57/lin_tape_scsi_tape.c:9019:50: error: 'DRIVER_SENSE' undeclared (first use in this function)
 9019 |                         memcpy(dev_command->sense, sense_buffer,
      |                                                  ^~~~~~~~~~~~
cc1: some warnings being treated as errors
make[1]: *** [scripts/Makefile.build:271: /tmp/B.ifnh6_81/BUILD/lin_tape-3.0.57/lin_tape_scsi_tape.o] Error 1
make[1]: *** Waiting for unfinished jobs....
  CC [M]  /tmp/B.ifnh6_81/BUILD/lin_tape-3.0.57/lin_tape_ioctl_changer.o
/tmp/B.ifnh6_81/BUILD/lin_tape-3.0.57/lin_tape_ioctl_changer.c: In function 'changer_pass_thru_send_cmd':
/tmp/B.ifnh6_81/BUILD/lin_tape-3.0.57/lin_tape_ioctl_changer.c:2281:13: error: implicit declaration of function 'driver_byte' [-Werror=implicit-function-declaration]
 2281 |         if((driver_byte(*result) & DRIVER_SENSE) && sense_buffer) {
      |             ^~~~~~~~~~~
/tmp/B.ifnh6_81/BUILD/lin_tape-3.0.57/lin_tape_ioctl_changer.c:2281:36: error: 'DRIVER_SENSE' undeclared (first use in this function)
 2281 |         if((driver_byte(*result) & DRIVER_SENSE) && sense_buffer) {
      |                                    ^~~~~~~~~~~~
/tmp/B.ifnh6_81/BUILD/lin_tape-3.0.57/lin_tape_ioctl_changer.c:2281:36: note: each undeclared identifier is reported only once for each function it appears in
/tmp/B.ifnh6_81/BUILD/lin_tape-3.0.57/lin_tape_ioctl_changer.c:2292:25: error: implicit declaration of function 'msg_byte'; did you mean 'host_byte'? [-Werror=implicit-function-declaration]
 2292 |                         msg_byte(*result), status_byte(*result));
      |                         ^~~~~~~~
      |                         host_byte
/tmp/B.ifnh6_81/BUILD/lin_tape-3.0.57/lin_tape_ioctl_changer.c:2292:44: error: implicit declaration of function 'status_byte'; did you mean 'get_status_byte'? [-Werror=implicit-function-declaration]
 2292 |                         msg_byte(*result), status_byte(*result));
      |                                            ^~~~~~~~~~~
      |                                            get_status_byte
/tmp/B.ifnh6_81/BUILD/lin_tape-3.0.57/lin_tape_ioctl_changer.c:2297:44: error: 'DRIVER_TIMEOUT' undeclared (first use in this function); did you mean 'DID_TIME_OUT'?
 2297 |                 || driver_byte(*result) == DRIVER_TIMEOUT
      |                                            ^~~~~~~~~~~~~~
      |                                            DID_TIME_OUT
/tmp/B.ifnh6_81/BUILD/lin_tape-3.0.57/lin_tape_ioctl_changer.c:2298:36: error: 'DRIVER_ERROR' undeclared (first use in this function); did you mean 'DID_ERROR'?
 2298 |         || driver_byte(*result) == DRIVER_ERROR)){
      |                                    ^~~~~~~~~~~~
      |                                    DID_ERROR
/tmp/B.ifnh6_81/BUILD/lin_tape-3.0.57/lin_tape_ioctl_changer.c: In function 'changer_pass_thru_handle_sense':
/tmp/B.ifnh6_81/BUILD/lin_tape-3.0.57/lin_tape_ioctl_changer.c:2515:33: error: 'DRIVER_ERROR' undeclared (first use in this function); did you mean 'DID_ERROR'?
 2515 |         driver_byte(*result) == DRIVER_ERROR )
      |                                 ^~~~~~~~~~~~
      |                                 DID_ERROR
/tmp/B.ifnh6_81/BUILD/lin_tape-3.0.57/lin_tape_ioctl_changer.c: In function 'changer_check_result':
/tmp/B.ifnh6_81/BUILD/lin_tape-3.0.57/lin_tape_ioctl_changer.c:2746:35: error: 'DRIVER_SENSE' undeclared (first use in this function)
 2746 |         if((driver_byte(result) & DRIVER_SENSE)
      |                                   ^~~~~~~~~~~~
/tmp/B.ifnh6_81/BUILD/lin_tape-3.0.57/lin_tape_ioctl_changer.c:2757:43: error: 'RESERVATION_CONFLICT' undeclared (first use in this function); did you mean 'SAM_STAT_RESERVATION_CONFLICT'?
 2757 |                 if(status_byte(result) == RESERVATION_CONFLICT ||
      |                                           ^~~~~~~~~~~~~~~~~~~~
      |                                           SAM_STAT_RESERVATION_CONFLICT
/tmp/B.ifnh6_81/BUILD/lin_tape-3.0.57/lin_tape_ioctl_changer.c:2764:51: error: 'DRIVER_TIMEOUT' undeclared (first use in this function); did you mean 'DID_TIME_OUT'?
 2764 |                         || driver_byte(result) == DRIVER_TIMEOUT
      |                                                   ^~~~~~~~~~~~~~
      |                                                   DID_TIME_OUT
/tmp/B.ifnh6_81/BUILD/lin_tape-3.0.57/lin_tape_ioctl_changer.c:2765:39: error: 'DRIVER_ERROR' undeclared (first use in this function); did you mean 'DID_ERROR'?
 2765 |             || driver_byte(result) == DRIVER_ERROR));
      |                                       ^~~~~~~~~~~~
      |                                       DID_ERROR
/tmp/B.ifnh6_81/BUILD/lin_tape-3.0.57/lin_tape_ioctl_changer.c: In function 'changer_log_cdb_and_status':
/tmp/B.ifnh6_81/BUILD/lin_tape-3.0.57/lin_tape_ioctl_changer.c:2796:35: error: 'DRIVER_SENSE' undeclared (first use in this function)
 2796 |         if((driver_byte(result) & DRIVER_SENSE) && sense_buffer) {
      |                                   ^~~~~~~~~~~~
/tmp/B.ifnh6_81/BUILD/lin_tape-3.0.57/lin_tape_ioctl_changer.c: In function 'changer_exe_scsi_cmd':
/tmp/B.ifnh6_81/BUILD/lin_tape-3.0.57/lin_tape_ioctl_changer.c:3292:25: error: 'DRIVER_SENSE' undeclared (first use in this function)
 3292 |                         DRIVER_SENSE) && sense_buffer) {
      |                         ^~~~~~~~~~~~
/tmp/B.ifnh6_81/BUILD/lin_tape-3.0.57/lin_tape_ioctl_changer.c:3315:36: error: 'RESERVATION_CONFLICT' undeclared (first use in this function); did you mean 'SAM_STAT_RESERVATION_CONFLICT'?
 3315 |                 status_byte(rc) != RESERVATION_CONFLICT)
      |                                    ^~~~~~~~~~~~~~~~~~~~
      |                                    SAM_STAT_RESERVATION_CONFLICT
cc1: some warnings being treated as errors
make[1]: *** [scripts/Makefile.build:271: /tmp/B.ifnh6_81/BUILD/lin_tape-3.0.57/lin_tape_ioctl_changer.o] Error 1
  CC [M]  /tmp/B.ifnh6_81/BUILD/lin_tape-3.0.57/upper.o
/tmp/B.ifnh6_81/BUILD/lin_tape-3.0.57/upper.c: In function 'pfo_scsi_execute_req':
/tmp/B.ifnh6_81/BUILD/lin_tape-3.0.57/upper.c:128:32: error: 'DRIVER_ERROR' undeclared (first use in this function); did you mean 'DID_ERROR'?
  128 |                         return DRIVER_ERROR << 24;
      |                                ^~~~~~~~~~~~
      |                                DID_ERROR
/tmp/B.ifnh6_81/BUILD/lin_tape-3.0.57/upper.c:128:32: note: each undeclared identifier is reported only once for each function it appears in
/tmp/B.ifnh6_81/BUILD/lin_tape-3.0.57/upper.c: In function 'pfo_blk_complete_sghdr_rq':
/tmp/B.ifnh6_81/BUILD/lin_tape-3.0.57/upper.c:317:27: error: implicit declaration of function 'msg_byte'; did you mean 'host_byte'? [-Werror=implicit-function-declaration]
  317 |         hdr->msg_status = msg_byte(pfo_cmd->errors);
      |                           ^~~~~~~~
      |                           host_byte
cc1: some warnings being treated as errors
make[1]: *** [scripts/Makefile.build:271: /tmp/B.ifnh6_81/BUILD/lin_tape-3.0.57/upper.o] Error 1
  CC [M]  /tmp/B.ifnh6_81/BUILD/lin_tape-3.0.57/lower.o
/tmp/B.ifnh6_81/BUILD/lin_tape-3.0.57/lower.c: In function 'translate_error':
/tmp/B.ifnh6_81/BUILD/lin_tape-3.0.57/lower.c:96:25: error: implicit declaration of function 'driver_byte' [-Werror=implicit-function-declaration]
   96 |         driver_status = driver_byte(pfo_cmd->errors);
      |                         ^~~~~~~~~~~
/tmp/B.ifnh6_81/BUILD/lin_tape-3.0.57/lower.c:97:30: error: 'DRIVER_ERROR' undeclared (first use in this function); did you mean 'DID_ERROR'?
   97 |         if (driver_status == DRIVER_ERROR) {
      |                              ^~~~~~~~~~~~
      |                              DID_ERROR
/tmp/B.ifnh6_81/BUILD/lin_tape-3.0.57/lower.c:97:30: note: each undeclared identifier is reported only once for each function it appears in
/tmp/B.ifnh6_81/BUILD/lin_tape-3.0.57/lower.c:126:30: error: 'DRIVER_TIMEOUT' undeclared (first use in this function); did you mean 'DID_TIME_OUT'?
  126 |             driver_status == DRIVER_TIMEOUT) {
      |                              ^~~~~~~~~~~~~~
      |                              DID_TIME_OUT
/tmp/B.ifnh6_81/BUILD/lin_tape-3.0.57/lower.c: In function 'lower_scsi_execute':
/tmp/B.ifnh6_81/BUILD/lin_tape-3.0.57/lower.c:439:24: error: 'DRIVER_ERROR' undeclared (first use in this function); did you mean 'DID_ERROR'?
  439 |                 return DRIVER_ERROR << 24;
      |                        ^~~~~~~~~~~~
      |                        DID_ERROR
cc1: some warnings being treated as errors
make[1]: *** [scripts/Makefile.build:271: /tmp/B.ifnh6_81/BUILD/lin_tape-3.0.57/lower.o] Error 1
  CC [M]  /tmp/B.ifnh6_81/BUILD/lin_tape-3.0.57/resolve_ibm_hp.o
  CC [M]  /tmp/B.ifnh6_81/BUILD/lin_tape-3.0.57/lin_tape_extra_ioctl.o
  CC [M]  /tmp/B.ifnh6_81/BUILD/lin_tape-3.0.57/lin_tape_ioctl_tape.o
/tmp/B.ifnh6_81/BUILD/lin_tape-3.0.57/lin_tape_ioctl_tape.c: In function 'tape_send_scsi_io':
/tmp/B.ifnh6_81/BUILD/lin_tape-3.0.57/lin_tape_ioctl_tape.c:6065:29: error: implicit declaration of function 'status_byte'; did you mean 'get_status_byte'? [-Werror=implicit-function-declaration]
 6065 |                         if( status_byte(status_code) == SAM_STAT_BUSY
      |                             ^~~~~~~~~~~
      |                             get_status_byte
/tmp/B.ifnh6_81/BUILD/lin_tape-3.0.57/lin_tape_ioctl_tape.c:6066:72: error: 'BUSY' undeclared (first use in this function); did you mean 'EBUSY'?
 6066 |                                         || status_byte(status_code) == BUSY){
      |                                                                        ^~~~
      |                                                                        EBUSY
/tmp/B.ifnh6_81/BUILD/lin_tape-3.0.57/lin_tape_ioctl_tape.c:6066:72: note: each undeclared identifier is reported only once for each function it appears in
/tmp/B.ifnh6_81/BUILD/lin_tape-3.0.57/lin_tape_ioctl_tape.c: In function 'lin_tape_blk_rq':
/tmp/B.ifnh6_81/BUILD/lin_tape-3.0.57/lin_tape_ioctl_tape.c:6452:56: error: 'REQ_OP_SCSI_OUT' undeclared (first use in this function); did you mean 'REQ_OP_DRV_OUT'?
 6452 |         req = blk_get_request(sdev->request_queue, rw? REQ_OP_SCSI_OUT : REQ_OP_SCSI_IN, GFP_KERNEL);
      |                                                        ^~~~~~~~~~~~~~~
      |                                                        REQ_OP_DRV_OUT
/tmp/B.ifnh6_81/BUILD/lin_tape-3.0.57/lin_tape_ioctl_tape.c:6452:74: error: 'REQ_OP_SCSI_IN' undeclared (first use in this function); did you mean 'REQ_OP_DRV_IN'?
 6452 |         req = blk_get_request(sdev->request_queue, rw? REQ_OP_SCSI_OUT : REQ_OP_SCSI_IN, GFP_KERNEL);
      |                                                                          ^~~~~~~~~~~~~~
      |                                                                          REQ_OP_DRV_IN
/tmp/B.ifnh6_81/BUILD/lin_tape-3.0.57/lin_tape_ioctl_tape.c:6460:32: error: 'DRIVER_ERROR' undeclared (first use in this function); did you mean 'DID_ERROR'?
 6460 |                 status_code =  DRIVER_ERROR << 24;
      |                                ^~~~~~~~~~~~
      |                                DID_ERROR
/tmp/B.ifnh6_81/BUILD/lin_tape-3.0.57/lin_tape_ioctl_tape.c: In function 'tape_check_result':
/tmp/B.ifnh6_81/BUILD/lin_tape-3.0.57/lin_tape_ioctl_tape.c:6736:37: error: implicit declaration of function 'driver_byte' [-Werror=implicit-function-declaration]
 6736 |                         drv->devid, driver_byte(result),
      |                                     ^~~~~~~~~~~
/tmp/B.ifnh6_81/BUILD/lin_tape-3.0.57/lin_tape_ioctl_tape.c:6737:44: error: implicit declaration of function 'msg_byte'; did you mean 'host_byte'? [-Werror=implicit-function-declaration]
 6737 |                         host_byte(result), msg_byte(result),
      |                                            ^~~~~~~~
      |                                            host_byte
/tmp/B.ifnh6_81/BUILD/lin_tape-3.0.57/lin_tape_ioctl_tape.c:6741:44: error: 'DRIVER_SENSE' undeclared (first use in this function)
 6741 |                     (driver_byte(result) & DRIVER_SENSE
      |                                            ^~~~~~~~~~~~
/tmp/B.ifnh6_81/BUILD/lin_tape-3.0.57/lin_tape_ioctl_tape.c:6743:45: error: 'CHECK_CONDITION' undeclared (first use in this function)
 6743 |                      status_byte(result) == CHECK_CONDITION))
      |                                             ^~~~~~~~~~~~~~~
/tmp/B.ifnh6_81/BUILD/lin_tape-3.0.57/lin_tape_ioctl_tape.c: In function 'tape_check_log_cdb_and_status':
/tmp/B.ifnh6_81/BUILD/lin_tape-3.0.57/lin_tape_ioctl_tape.c:6802:43: error: 'DRIVER_SENSE' undeclared (first use in this function)
 6802 |                 if((driver_byte(result) & DRIVER_SENSE) && sense_buffer) {
      |                                           ^~~~~~~~~~~~
/tmp/B.ifnh6_81/BUILD/lin_tape-3.0.57/lin_tape_ioctl_tape.c: In function 'tape_check_handle_nonsense':
/tmp/B.ifnh6_81/BUILD/lin_tape-3.0.57/lin_tape_ioctl_tape.c:6977:43: error: 'RESERVATION_CONFLICT' undeclared (first use in this function); did you mean 'SAM_STAT_RESERVATION_CONFLICT'?
 6977 |                 || status_byte(result) == RESERVATION_CONFLICT) {
      |                                           ^~~~~~~~~~~~~~~~~~~~
      |                                           SAM_STAT_RESERVATION_CONFLICT
/tmp/B.ifnh6_81/BUILD/lin_tape-3.0.57/lin_tape_ioctl_tape.c:6993:43: error: 'DRIVER_TIMEOUT' undeclared (first use in this function); did you mean 'DID_TIME_OUT'?
 6993 |                 if(driver_byte(result) == DRIVER_TIMEOUT)
      |                                           ^~~~~~~~~~~~~~
      |                                           DID_TIME_OUT
/tmp/B.ifnh6_81/BUILD/lin_tape-3.0.57/lin_tape_ioctl_tape.c:6995:43: error: 'DRIVER_ERROR' undeclared (first use in this function); did you mean 'DID_ERROR'?
 6995 |                 if(driver_byte(result) == DRIVER_ERROR)
      |                                           ^~~~~~~~~~~~
      |                                           DID_ERROR
/tmp/B.ifnh6_81/BUILD/lin_tape-3.0.57/lin_tape_ioctl_tape.c: In function 'tape_exe_scsi_cmd':
/tmp/B.ifnh6_81/BUILD/lin_tape-3.0.57/lin_tape_ioctl_tape.c:9883:32: error: 'DRIVER_SENSE' undeclared (first use in this function)
 9883 |         if(!(driver_byte(rc) & DRIVER_SENSE) || !sense_data) goto CHECK_RC;
      |                                ^~~~~~~~~~~~
/tmp/B.ifnh6_81/BUILD/lin_tape-3.0.57/lin_tape_ioctl_tape.c:9896:36: error: 'RESERVATION_CONFLICT' undeclared (first use in this function); did you mean 'SAM_STAT_RESERVATION_CONFLICT'?
 9896 |                 status_byte(rc) != RESERVATION_CONFLICT &&
      |                                    ^~~~~~~~~~~~~~~~~~~~
      |                                    SAM_STAT_RESERVATION_CONFLICT
cc1: some warnings being treated as errors
make[1]: *** [scripts/Makefile.build:271: /tmp/B.ifnh6_81/BUILD/lin_tape-3.0.57/lin_tape_ioctl_tape.o] Error 1
  CC [M]  /tmp/B.ifnh6_81/BUILD/lin_tape-3.0.57/intercept.o
  CC [M]  /tmp/B.ifnh6_81/BUILD/lin_tape-3.0.57/lin_tape_scsi_config.o
make: *** [Makefile:1851: /tmp/B.ifnh6_81/BUILD/lin_tape-3.0.57] Error 2
error: Bad exit status from /tmp/B.ifnh6_81/BUILD/tmp/rpm-tmp.NiDyN5 (%build)


RPM build errors:
    Could not canonicalize hostname: nereid
    Bad exit status from /tmp/B.ifnh6_81/BUILD/tmp/rpm-tmp.NiDyN5 (%build)
ended at: Sat Sep 11 19:34:04 2021, done in 0:00:27.624831
error: No files produced.
+ chmod -R u+rwX /tmp/B.ifnh6_81/BUILD
+ rm -rf /tmp/B.ifnh6_81/tmp /tmp/B.ifnh6_81/BUILD
+ rm -rf /tmp/B.ifnh6_81
Begin-PLD-Builder-Info
Build-Time: user:75.77s sys:18.56s real:48.47s (faults io:5 non-io:3158281)

End-PLD-Builder-Info
[Back to list of logs] [View rpm -qa of builder]