FailedOk

th/SRPMS[OK]
th/x32[OK]
th/i686[OK]
th/x86_64[OK]

ac/SRPMS[OK]
ac/i386[OK]
ac/i586[OK]
ac/i686[OK]
ac/alpha[OK]
ac/amd64[OK]
ac/athlon[OK]
ac/ppc[OK]
ac/sparc[OK]
ac/sparc64[OK]

Advanced Search
main()
Powered by PLD Linux
(c) 2002-2021 PLD Team
$Revision: 1.37 $
Powered by penguin.
Your IP: 44.192.70.216

lin_tape c8de2c0c-8cad-4ce7-b645-4258ddcc9439

Status:Failed
Source URL:https://buildlogs.pld-linux.org/pld/th/i686/FAIL/lin_tape,c8de2c0c-8cad-4ce7-b645-4258ddcc9439.bz2
text/plain URL:View!
full text:View!
rpm -qa of builder:View!
Date:2021/05/03 03:17:32
Runtime:0:00:50.272883

Toc:

  • error 1
  • /tmp/B.xSoYIe/BUILD/lin_tape-3.0.52/lin_tape_ioctl_tape.c:6564:20: error: passing argument 1 of 'blk_execute_rq' from incompatible pointer type [-Werror=incompatible-pointer-types]
  • error 2
  • /tmp/B.xSoYIe/BUILD/lin_tape-3.0.52/lin_tape_ioctl_tape.c:6564:2: error: too many arguments to function 'blk_execute_rq'
  • error 3
  • make[1]: *** [scripts/Makefile.build:271: /tmp/B.xSoYIe/BUILD/lin_tape-3.0.52/lin_tape_ioctl_tape.o] Error 1
  • error 4
  • /tmp/B.xSoYIe/BUILD/lin_tape-3.0.52/lin_tape_scsi_config.h:64:6: error: expected declaration specifiers or '...' before string constant
  • error 5
  • make[1]: *** [scripts/Makefile.build:271: /tmp/B.xSoYIe/BUILD/lin_tape-3.0.52/lin_tape_scsi_config.o] Error 1
  • error 6
  • /tmp/B.xSoYIe/BUILD/lin_tape-3.0.52/lower.c:544:19: error: passing argument 1 of 'blk_execute_rq' from incompatible pointer type [-Werror=incompatible-pointer-types]
  • error 7
  • /tmp/B.xSoYIe/BUILD/lin_tape-3.0.52/lower.c:544:2: error: too many arguments to function 'blk_execute_rq'
  • error 8
  • make[1]: *** [scripts/Makefile.build:271: /tmp/B.xSoYIe/BUILD/lin_tape-3.0.52/lower.o] Error 1
  • error 9
  • error: Bad exit status from /tmp/B.xSoYIe/BUILD/tmp/rpm-tmp.E5xnaL (%build)
  • error 10
  • RPM build errors:
  • error 11
  • error: No files produced.

Content:

      |    ~~~~~~^~~
/tmp/B.xSoYIe/BUILD/lin_tape-3.0.52/lin_tape_extra_ioctl.c:1911:3: note: here
 1911 |   case '4': /* fall-through for 'U' and '4' */
      |   ^~~~
/tmp/B.xSoYIe/BUILD/lin_tape-3.0.52/lin_tape_extra_ioctl.c:1916:10: warning: this statement may fall through [-Wimplicit-fallthrough=]
 1916 |    *worm = 1;
      |    ~~~~~~^~~
/tmp/B.xSoYIe/BUILD/lin_tape-3.0.52/lin_tape_extra_ioctl.c:1917:3: note: here
 1917 |   case '5': /* fall-through for 'V' and '5' */
      |   ^~~~
/tmp/B.xSoYIe/BUILD/lin_tape-3.0.52/lin_tape_extra_ioctl.c:1922:10: warning: this statement may fall through [-Wimplicit-fallthrough=]
 1922 |    *worm = 1;
      |    ~~~~~~^~~
/tmp/B.xSoYIe/BUILD/lin_tape-3.0.52/lin_tape_extra_ioctl.c:1923:3: note: here
 1923 |   case '6': /* fall-through for 'W' and '6' */
      |   ^~~~
/tmp/B.xSoYIe/BUILD/lin_tape-3.0.52/lin_tape_extra_ioctl.c:1928:10: warning: this statement may fall through [-Wimplicit-fallthrough=]
 1928 |    *worm = 1;
      |    ~~~~~~^~~
/tmp/B.xSoYIe/BUILD/lin_tape-3.0.52/lin_tape_extra_ioctl.c:1929:3: note: here
 1929 |   case '7': /* fall-through for 'X' and '7' */
      |   ^~~~
/tmp/B.xSoYIe/BUILD/lin_tape-3.0.52/lin_tape_extra_ioctl.c:1934:10: warning: this statement may fall through [-Wimplicit-fallthrough=]
 1934 |    *worm = 1;
      |    ~~~~~~^~~
/tmp/B.xSoYIe/BUILD/lin_tape-3.0.52/lin_tape_extra_ioctl.c:1935:3: note: here
 1935 |   case '8': /* fall-through for 'Y' and '8' */
      |   ^~~~
  CC [M]  /tmp/B.xSoYIe/BUILD/lin_tape-3.0.52/lower.o
  CC [M]  /tmp/B.xSoYIe/BUILD/lin_tape-3.0.52/upper.o
/tmp/B.xSoYIe/BUILD/lin_tape-3.0.52/upper.c: In function 'pfo_internal_command':
/tmp/B.xSoYIe/BUILD/lin_tape-3.0.52/upper.c:164:7: warning: this statement may fall through [-Wimplicit-fallthrough=]
  164 |    if (sdev->removable)
      |       ^
/tmp/B.xSoYIe/BUILD/lin_tape-3.0.52/upper.c:166:3: note: here
  166 |   case UNIT_ATTENTION:
      |   ^~~~
/tmp/B.xSoYIe/BUILD/lin_tape-3.0.52/upper.c:167:7: warning: this statement may fall through [-Wimplicit-fallthrough=]
  167 |    if (sdev->removable) {
      |       ^
/tmp/B.xSoYIe/BUILD/lin_tape-3.0.52/upper.c:172:3: note: here
  172 |   default: /* Fall through for non-removable media */
      |   ^~~~~~~
  CC [M]  /tmp/B.xSoYIe/BUILD/lin_tape-3.0.52/lin_tape_ioctl_changer.o
  CC [M]  /tmp/B.xSoYIe/BUILD/lin_tape-3.0.52/trace.o
  CC [M]  /tmp/B.xSoYIe/BUILD/lin_tape-3.0.52/intercept.o
  LD [M]  /tmp/B.xSoYIe/BUILD/lin_tape-3.0.52/pfo.o
  CC [M]  /tmp/B.xSoYIe/BUILD/lin_tape-3.0.52/lin_tape_scsi_config.o
  CC [M]  /tmp/B.xSoYIe/BUILD/lin_tape-3.0.52/lin_tape_scsi_tape.o
  CC [M]  /tmp/B.xSoYIe/BUILD/lin_tape-3.0.52/lin_tape_ioctl_tape.o
/tmp/B.xSoYIe/BUILD/lin_tape-3.0.52/lin_tape_ioctl_tape.c: In function 'tape_set_tod':
/tmp/B.xSoYIe/BUILD/lin_tape-3.0.52/lin_tape_ioctl_tape.c:2841:2: warning: ISO C90 forbids mixed declarations and code [-Wdeclaration-after-statement]
 2841 |  struct timespec64 __now__;
      |  ^~~~~~
/tmp/B.xSoYIe/BUILD/lin_tape-3.0.52/lin_tape_ioctl_tape.c: In function 'erp_tod':
/tmp/B.xSoYIe/BUILD/lin_tape-3.0.52/lin_tape_ioctl_tape.c:8978:2: warning: ISO C90 forbids mixed declarations and code [-Wdeclaration-after-statement]
 8978 |  struct timespec64 __now__;
      |  ^~~~~~
  LD [M]  /tmp/B.xSoYIe/BUILD/lin_tape-3.0.52/lin_tape.o
  MODPOST /tmp/B.xSoYIe/BUILD/lin_tape-3.0.52/Module.symvers
  CC [M]  /tmp/B.xSoYIe/BUILD/lin_tape-3.0.52/lin_tape.mod.o
  LD [M]  /tmp/B.xSoYIe/BUILD/lin_tape-3.0.52/lin_tape.ko
  CC [M]  /tmp/B.xSoYIe/BUILD/lin_tape-3.0.52/pfo.mod.o
  LD [M]  /tmp/B.xSoYIe/BUILD/lin_tape-3.0.52/pfo.ko
+ CC=i686-pld-linux-gcc 
+ '[' -r /usr/src/linux/.config ']'
+ rm -rf o
+ install -d o/include/linux o/include/generated o/arch/x86/include o/arch/powerpc/lib
+ ln -sf /usr/src/linux/.config o/.config
+ ln -sf /usr/src/linux/Module.symvers o/Module.symvers
+ '[' -f /usr/src/linux/include/generated/autoconf.h ']'
+ ln -sf /usr/src/linux/include/generated/autoconf.h o/include/generated/autoconf.h
+ ln -s ../generated/autoconf.h o/include/linux/autoconf.h
+ '[' -d /usr/src/linux/arch/x86/include/generated ']'
+ ln -s /usr/src/linux/arch/x86/include/generated o/arch/x86/include
+ set +x
+ install -d o/include/config
+ touch o/include/config/MARKER
+ ln -sf /usr/src/linux/include/config/auto.conf o/include/config/auto.conf
+ ln -sf /usr/src/linux/scripts o/scripts
+ /usr/bin/make -Otarget -j9 -C /usr/src/linux clean 'RCS_FIND_IGNORE=-name '\''*.[ks]o'\'' -o' 'M=/tmp/B.xSoYIe/BUILD/lin_tape-3.0.52' 'HOSTCC=i686-pld-linux-gcc' 'SYSSRC=/usr/src/linux' 'SYSOUT=/tmp/B.xSoYIe/BUILD/lin_tape-3.0.52/o' 'ARCH=i386'
make: Entering directory '/usr/src/linux-5.12.1'
  CLEAN   /tmp/B.xSoYIe/BUILD/lin_tape-3.0.52/Module.symvers
make: Leaving directory '/usr/src/linux-5.12.1'
+ CC=i686-pld-linux-gcc 
+ /usr/bin/make -Otarget -j9 -C /usr/src/linux modules 'M=/tmp/B.xSoYIe/BUILD/lin_tape-3.0.52' 'CONSTIFY_PLUGIN=' 'HOSTCC=i686-pld-linux-gcc' 'SYSSRC=/usr/src/linux' 'SYSOUT=/tmp/B.xSoYIe/BUILD/lin_tape-3.0.52/o' 'ARCH=i386'
  CC [M]  /tmp/B.xSoYIe/BUILD/lin_tape-3.0.52/fo_util.o
/tmp/B.xSoYIe/BUILD/lin_tape-3.0.52/fo_util.c: In function 'debug':
/tmp/B.xSoYIe/BUILD/lin_tape-3.0.52/fo_util.c:132:2: warning: ISO C90 forbids array 'tmp' whose size cannot be evaluated [-Wvla]
  132 |  char tmp[DEBUG_LINE_SIZE];
      |  ^~~~
  CC [M]  /tmp/B.xSoYIe/BUILD/lin_tape-3.0.52/lin_tape_scsi_trace.o
  CC [M]  /tmp/B.xSoYIe/BUILD/lin_tape-3.0.52/join.o
  CC [M]  /tmp/B.xSoYIe/BUILD/lin_tape-3.0.52/lin_tape_ioctl_tape.o
/tmp/B.xSoYIe/BUILD/lin_tape-3.0.52/lin_tape_ioctl_tape.c: In function 'tape_set_tod':
/tmp/B.xSoYIe/BUILD/lin_tape-3.0.52/lin_tape_ioctl_tape.c:2841:2: warning: ISO C90 forbids mixed declarations and code [-Wdeclaration-after-statement]
 2841 |  struct timespec64 __now__;
      |  ^~~~~~
/tmp/B.xSoYIe/BUILD/lin_tape-3.0.52/lin_tape_ioctl_tape.c: In function 'lin_tape_blk_rq':
/tmp/B.xSoYIe/BUILD/lin_tape-3.0.52/lin_tape_ioctl_tape.c:6564:20: error: passing argument 1 of 'blk_execute_rq' from incompatible pointer type [-Werror=incompatible-pointer-types]
 6564 |  blk_execute_rq(req->q, NULL, req, 1);
      |                 ~~~^~~
      |                    |
      |                    struct request_queue *
In file included from /tmp/B.xSoYIe/BUILD/lin_tape-3.0.52/lin_tape_scsi_ioctl.h:26,
                 from /tmp/B.xSoYIe/BUILD/lin_tape-3.0.52/lin_tape_ioctl_tape.c:22:
./include/linux/blkdev.h:947:28: note: expected 'struct gendisk *' but argument is of type 'struct request_queue *'
  947 | extern void blk_execute_rq(struct gendisk *, struct request *, int);
      |                            ^~~~~~~~~~~~~~~~
/tmp/B.xSoYIe/BUILD/lin_tape-3.0.52/lin_tape_ioctl_tape.c:6564:31: warning: passing argument 3 of 'blk_execute_rq' makes integer from pointer without a cast [-Wint-conversion]
 6564 |  blk_execute_rq(req->q, NULL, req, 1);
      |                               ^~~
      |                               |
      |                               struct request *
In file included from /tmp/B.xSoYIe/BUILD/lin_tape-3.0.52/lin_tape_scsi_ioctl.h:26,
                 from /tmp/B.xSoYIe/BUILD/lin_tape-3.0.52/lin_tape_ioctl_tape.c:22:
./include/linux/blkdev.h:947:64: note: expected 'int' but argument is of type 'struct request *'
  947 | extern void blk_execute_rq(struct gendisk *, struct request *, int);
      |                                                                ^~~
/tmp/B.xSoYIe/BUILD/lin_tape-3.0.52/lin_tape_ioctl_tape.c:6564:2: error: too many arguments to function 'blk_execute_rq'
 6564 |  blk_execute_rq(req->q, NULL, req, 1);
      |  ^~~~~~~~~~~~~~
In file included from /tmp/B.xSoYIe/BUILD/lin_tape-3.0.52/lin_tape_scsi_ioctl.h:26,
                 from /tmp/B.xSoYIe/BUILD/lin_tape-3.0.52/lin_tape_ioctl_tape.c:22:
./include/linux/blkdev.h:947:13: note: declared here
  947 | extern void blk_execute_rq(struct gendisk *, struct request *, int);
      |             ^~~~~~~~~~~~~~
/tmp/B.xSoYIe/BUILD/lin_tape-3.0.52/lin_tape_ioctl_tape.c: In function 'erp_tod':
/tmp/B.xSoYIe/BUILD/lin_tape-3.0.52/lin_tape_ioctl_tape.c:8978:2: warning: ISO C90 forbids mixed declarations and code [-Wdeclaration-after-statement]
 8978 |  struct timespec64 __now__;
      |  ^~~~~~
cc1: some warnings being treated as errors
make[1]: *** [scripts/Makefile.build:271: /tmp/B.xSoYIe/BUILD/lin_tape-3.0.52/lin_tape_ioctl_tape.o] Error 1
make[1]: *** Waiting for unfinished jobs....
  CC [M]  /tmp/B.xSoYIe/BUILD/lin_tape-3.0.52/lin_tape_scsi_config.o
In file included from /tmp/B.xSoYIe/BUILD/lin_tape-3.0.52/lin_tape_scsi_config.c:24:
/tmp/B.xSoYIe/BUILD/lin_tape-3.0.52/lin_tape_scsi_config.h:64:6: error: expected declaration specifiers or '...' before string constant
   64 |     ("IBM Tape Drives and Libraries");
      |      ^~~~~~~~~~~~~~~~~~~~~~~~~~~~~~~
make[1]: *** [scripts/Makefile.build:271: /tmp/B.xSoYIe/BUILD/lin_tape-3.0.52/lin_tape_scsi_config.o] Error 1
  CC [M]  /tmp/B.xSoYIe/BUILD/lin_tape-3.0.52/lower.o
/tmp/B.xSoYIe/BUILD/lin_tape-3.0.52/lower.c: In function 'lower_scsi_execute':
/tmp/B.xSoYIe/BUILD/lin_tape-3.0.52/lower.c:544:19: error: passing argument 1 of 'blk_execute_rq' from incompatible pointer type [-Werror=incompatible-pointer-types]
  544 |  blk_execute_rq(rq->q, NULL, rq, 1);
      |                 ~~^~~
      |                   |
      |                   struct request_queue *
In file included from ./include/scsi/scsi_device.h:8,
                 from /tmp/B.xSoYIe/BUILD/lin_tape-3.0.52/lower.c:38:
./include/linux/blkdev.h:947:28: note: expected 'struct gendisk *' but argument is of type 'struct request_queue *'
  947 | extern void blk_execute_rq(struct gendisk *, struct request *, int);
      |                            ^~~~~~~~~~~~~~~~
/tmp/B.xSoYIe/BUILD/lin_tape-3.0.52/lower.c:544:30: warning: passing argument 3 of 'blk_execute_rq' makes integer from pointer without a cast [-Wint-conversion]
  544 |  blk_execute_rq(rq->q, NULL, rq, 1);
      |                              ^~
      |                              |
      |                              struct request *
In file included from ./include/scsi/scsi_device.h:8,
                 from /tmp/B.xSoYIe/BUILD/lin_tape-3.0.52/lower.c:38:
./include/linux/blkdev.h:947:64: note: expected 'int' but argument is of type 'struct request *'
  947 | extern void blk_execute_rq(struct gendisk *, struct request *, int);
      |                                                                ^~~
/tmp/B.xSoYIe/BUILD/lin_tape-3.0.52/lower.c:544:2: error: too many arguments to function 'blk_execute_rq'
  544 |  blk_execute_rq(rq->q, NULL, rq, 1);
      |  ^~~~~~~~~~~~~~
In file included from ./include/scsi/scsi_device.h:8,
                 from /tmp/B.xSoYIe/BUILD/lin_tape-3.0.52/lower.c:38:
./include/linux/blkdev.h:947:13: note: declared here
  947 | extern void blk_execute_rq(struct gendisk *, struct request *, int);
      |             ^~~~~~~~~~~~~~
cc1: some warnings being treated as errors
make[1]: *** [scripts/Makefile.build:271: /tmp/B.xSoYIe/BUILD/lin_tape-3.0.52/lower.o] Error 1
  CC [M]  /tmp/B.xSoYIe/BUILD/lin_tape-3.0.52/resolve_ibm_hp.o
  CC [M]  /tmp/B.xSoYIe/BUILD/lin_tape-3.0.52/lin_tape_extra_ioctl.o
/tmp/B.xSoYIe/BUILD/lin_tape-3.0.52/lin_tape_extra_ioctl.c: In function 'set_media_type':
/tmp/B.xSoYIe/BUILD/lin_tape-3.0.52/lin_tape_extra_ioctl.c:1904:10: warning: this statement may fall through [-Wimplicit-fallthrough=]
 1904 |    *worm = 1;
      |    ~~~~~~^~~
/tmp/B.xSoYIe/BUILD/lin_tape-3.0.52/lin_tape_extra_ioctl.c:1905:3: note: here
 1905 |   case '3': /* fall-through for 'T' and '3' */
      |   ^~~~
/tmp/B.xSoYIe/BUILD/lin_tape-3.0.52/lin_tape_extra_ioctl.c:1910:10: warning: this statement may fall through [-Wimplicit-fallthrough=]
 1910 |    *worm = 1;
      |    ~~~~~~^~~
/tmp/B.xSoYIe/BUILD/lin_tape-3.0.52/lin_tape_extra_ioctl.c:1911:3: note: here
 1911 |   case '4': /* fall-through for 'U' and '4' */
      |   ^~~~
/tmp/B.xSoYIe/BUILD/lin_tape-3.0.52/lin_tape_extra_ioctl.c:1916:10: warning: this statement may fall through [-Wimplicit-fallthrough=]
 1916 |    *worm = 1;
      |    ~~~~~~^~~
/tmp/B.xSoYIe/BUILD/lin_tape-3.0.52/lin_tape_extra_ioctl.c:1917:3: note: here
 1917 |   case '5': /* fall-through for 'V' and '5' */
      |   ^~~~
/tmp/B.xSoYIe/BUILD/lin_tape-3.0.52/lin_tape_extra_ioctl.c:1922:10: warning: this statement may fall through [-Wimplicit-fallthrough=]
 1922 |    *worm = 1;
      |    ~~~~~~^~~
/tmp/B.xSoYIe/BUILD/lin_tape-3.0.52/lin_tape_extra_ioctl.c:1923:3: note: here
 1923 |   case '6': /* fall-through for 'W' and '6' */
      |   ^~~~
/tmp/B.xSoYIe/BUILD/lin_tape-3.0.52/lin_tape_extra_ioctl.c:1928:10: warning: this statement may fall through [-Wimplicit-fallthrough=]
 1928 |    *worm = 1;
      |    ~~~~~~^~~
/tmp/B.xSoYIe/BUILD/lin_tape-3.0.52/lin_tape_extra_ioctl.c:1929:3: note: here
 1929 |   case '7': /* fall-through for 'X' and '7' */
      |   ^~~~
/tmp/B.xSoYIe/BUILD/lin_tape-3.0.52/lin_tape_extra_ioctl.c:1934:10: warning: this statement may fall through [-Wimplicit-fallthrough=]
 1934 |    *worm = 1;
      |    ~~~~~~^~~
/tmp/B.xSoYIe/BUILD/lin_tape-3.0.52/lin_tape_extra_ioctl.c:1935:3: note: here
 1935 |   case '8': /* fall-through for 'Y' and '8' */
      |   ^~~~
  CC [M]  /tmp/B.xSoYIe/BUILD/lin_tape-3.0.52/upper.o
/tmp/B.xSoYIe/BUILD/lin_tape-3.0.52/upper.c: In function 'pfo_internal_command':
/tmp/B.xSoYIe/BUILD/lin_tape-3.0.52/upper.c:164:7: warning: this statement may fall through [-Wimplicit-fallthrough=]
  164 |    if (sdev->removable)
      |       ^
/tmp/B.xSoYIe/BUILD/lin_tape-3.0.52/upper.c:166:3: note: here
  166 |   case UNIT_ATTENTION:
      |   ^~~~
/tmp/B.xSoYIe/BUILD/lin_tape-3.0.52/upper.c:167:7: warning: this statement may fall through [-Wimplicit-fallthrough=]
  167 |    if (sdev->removable) {
      |       ^
/tmp/B.xSoYIe/BUILD/lin_tape-3.0.52/upper.c:172:3: note: here
  172 |   default: /* Fall through for non-removable media */
      |   ^~~~~~~
  CC [M]  /tmp/B.xSoYIe/BUILD/lin_tape-3.0.52/lin_tape_ioctl_changer.o
  CC [M]  /tmp/B.xSoYIe/BUILD/lin_tape-3.0.52/intercept.o
  CC [M]  /tmp/B.xSoYIe/BUILD/lin_tape-3.0.52/lin_tape_scsi_tape.o
make: *** [Makefile:1851: /tmp/B.xSoYIe/BUILD/lin_tape-3.0.52] Error 2
error: Bad exit status from /tmp/B.xSoYIe/BUILD/tmp/rpm-tmp.E5xnaL (%build)


RPM build errors:
    Could not canonicalize hostname: nereid
    Bad exit status from /tmp/B.xSoYIe/BUILD/tmp/rpm-tmp.E5xnaL (%build)
ended at: Mon May  3 03:17:31 2021, done in 0:00:50.272883
error: No files produced.
+ chmod -R u+rwX /tmp/B.xSoYIe/BUILD
+ rm -rf /tmp/B.xSoYIe/tmp /tmp/B.xSoYIe/BUILD
+ rm -rf /tmp/B.xSoYIe
Begin-PLD-Builder-Info
Build-Time: user:142.23s sys:24.86s real:70.82s (faults io:13 non-io:4535099)

End-PLD-Builder-Info
[Back to list of logs] [View rpm -qa of builder]