FailedOk

th/SRPMS[OK]
th/x32[OK]
th/i686[OK]
th/x86_64[OK]

ac/SRPMS[OK]
ac/i386[OK]
ac/i586[OK]
ac/i686[OK]
ac/alpha[OK]
ac/amd64[OK]
ac/athlon[OK]
ac/ppc[OK]
ac/sparc[OK]
ac/sparc64[OK]

Advanced Search
main()
Powered by PLD Linux
(c) 2002-2022 PLD Team
$Revision: 1.37 $
Powered by ufo.
Your IP: 44.201.96.43

lttng-modules 0135c808-fceb-4ee3-9e13-658f88c661ae

Status:Failed
Source URL:https://buildlogs.pld-linux.org/pld/th/i686/FAIL/lttng-modules,0135c808-fceb-4ee3-9e13-658f88c661ae.bz2
text/plain URL:View!
full text:View!
rpm -qa of builder:View!
Date:2022/06/16 01:10:01
Runtime:0:01:54.252200

Toc:

  • error 1
  • /tmp/B.z0hrnmfk/BUILD/lttng-modules-2.13.3/lttng-modules-2.13.3/src/probes/lttng-probe-random.c:18:10: fatal error: trace/events/random.h: No such file or directory
  • error 2
  • compilation terminated.
  • error 3
  • make[3]: *** [scripts/Makefile.build:288: /tmp/B.z0hrnmfk/BUILD/lttng-modules-2.13.3/lttng-modules-2.13.3/src/probes/lttng-probe-random.o] Error 1
  • error 4
  • make[2]: *** [scripts/Makefile.build:551: /tmp/B.z0hrnmfk/BUILD/lttng-modules-2.13.3/lttng-modules-2.13.3/src/probes] Error 2
  • error 5
  • make[1]: *** [Makefile:1868: /tmp/B.z0hrnmfk/BUILD/lttng-modules-2.13.3/lttng-modules-2.13.3/src] Error 2
  • error 6
  • error: Bad exit status from /tmp/B.z0hrnmfk/BUILD/tmp/rpm-tmp.PnvYAd (%build)
  • error 7
  • RPM build errors:
  • error 8
  • error: No files produced.

Content:

  INSTALL /tmp/B.z0hrnmfk/BUILD/lttng-modules-2.13.3/lttng-modules-2.13.3/src/probes/lttng-probe-workqueue.ko
  INSTALL /tmp/B.z0hrnmfk/BUILD/lttng-modules-2.13.3/lttng-modules-2.13.3/src/probes/lttng-probe-timer.ko
  INSTALL /tmp/B.z0hrnmfk/BUILD/lttng-modules-2.13.3/lttng-modules-2.13.3/src/probes/lttng-probe-v4l2.ko
  INSTALL /tmp/B.z0hrnmfk/BUILD/lttng-modules-2.13.3/lttng-modules-2.13.3/src/probes/lttng-probe-statedump.ko
  INSTALL /tmp/B.z0hrnmfk/BUILD/lttng-modules-2.13.3/lttng-modules-2.13.3/src/probes/lttng-probe-x86-exceptions.ko
  INSTALL /tmp/B.z0hrnmfk/BUILD/lttng-modules-2.13.3/lttng-modules-2.13.3/src/probes/lttng-probe-vmscan.ko
  INSTALL /tmp/B.z0hrnmfk/BUILD/lttng-modules-2.13.3/lttng-modules-2.13.3/src/probes/lttng-uprobes.ko
  INSTALL /tmp/B.z0hrnmfk/BUILD/lttng-modules-2.13.3/lttng-modules-2.13.3/src/tests/lttng-clock-plugin-test.ko
  INSTALL /tmp/B.z0hrnmfk/BUILD/lttng-modules-2.13.3/lttng-modules-2.13.3/src/probes/lttng-probe-x86-irq-vectors.ko
  INSTALL /tmp/B.z0hrnmfk/BUILD/lttng-modules-2.13.3/lttng-modules-2.13.3/src/tests/lttng-test.ko
  INSTALL /tmp/B.z0hrnmfk/BUILD/lttng-modules-2.13.3/lttng-modules-2.13.3/src/probes/lttng-probe-writeback.ko
  INSTALL /tmp/B.z0hrnmfk/BUILD/lttng-modules-2.13.3/lttng-modules-2.13.3/src/lttng-tracer.ko
make[1]: Entering directory '/usr/src/linux-4.9-4.9.318'
  DEPMOD  4.9.318-1
make[1]: Leaving directory '/usr/src/linux-4.9-4.9.318'
+ /usr/bin/make -Otarget -j9 clean 'KERNELDIR=/usr/src/linux-5.15'
/usr/bin/make -C /usr/src/linux-5.15 M=/tmp/B.z0hrnmfk/BUILD/lttng-modules-2.13.3/lttng-modules-2.13.3/src clean
make[1]: Entering directory '/usr/src/linux-5.15-5.15.47'
  CLEAN   /tmp/B.z0hrnmfk/BUILD/lttng-modules-2.13.3/lttng-modules-2.13.3/src/Module.symvers
make[1]: Leaving directory '/usr/src/linux-5.15-5.15.47'
+ /usr/bin/make -Otarget -j9 'KERNELDIR=/usr/src/linux-5.15'
/usr/bin/make -C /usr/src/linux-5.15 M=/tmp/B.z0hrnmfk/BUILD/lttng-modules-2.13.3/lttng-modules-2.13.3/src \
	CONFIG_LTTNG=m CONFIG_LTTNG_CLOCK_PLUGIN_TEST=m \
	KCPPFLAGS='' \
	modules
make[1]: Entering directory '/usr/src/linux-5.15-5.15.47'
warning: the compiler differs from the one used to build the kernel
  The kernel was built by: i686-pld-linux-gcc (PLD-Linux) 11.3.0 20220421 (release)
  You are using:           gcc (PLD-Linux) 11.3.0 20220421 (release)
make[1]: Leaving directory '/usr/src/linux-5.15-5.15.47'
  CC [M]  /tmp/B.z0hrnmfk/BUILD/lttng-modules-2.13.3/lttng-modules-2.13.3/src/lttng-ring-buffer-metadata-mmap-client.o
  CC [M]  /tmp/B.z0hrnmfk/BUILD/lttng-modules-2.13.3/lttng-modules-2.13.3/src/lttng-ring-buffer-metadata-client.o
  CC [M]  /tmp/B.z0hrnmfk/BUILD/lttng-modules-2.13.3/lttng-modules-2.13.3/src/tests/probes/lttng-test.o
  LD [M]  /tmp/B.z0hrnmfk/BUILD/lttng-modules-2.13.3/lttng-modules-2.13.3/src/tests/lttng-test.o
  CC [M]  /tmp/B.z0hrnmfk/BUILD/lttng-modules-2.13.3/lttng-modules-2.13.3/src/lttng-ring-buffer-client-mmap-discard.o
  CC [M]  /tmp/B.z0hrnmfk/BUILD/lttng-modules-2.13.3/lttng-modules-2.13.3/src/lttng-ring-buffer-client-discard.o
  CC [M]  /tmp/B.z0hrnmfk/BUILD/lttng-modules-2.13.3/lttng-modules-2.13.3/src/lttng-ring-buffer-client-overwrite.o
  CC [M]  /tmp/B.z0hrnmfk/BUILD/lttng-modules-2.13.3/lttng-modules-2.13.3/src/lttng-ring-buffer-client-mmap-overwrite.o
  CC [M]  /tmp/B.z0hrnmfk/BUILD/lttng-modules-2.13.3/lttng-modules-2.13.3/src/tests/clock-plugin/lttng-clock-plugin-test.o
  LD [M]  /tmp/B.z0hrnmfk/BUILD/lttng-modules-2.13.3/lttng-modules-2.13.3/src/tests/lttng-clock-plugin-test.o
  CC [M]  /tmp/B.z0hrnmfk/BUILD/lttng-modules-2.13.3/lttng-modules-2.13.3/src/lib/ringbuffer/ring_buffer_backend.o
  CC [M]  /tmp/B.z0hrnmfk/BUILD/lttng-modules-2.13.3/lttng-modules-2.13.3/src/probes/lttng-probe-sched.o
  CC [M]  /tmp/B.z0hrnmfk/BUILD/lttng-modules-2.13.3/lttng-modules-2.13.3/src/lttng-ring-buffer-event-notifier-client.o
  CC [M]  /tmp/B.z0hrnmfk/BUILD/lttng-modules-2.13.3/lttng-modules-2.13.3/src/lttng-counter-client-percpu-32-modular.o
  CC [M]  /tmp/B.z0hrnmfk/BUILD/lttng-modules-2.13.3/lttng-modules-2.13.3/src/lib/prio_heap/lttng_prio_heap.o
  CC [M]  /tmp/B.z0hrnmfk/BUILD/lttng-modules-2.13.3/lttng-modules-2.13.3/src/lib/ringbuffer/ring_buffer_splice.o
  CC [M]  /tmp/B.z0hrnmfk/BUILD/lttng-modules-2.13.3/lttng-modules-2.13.3/src/lib/ringbuffer/ring_buffer_vfs.o
  CC [M]  /tmp/B.z0hrnmfk/BUILD/lttng-modules-2.13.3/lttng-modules-2.13.3/src/lib/ringbuffer/ring_buffer_iterator.o
  CC [M]  /tmp/B.z0hrnmfk/BUILD/lttng-modules-2.13.3/lttng-modules-2.13.3/src/lib/../wrapper/splice.o
  CC [M]  /tmp/B.z0hrnmfk/BUILD/lttng-modules-2.13.3/lttng-modules-2.13.3/src/lib/ringbuffer/ring_buffer_mmap.o
  CC [M]  /tmp/B.z0hrnmfk/BUILD/lttng-modules-2.13.3/lttng-modules-2.13.3/src/lib/ringbuffer/ring_buffer_frontend.o
  CC [M]  /tmp/B.z0hrnmfk/BUILD/lttng-modules-2.13.3/lttng-modules-2.13.3/src/probes/lttng-probe-irq.o
  CC [M]  /tmp/B.z0hrnmfk/BUILD/lttng-modules-2.13.3/lttng-modules-2.13.3/src/lttng-counter-client-percpu-64-modular.o
  CC [M]  /tmp/B.z0hrnmfk/BUILD/lttng-modules-2.13.3/lttng-modules-2.13.3/src/lib/counter/counter.o
  LD [M]  /tmp/B.z0hrnmfk/BUILD/lttng-modules-2.13.3/lttng-modules-2.13.3/src/lib/lttng-lib-ring-buffer.o
  LD [M]  /tmp/B.z0hrnmfk/BUILD/lttng-modules-2.13.3/lttng-modules-2.13.3/src/lib/lttng-counter.o
  CC [M]  /tmp/B.z0hrnmfk/BUILD/lttng-modules-2.13.3/lttng-modules-2.13.3/src/probes/lttng-probe-module.o
  CC [M]  /tmp/B.z0hrnmfk/BUILD/lttng-modules-2.13.3/lttng-modules-2.13.3/src/probes/lttng-probe-timer.o
  CC [M]  /tmp/B.z0hrnmfk/BUILD/lttng-modules-2.13.3/lttng-modules-2.13.3/src/probes/lttng-probe-9p.o
  CC [M]  /tmp/B.z0hrnmfk/BUILD/lttng-modules-2.13.3/lttng-modules-2.13.3/src/probes/lttng-probe-kmem.o
  CC [M]  /tmp/B.z0hrnmfk/BUILD/lttng-modules-2.13.3/lttng-modules-2.13.3/src/probes/lttng-probe-power.o
  CC [M]  /tmp/B.z0hrnmfk/BUILD/lttng-modules-2.13.3/lttng-modules-2.13.3/src/lib/msgpack/msgpack.o
  CC [M]  /tmp/B.z0hrnmfk/BUILD/lttng-modules-2.13.3/lttng-modules-2.13.3/src/probes/lttng-probe-i2c.o
  CC [M]  /tmp/B.z0hrnmfk/BUILD/lttng-modules-2.13.3/lttng-modules-2.13.3/src/lttng-clock.o
  CC [M]  /tmp/B.z0hrnmfk/BUILD/lttng-modules-2.13.3/lttng-modules-2.13.3/src/probes/lttng-probe-x86-exceptions.o
  CC [M]  /tmp/B.z0hrnmfk/BUILD/lttng-modules-2.13.3/lttng-modules-2.13.3/src/lttng-string-utils.o
  CC [M]  /tmp/B.z0hrnmfk/BUILD/lttng-modules-2.13.3/lttng-modules-2.13.3/src/probes/lttng-probe-x86-irq-vectors.o
  CC [M]  /tmp/B.z0hrnmfk/BUILD/lttng-modules-2.13.3/lttng-modules-2.13.3/src/probes/lttng-probe-kvm.o
  CC [M]  /tmp/B.z0hrnmfk/BUILD/lttng-modules-2.13.3/lttng-modules-2.13.3/src/probes/lttng-probe-statedump.o
  CC [M]  /tmp/B.z0hrnmfk/BUILD/lttng-modules-2.13.3/lttng-modules-2.13.3/src/probes/lttng-probe-kvm-x86-mmu.o
  CC [M]  /tmp/B.z0hrnmfk/BUILD/lttng-modules-2.13.3/lttng-modules-2.13.3/src/probes/lttng-probe-signal.o
  CC [M]  /tmp/B.z0hrnmfk/BUILD/lttng-modules-2.13.3/lttng-modules-2.13.3/src/lttng-abi.o
  CC [M]  /tmp/B.z0hrnmfk/BUILD/lttng-modules-2.13.3/lttng-modules-2.13.3/src/lttng-probes.o
  CC [M]  /tmp/B.z0hrnmfk/BUILD/lttng-modules-2.13.3/lttng-modules-2.13.3/src/lttng-context.o
  CC [M]  /tmp/B.z0hrnmfk/BUILD/lttng-modules-2.13.3/lttng-modules-2.13.3/src/lttng-context-pid.o
  CC [M]  /tmp/B.z0hrnmfk/BUILD/lttng-modules-2.13.3/lttng-modules-2.13.3/src/lttng-context-procname.o
  CC [M]  /tmp/B.z0hrnmfk/BUILD/lttng-modules-2.13.3/lttng-modules-2.13.3/src/probes/lttng-probe-kvm-x86.o
  CC [M]  /tmp/B.z0hrnmfk/BUILD/lttng-modules-2.13.3/lttng-modules-2.13.3/src/probes/lttng-probe-napi.o
  CC [M]  /tmp/B.z0hrnmfk/BUILD/lttng-modules-2.13.3/lttng-modules-2.13.3/src/lttng-context-prio.o
  CC [M]  /tmp/B.z0hrnmfk/BUILD/lttng-modules-2.13.3/lttng-modules-2.13.3/src/lttng-events.o
  CC [M]  /tmp/B.z0hrnmfk/BUILD/lttng-modules-2.13.3/lttng-modules-2.13.3/src/probes/lttng-probe-skb.o
  CC [M]  /tmp/B.z0hrnmfk/BUILD/lttng-modules-2.13.3/lttng-modules-2.13.3/src/lttng-context-nice.o
  CC [M]  /tmp/B.z0hrnmfk/BUILD/lttng-modules-2.13.3/lttng-modules-2.13.3/src/lttng-context-vpid.o
  CC [M]  /tmp/B.z0hrnmfk/BUILD/lttng-modules-2.13.3/lttng-modules-2.13.3/src/probes/lttng-probe-block.o
  CC [M]  /tmp/B.z0hrnmfk/BUILD/lttng-modules-2.13.3/lttng-modules-2.13.3/src/probes/lttng-probe-gpio.o
  CC [M]  /tmp/B.z0hrnmfk/BUILD/lttng-modules-2.13.3/lttng-modules-2.13.3/src/probes/lttng-probe-udp.o
  CC [M]  /tmp/B.z0hrnmfk/BUILD/lttng-modules-2.13.3/lttng-modules-2.13.3/src/probes/lttng-probe-sock.o
  CC [M]  /tmp/B.z0hrnmfk/BUILD/lttng-modules-2.13.3/lttng-modules-2.13.3/src/probes/lttng-probe-net.o
  CC [M]  /tmp/B.z0hrnmfk/BUILD/lttng-modules-2.13.3/lttng-modules-2.13.3/src/lttng-context-tid.o
  CC [M]  /tmp/B.z0hrnmfk/BUILD/lttng-modules-2.13.3/lttng-modules-2.13.3/src/lttng-context-vtid.o
  CC [M]  /tmp/B.z0hrnmfk/BUILD/lttng-modules-2.13.3/lttng-modules-2.13.3/src/lttng-context-ppid.o
  CC [M]  /tmp/B.z0hrnmfk/BUILD/lttng-modules-2.13.3/lttng-modules-2.13.3/src/probes/lttng-probe-asoc.o
  CC [M]  /tmp/B.z0hrnmfk/BUILD/lttng-modules-2.13.3/lttng-modules-2.13.3/src/probes/lttng-probe-regulator.o
  CC [M]  /tmp/B.z0hrnmfk/BUILD/lttng-modules-2.13.3/lttng-modules-2.13.3/src/probes/lttng-probe-compaction.o
  CC [M]  /tmp/B.z0hrnmfk/BUILD/lttng-modules-2.13.3/lttng-modules-2.13.3/src/probes/lttng-probe-jbd2.o
  CC [M]  /tmp/B.z0hrnmfk/BUILD/lttng-modules-2.13.3/lttng-modules-2.13.3/src/probes/lttng-probe-scsi.o
  CC [M]  /tmp/B.z0hrnmfk/BUILD/lttng-modules-2.13.3/lttng-modules-2.13.3/src/lttng-context-cpu-id.o
  CC [M]  /tmp/B.z0hrnmfk/BUILD/lttng-modules-2.13.3/lttng-modules-2.13.3/src/lttng-context-vppid.o
  CC [M]  /tmp/B.z0hrnmfk/BUILD/lttng-modules-2.13.3/lttng-modules-2.13.3/src/probes/lttng-probe-random.o
/tmp/B.z0hrnmfk/BUILD/lttng-modules-2.13.3/lttng-modules-2.13.3/src/probes/lttng-probe-random.c:18:10: fatal error: trace/events/random.h: No such file or directory
   18 | #include <trace/events/random.h>
      |          ^~~~~~~~~~~~~~~~~~~~~~~
compilation terminated.
make[3]: *** [scripts/Makefile.build:288: /tmp/B.z0hrnmfk/BUILD/lttng-modules-2.13.3/lttng-modules-2.13.3/src/probes/lttng-probe-random.o] Error 1
make[3]: *** Waiting for unfinished jobs....
  CC [M]  /tmp/B.z0hrnmfk/BUILD/lttng-modules-2.13.3/lttng-modules-2.13.3/src/probes/lttng-probe-printk.o
  CC [M]  /tmp/B.z0hrnmfk/BUILD/lttng-modules-2.13.3/lttng-modules-2.13.3/src/probes/lttng-probe-vmscan.o
  CC [M]  /tmp/B.z0hrnmfk/BUILD/lttng-modules-2.13.3/lttng-modules-2.13.3/src/lttng-context-uid.o
  CC [M]  /tmp/B.z0hrnmfk/BUILD/lttng-modules-2.13.3/lttng-modules-2.13.3/src/probes/lttng-probe-rcu.o
  CC [M]  /tmp/B.z0hrnmfk/BUILD/lttng-modules-2.13.3/lttng-modules-2.13.3/src/lttng-context-euid.o
  CC [M]  /tmp/B.z0hrnmfk/BUILD/lttng-modules-2.13.3/lttng-modules-2.13.3/src/lttng-context-suid.o
  CC [M]  /tmp/B.z0hrnmfk/BUILD/lttng-modules-2.13.3/lttng-modules-2.13.3/src/lttng-context-egid.o
  CC [M]  /tmp/B.z0hrnmfk/BUILD/lttng-modules-2.13.3/lttng-modules-2.13.3/src/lttng-context-gid.o
  CC [M]  /tmp/B.z0hrnmfk/BUILD/lttng-modules-2.13.3/lttng-modules-2.13.3/src/lttng-context-sgid.o
  CC [M]  /tmp/B.z0hrnmfk/BUILD/lttng-modules-2.13.3/lttng-modules-2.13.3/src/lttng-context-vuid.o
  CC [M]  /tmp/B.z0hrnmfk/BUILD/lttng-modules-2.13.3/lttng-modules-2.13.3/src/lttng-context-veuid.o
  CC [M]  /tmp/B.z0hrnmfk/BUILD/lttng-modules-2.13.3/lttng-modules-2.13.3/src/lttng-context-vgid.o
  CC [M]  /tmp/B.z0hrnmfk/BUILD/lttng-modules-2.13.3/lttng-modules-2.13.3/src/lttng-context-vegid.o
  CC [M]  /tmp/B.z0hrnmfk/BUILD/lttng-modules-2.13.3/lttng-modules-2.13.3/src/lttng-context-vsuid.o
  CC [M]  /tmp/B.z0hrnmfk/BUILD/lttng-modules-2.13.3/lttng-modules-2.13.3/src/probes/lttng-probe-btrfs.o
  CC [M]  /tmp/B.z0hrnmfk/BUILD/lttng-modules-2.13.3/lttng-modules-2.13.3/src/lttng-context-vsgid.o
  CC [M]  /tmp/B.z0hrnmfk/BUILD/lttng-modules-2.13.3/lttng-modules-2.13.3/src/lttng-context-interruptible.o
  CC [M]  /tmp/B.z0hrnmfk/BUILD/lttng-modules-2.13.3/lttng-modules-2.13.3/src/lttng-context-need-reschedule.o
  CC [M]  /tmp/B.z0hrnmfk/BUILD/lttng-modules-2.13.3/lttng-modules-2.13.3/src/lttng-calibrate.o
  CC [M]  /tmp/B.z0hrnmfk/BUILD/lttng-modules-2.13.3/lttng-modules-2.13.3/src/probes/lttng.o
  CC [M]  /tmp/B.z0hrnmfk/BUILD/lttng-modules-2.13.3/lttng-modules-2.13.3/src/lttng-bytecode.o
  CC [M]  /tmp/B.z0hrnmfk/BUILD/lttng-modules-2.13.3/lttng-modules-2.13.3/src/lttng-context-hostname.o
  CC [M]  /tmp/B.z0hrnmfk/BUILD/lttng-modules-2.13.3/lttng-modules-2.13.3/src/lttng-context-callstack.o
  CC [M]  /tmp/B.z0hrnmfk/BUILD/lttng-modules-2.13.3/lttng-modules-2.13.3/src/lttng-tracker-id.o
  CC [M]  /tmp/B.z0hrnmfk/BUILD/lttng-modules-2.13.3/lttng-modules-2.13.3/src/lttng-tp-mempool.o
  CC [M]  /tmp/B.z0hrnmfk/BUILD/lttng-modules-2.13.3/lttng-modules-2.13.3/src/lttng-bytecode-specialize.o
  CC [M]  /tmp/B.z0hrnmfk/BUILD/lttng-modules-2.13.3/lttng-modules-2.13.3/src/probes/lttng-probe-user.o
  CC [M]  /tmp/B.z0hrnmfk/BUILD/lttng-modules-2.13.3/lttng-modules-2.13.3/src/lttng-bytecode-validator.o
  CC [M]  /tmp/B.z0hrnmfk/BUILD/lttng-modules-2.13.3/lttng-modules-2.13.3/src/lttng-bytecode-interpreter.o
  CC [M]  /tmp/B.z0hrnmfk/BUILD/lttng-modules-2.13.3/lttng-modules-2.13.3/src/lttng-event-notifier-notification.o
  CC [M]  /tmp/B.z0hrnmfk/BUILD/lttng-modules-2.13.3/lttng-modules-2.13.3/src/lttng-syscalls-entry-compat-table.o
  CC [M]  /tmp/B.z0hrnmfk/BUILD/lttng-modules-2.13.3/lttng-modules-2.13.3/src/lttng-syscalls-exit-compat-table.o
  CC [M]  /tmp/B.z0hrnmfk/BUILD/lttng-modules-2.13.3/lttng-modules-2.13.3/src/lttng-syscalls-enum.o
  CC [M]  /tmp/B.z0hrnmfk/BUILD/lttng-modules-2.13.3/lttng-modules-2.13.3/src/lttng-tracepoint.o
  CC [M]  /tmp/B.z0hrnmfk/BUILD/lttng-modules-2.13.3/lttng-modules-2.13.3/src/lttng-context-perf-counters.o
  CC [M]  /tmp/B.z0hrnmfk/BUILD/lttng-modules-2.13.3/lttng-modules-2.13.3/src/lttng-syscalls.o
  CC [M]  /tmp/B.z0hrnmfk/BUILD/lttng-modules-2.13.3/lttng-modules-2.13.3/src/lttng-context-cgroup-ns.o
  CC [M]  /tmp/B.z0hrnmfk/BUILD/lttng-modules-2.13.3/lttng-modules-2.13.3/src/lttng-context-mnt-ns.o
  CC [M]  /tmp/B.z0hrnmfk/BUILD/lttng-modules-2.13.3/lttng-modules-2.13.3/src/lttng-context-ipc-ns.o
  CC [M]  /tmp/B.z0hrnmfk/BUILD/lttng-modules-2.13.3/lttng-modules-2.13.3/src/lttng-context-pid-ns.o
  CC [M]  /tmp/B.z0hrnmfk/BUILD/lttng-modules-2.13.3/lttng-modules-2.13.3/src/lttng-context-net-ns.o
  CC [M]  /tmp/B.z0hrnmfk/BUILD/lttng-modules-2.13.3/lttng-modules-2.13.3/src/wrapper/random.o
  CC [M]  /tmp/B.z0hrnmfk/BUILD/lttng-modules-2.13.3/lttng-modules-2.13.3/src/lttng-context-user-ns.o
  CC [M]  /tmp/B.z0hrnmfk/BUILD/lttng-modules-2.13.3/lttng-modules-2.13.3/src/lttng-context-time-ns.o
  CC [M]  /tmp/B.z0hrnmfk/BUILD/lttng-modules-2.13.3/lttng-modules-2.13.3/src/lttng-context-uts-ns.o
  CC [M]  /tmp/B.z0hrnmfk/BUILD/lttng-modules-2.13.3/lttng-modules-2.13.3/src/wrapper/trace-clock.o
  CC [M]  /tmp/B.z0hrnmfk/BUILD/lttng-modules-2.13.3/lttng-modules-2.13.3/src/wrapper/page_alloc.o
  CC [M]  /tmp/B.z0hrnmfk/BUILD/lttng-modules-2.13.3/lttng-modules-2.13.3/src/probes/lttng-probe-ext4.o
make[2]: *** [scripts/Makefile.build:551: /tmp/B.z0hrnmfk/BUILD/lttng-modules-2.13.3/lttng-modules-2.13.3/src/probes] Error 2
make[2]: *** Waiting for unfinished jobs....
  CC [M]  /tmp/B.z0hrnmfk/BUILD/lttng-modules-2.13.3/lttng-modules-2.13.3/src/wrapper/fdtable.o
  CC [M]  /tmp/B.z0hrnmfk/BUILD/lttng-modules-2.13.3/lttng-modules-2.13.3/src/lttng-wrapper-impl.o
  CC [M]  /tmp/B.z0hrnmfk/BUILD/lttng-modules-2.13.3/lttng-modules-2.13.3/src/wrapper/irqdesc.o
  CC [M]  /tmp/B.z0hrnmfk/BUILD/lttng-modules-2.13.3/lttng-modules-2.13.3/src/wrapper/kallsyms.o
  CC [M]  /tmp/B.z0hrnmfk/BUILD/lttng-modules-2.13.3/lttng-modules-2.13.3/src/lttng-statedump-impl.o
  CC [M]  /tmp/B.z0hrnmfk/BUILD/lttng-modules-2.13.3/lttng-modules-2.13.3/src/lttng-syscalls-entry-table.o
  CC [M]  /tmp/B.z0hrnmfk/BUILD/lttng-modules-2.13.3/lttng-modules-2.13.3/src/lttng-syscalls-exit-table.o
make[1]: *** [Makefile:1868: /tmp/B.z0hrnmfk/BUILD/lttng-modules-2.13.3/lttng-modules-2.13.3/src] Error 2
make: *** [Makefile:31: modules] Error 2
error: Bad exit status from /tmp/B.z0hrnmfk/BUILD/tmp/rpm-tmp.PnvYAd (%build)


RPM build errors:
    Could not canonicalize hostname: nereid
    Bad exit status from /tmp/B.z0hrnmfk/BUILD/tmp/rpm-tmp.PnvYAd (%build)
ended at: Thu Jun 16 01:10:00 2022, done in 0:01:54.252200
error: No files produced.
+ chmod -R u+rwX /tmp/B.z0hrnmfk/BUILD
+ rm -rf /tmp/B.z0hrnmfk/tmp /tmp/B.z0hrnmfk/BUILD
+ rm -rf /tmp/B.z0hrnmfk
Begin-PLD-Builder-Info
Build-Time: user:454.96s sys:63.96s real:144.49s (faults io:43 non-io:10842491)

End-PLD-Builder-Info
[Back to list of logs] [View rpm -qa of builder]