FailedOk

th/SRPMS[OK]
th/x32[OK]
th/i686[OK]
th/x86_64[OK]

ac/SRPMS[OK]
ac/i386[OK]
ac/i586[OK]
ac/i686[OK]
ac/alpha[OK]
ac/amd64[OK]
ac/athlon[OK]
ac/ppc[OK]
ac/sparc[OK]
ac/sparc64[OK]

Advanced Search
main()
Powered by PLD Linux
(c) 2002-2024 PLD Team
$Revision: 1.37 $
Powered by six Cray XMT Supercomputers.
Your IP: 44.192.94.177

obexftp e4bdad62-ffa9-43d1-8dcb-d744317583ea

Status:Failed
Source URL:https://buildlogs.pld-linux.org/pld/th/i686/FAIL/obexftp,e4bdad62-ffa9-43d1-8dcb-d744317583ea.bz2
text/plain URL:View!
rpm -qa of builder:View!
Date:2024/06/30 13:47:12
Runtime:0:00:20.556895

Toc:

  • prep
  • Executing(%prep): /bin/sh -e /tmp/B.31rg53yw/BUILD/tmp/rpm-tmp.jdlTUF
  • build
  • Executing(%build): /bin/sh -e /tmp/B.31rg53yw/BUILD/tmp/rpm-tmp.APRsdc
  • error 1
  • AttributeError: module 'string' has no attribute 'split'
  • error 2
  • make[3]: *** [Makefile:481: all-local] Error 1
  • error 3
  • make[2]: *** [Makefile:385: all-recursive] Error 1
  • error 4
  • make[1]: *** [Makefile:504: all-recursive] Error 1
  • error 5
  • error: Bad exit status from /tmp/B.31rg53yw/BUILD/tmp/rpm-tmp.APRsdc (%build)
  • error 6
  • RPM build errors:
  • error 7
  • error: No files produced.

Content:

request from: atler
checking if we should skip the build
started at: Sun Jun 30 13:46:49 2024
killing old processes on a builder
sending signal 9 to pid -1
cleaning up /tmp
fetching https://srcbuilder.pld-linux.org/th//srpms/e4bdad62-ffa9-43d1-8dcb-d744317583ea/obexftp-0.23-29.src.rpm
fetched 417360 bytes, 1136.6 K/s
installing srpm: obexftp-0.23-29.src.rpm
+ install -d /tmp/B.31rg53yw/BUILD /tmp/B.31rg53yw/RPMS
+ LC_ALL=en_US.UTF-8
+ rpm -qp --changelog obexftp-0.23-29.src.rpm
* Sun Jun 30 2024 PLD Linux Team <feedback@pld-linux.org>
- For complete changelog see: http://git.pld-linux.org/?p=packages/obexftp.git;a=log;h=master
* Thu Jul 06 2023 Jan Palus <atler@pld-linux.org> 6153d17
- perl 5.38.0 rebuild * Mon Aug 22 2022 Jan Palus <atler@pld-linux.org> a9dfe56
- perl 5.36.0 rebuild * Sun Feb 27 2022 Jan Rękorajski <baggins@pld-linux.org> 8bdd82a
- rebuild with perl 5.34.0 * Sat May 08 2021 Jan Rękorajski <baggins@pld-linux.org> 195d1bc
- rebuild with perl 5.32 * Fri May 07 2021 Jan Rękorajski <baggins@pld-linux.org> 1f47810
- rediff patch * Sat Mar 21 2020 Jan Rękorajski <baggins@pld-linux.org> 30f6a19
- release 25 (by relup.sh) * Sat Jan 25 2020 Jan Rękorajski <baggins@pld-linux.org> 110b088
- drop obsolete and outdated manual inclusion of rpm macros * Wed Dec 04 2019 Jan Rękorajski <baggins@pld-linux.org> ae4247c
- rebuild with perl 5.30.0 - release 24 (by relup.sh) * Thu Aug 30 2018 Jan Rękorajski <baggins@pld-linux.org> e1e9fad
- rebuild with perl 5.28.0 - release 23 (by relup.sh) * Sun Jun 03 2018 Jan Rękorajski <baggins@pld-linux.org> 6c681d9
- rebuild with ruby 2.4 - release 22 (by relup.sh) * Wed Oct 25 2017 Jan Rękorajski <baggins@pld-linux.org> bd441b2
- rebuild with ruby 2.3 - release 21 (by relup.sh) * Sun Jun 11 2017 Jan Rękorajski <baggins@pld-linux.org> e7f80c3
- perl req/prov fix - release 20 (by relup.sh) * Sun Jun 11 2017 Jan Rękorajski <baggins@pld-linux.org> b63a551
- rebuild with perl 5.26 - release 19 (by relup.sh) * Sun Oct 30 2016 Jan Rękorajski <baggins@pld-linux.org> a51ac03
- rebuild with perl 5.24.0 - release 18 (by relup.sh) * Sat Mar 19 2016 Elan Ruusamäe <glen@delfi.ee> bb631e0
- ruby 2.1 rebuild - release 17 (by relup.sh) * Thu Dec 24 2015 Jan Rękorajski <baggins@pld-linux.org> 828dbe1
- release 16 (by relup.sh) * Mon Nov 30 2015 Jacek Konieczny <j.konieczny@eggsoft.pl> d2b8b74
- release 15 (by relup.sh) * Sat Nov 28 2015 Jacek Konieczny <jajcus@jajcus.net> f9e3d0a
- release 14 (by relup.sh) * Fri Mar 20 2015 Elan Ruusamäe <glen@delfi.ee> 6ffe6be
- x32 rebuild - release 13 (by relup.sh) * Sun Dec 28 2014 Jan Rękorajski <baggins@pld-linux.org> 9b61c1f
- updated gettext BR + rpm -Uhv --nodeps --define '_topdir /tmp/B.31rg53yw' --define '_specdir %{_topdir}' --define '_sourcedir %{_specdir}' --define '_rpmdir %{_topdir}/RPMS' --define '_builddir %{_topdir}/BUILD' obexftp-0.23-29.src.rpm Updating / installing... obexftp-0.23-29 ######################################## + rm -f obexftp-0.23-29.src.rpm + install -m 700 -d /tmp/B.31rg53yw/BUILD/tmp + TMPDIR=/tmp/B.31rg53yw/BUILD/tmp + exec nice -n 0 rpmbuild -bp --short-circuit --nodeps --define '_topdir /tmp/B.31rg53yw' --define '_specdir %{_topdir}' --define '_sourcedir %{_specdir}' --define '_rpmdir %{_topdir}/RPMS' --define '_builddir %{_topdir}/BUILD' --target i686-pld-linux --define 'prep exit 0' /tmp/B.31rg53yw/obexftp.spec warning: Macro expanded in comment on line 152: %{_lib} before -L../../obexftp/.libs warning: Could not canonicalize hostname: nereid Building target platforms: i686-pld-linux Building for target i686-pld-linux RPM build warnings: Macro expanded in comment on line 152: %{_lib} before -L../../obexftp/.libs Could not canonicalize hostname: nereid checking BuildConflict-ing packages rpm: warning: Could not canonicalize hostname: nereid rpm: Building target platforms: i686-pld-linux rpm: Building for target i686-pld-linux rpm: rpm: RPM build warnings: rpm: Could not canonicalize hostname: nereid no BuildConflicts found checking BR rpm: warning: Could not canonicalize hostname: nereid rpm: Building target platforms: i686-pld-linux rpm: Building for target i686-pld-linux rpm: rpm: RPM build warnings: rpm: Could not canonicalize hostname: nereid no BR needed building RPM using: set -ex; : build-id: e4bdad62-ffa9-43d1-8dcb-d744317583ea; TMPDIR=/tmp/B.31rg53yw/BUILD/tmp exec nice -n 0 rpmbuild -bb --define '__jobs 28' --define '_smp_mflags -j28' --define '_make_opts -Otarget' --define '_pld_builder 1' --define '_topdir /tmp/B.31rg53yw' --define '_specdir %{_topdir}' --define '_sourcedir %{_specdir}' --define '_rpmdir %{_topdir}/RPMS' --define '_builddir %{_topdir}/BUILD' --target i686-pld-linux /tmp/B.31rg53yw/obexftp.spec + : build-id: e4bdad62-ffa9-43d1-8dcb-d744317583ea + TMPDIR=/tmp/B.31rg53yw/BUILD/tmp + exec nice -n 0 rpmbuild -bb --define '__jobs 28' --define '_smp_mflags -j28' --define '_make_opts -Otarget' --define '_pld_builder 1' --define '_topdir /tmp/B.31rg53yw' --define '_specdir %{_topdir}' --define '_sourcedir %{_specdir}' --define '_rpmdir %{_topdir}/RPMS' --define '_builddir %{_topdir}/BUILD' --target i686-pld-linux /tmp/B.31rg53yw/obexftp.spec warning: Could not canonicalize hostname: nereid Building target platforms: i686-pld-linux Building for target i686-pld-linux Executing(%prep): /bin/sh -e /tmp/B.31rg53yw/BUILD/tmp/rpm-tmp.jdlTUF + umask 022 + cd /tmp/B.31rg53yw/BUILD + cd /tmp/B.31rg53yw/BUILD + rm -rf obexftp-0.23 + /usr/bin/bzip2 -dc /tmp/B.31rg53yw/obexftp-0.23.tar.bz2 + /bin/tar -xof - + STATUS=0 + '[' 0 -ne 0 ']' + cd obexftp-0.23 + /bin/chmod -Rf a+rX,u+w,g-w,o-w . + echo 'Patch #0 (obexftp-no_server.patch):' Patch #0 (obexftp-no_server.patch): + </tmp/B.31rg53yw/obexftp-no_server.patch + /usr/bin/patch -s -f -p1 '--fuzz=0' + echo 'Patch #1 (obexftp-perl.patch):' Patch #1 (obexftp-perl.patch): + </tmp/B.31rg53yw/obexftp-perl.patch + /usr/bin/patch -s -f -p1 '--fuzz=0' + echo 'Patch #2 (obexftp-nostress.patch):' Patch #2 (obexftp-nostress.patch): + </tmp/B.31rg53yw/obexftp-nostress.patch + /usr/bin/patch -s -f -p1 '--fuzz=0' + echo 'Patch #3 (obexftp-ruby1.9.patch):' Patch #3 (obexftp-ruby1.9.patch): + </tmp/B.31rg53yw/obexftp-ruby1.9.patch + /usr/bin/patch -s -f -p1 '--fuzz=0' + echo 'Patch #4 (am.patch):' Patch #4 (am.patch): + </tmp/B.31rg53yw/am.patch + /usr/bin/patch -s -f -p1 '--fuzz=0' + echo 'Patch #5 (format-security.patch):' Patch #5 (format-security.patch): + </tmp/B.31rg53yw/format-security.patch + /usr/bin/patch -s -f -p1 '--fuzz=0' + ln -sf ../../obexftp/.libs/libobexftp.so swig/ruby + RPM_EC=0 + jobs -p + exit 0 Executing(%build): /bin/sh -e /tmp/B.31rg53yw/BUILD/tmp/rpm-tmp.APRsdc TMP=/home/users/builder/tmp HOME=/home/users/builder PATH=/home/users/builder/GNUstep/Tools:/bin:/usr/bin:/usr/local/bin:/home/users/builder/bin TMPDIR=/tmp/B.31rg53yw/BUILD/tmp + umask 022 + cd /tmp/B.31rg53yw/BUILD + cd obexftp-0.23 + libtoolize --copy --force --install libtoolize: putting auxiliary files in '.'. libtoolize: copying file './config.guess' libtoolize: copying file './config.sub' libtoolize: copying file './install-sh' libtoolize: copying file './ltmain.sh' libtoolize: putting macros in 'm4'. libtoolize: copying file 'm4/libtool.m4' libtoolize: You should add the contents of 'm4/libtool.m4' to 'aclocal.m4'. libtoolize: copying file 'm4/ltoptions.m4' libtoolize: You should add the contents of 'm4/ltoptions.m4' to 'aclocal.m4'. libtoolize: copying file 'm4/ltsugar.m4' libtoolize: You should add the contents of 'm4/ltsugar.m4' to 'aclocal.m4'. libtoolize: copying file 'm4/ltversion.m4' libtoolize: You should add the contents of 'm4/ltversion.m4' to 'aclocal.m4'. libtoolize: copying file 'm4/lt~obsolete.m4' libtoolize: You should add the contents of 'm4/lt~obsolete.m4' to 'aclocal.m4'. libtoolize: Consider adding 'AC_CONFIG_MACRO_DIRS([m4])' to configure.in, libtoolize: and rerunning libtoolize and aclocal. + aclocal aclocal: warning: autoconf input should be named 'configure.ac', not 'configure.in' + autoconf configure.in:14: warning: The macro 'AC_ISC_POSIX' is obsolete. configure.in:14: You should run autoupdate. ./lib/autoconf/specific.m4:728: AC_ISC_POSIX is expanded from... configure.in:14: the top level configure.in:20: warning: The macro 'AC_PROG_LIBTOOL' is obsolete. configure.in:20: You should run autoupdate. aclocal.m4:2267: AC_PROG_LIBTOOL is expanded from... configure.in:20: the top level configure.in:23: warning: The macro 'AC_HEADER_STDC' is obsolete. configure.in:23: You should run autoupdate. ./lib/autoconf/headers.m4:663: AC_HEADER_STDC is expanded from... configure.in:23: the top level configure.in:36: warning: The macro 'AC_HELP_STRING' is obsolete. configure.in:36: You should run autoupdate. ./lib/autoconf/general.m4:204: AC_HELP_STRING is expanded from... ./lib/autoconf/general.m4:1534: AC_ARG_ENABLE is expanded from... acinclude.m4:99: BLUETOOTH_CHECK is expanded from... configure.in:36: the top level configure.in:36: warning: AC_CACHE_VAL(freebsdbt_found, ...): suspicious cache-id, must contain _cv_ to be cached ./lib/autoconf/general.m4:2249: AC_CACHE_VAL is expanded from... ./lib/autoconf/general.m4:2270: AC_CACHE_CHECK is expanded from... acinclude.m4:63: AC_PATH_FREEBSDBT is expanded from... acinclude.m4:80: AC_PATH_BLUETOOTH is expanded from... acinclude.m4:99: BLUETOOTH_CHECK is expanded from... configure.in:36: the top level configure.in:36: warning: The macro 'AC_TRY_COMPILE' is obsolete. configure.in:36: You should run autoupdate. ./lib/autoconf/general.m4:2845: AC_TRY_COMPILE is expanded from... lib/m4sugar/m4sh.m4:690: _AS_IF_ELSE is expanded from... lib/m4sugar/m4sh.m4:697: AS_IF is expanded from... ./lib/autoconf/general.m4:2249: AC_CACHE_VAL is expanded from... ./lib/autoconf/general.m4:2270: AC_CACHE_CHECK is expanded from... acinclude.m4:63: AC_PATH_FREEBSDBT is expanded from... acinclude.m4:80: AC_PATH_BLUETOOTH is expanded from... acinclude.m4:99: BLUETOOTH_CHECK is expanded from... configure.in:36: the top level configure.in:36: warning: AC_CACHE_VAL(netbsdbt_found, ...): suspicious cache-id, must contain _cv_ to be cached ./lib/autoconf/general.m4:2249: AC_CACHE_VAL is expanded from... ./lib/autoconf/general.m4:2270: AC_CACHE_CHECK is expanded from... acinclude.m4:53: AC_PATH_NETBSDBT is expanded from... acinclude.m4:80: AC_PATH_BLUETOOTH is expanded from... acinclude.m4:99: BLUETOOTH_CHECK is expanded from... configure.in:36: the top level configure.in:36: warning: The macro 'AC_TRY_COMPILE' is obsolete. configure.in:36: You should run autoupdate. ./lib/autoconf/general.m4:2845: AC_TRY_COMPILE is expanded from... lib/m4sugar/m4sh.m4:690: _AS_IF_ELSE is expanded from... lib/m4sugar/m4sh.m4:697: AS_IF is expanded from... ./lib/autoconf/general.m4:2249: AC_CACHE_VAL is expanded from... ./lib/autoconf/general.m4:2270: AC_CACHE_CHECK is expanded from... acinclude.m4:53: AC_PATH_NETBSDBT is expanded from... acinclude.m4:80: AC_PATH_BLUETOOTH is expanded from... acinclude.m4:99: BLUETOOTH_CHECK is expanded from... configure.in:36: the top level configure.in:36: warning: AC_CACHE_VAL(winbt_found, ...): suspicious cache-id, must contain _cv_ to be cached ./lib/autoconf/general.m4:2249: AC_CACHE_VAL is expanded from... acinclude.m4:43: AC_PATH_WINBT is expanded from... acinclude.m4:80: AC_PATH_BLUETOOTH is expanded from... acinclude.m4:99: BLUETOOTH_CHECK is expanded from... configure.in:36: the top level configure.in:39: warning: The macro 'AC_TRY_COMPILE' is obsolete. configure.in:39: You should run autoupdate. ./lib/autoconf/general.m4:2845: AC_TRY_COMPILE is expanded from... acinclude.m4:119: SDPLIB_CHECK is expanded from... configure.in:39: the top level configure.in:41: warning: The macro 'AC_TRY_COMPILE' is obsolete. configure.in:41: You should run autoupdate. ./lib/autoconf/general.m4:2845: AC_TRY_COMPILE is expanded from... acinclude.m4:145: USB_CHECK is expanded from... configure.in:41: the top level configure.in:47: warning: The macro 'AC_HELP_STRING' is obsolete. configure.in:47: You should run autoupdate. ./lib/autoconf/general.m4:204: AC_HELP_STRING is expanded from... ./lib/autoconf/general.m4:1534: AC_ARG_ENABLE is expanded from... configure.in:47: the top level configure.in:61: warning: The macro 'AC_HELP_STRING' is obsolete. configure.in:61: You should run autoupdate. ./lib/autoconf/general.m4:204: AC_HELP_STRING is expanded from... ./lib/autoconf/general.m4:1534: AC_ARG_ENABLE is expanded from... configure.in:61: the top level configure.in:72: warning: The macro 'AC_HELP_STRING' is obsolete. configure.in:72: You should run autoupdate. ./lib/autoconf/general.m4:204: AC_HELP_STRING is expanded from... ./lib/autoconf/general.m4:1534: AC_ARG_ENABLE is expanded from... configure.in:72: the top level configure.in:83: warning: The macro 'AC_HELP_STRING' is obsolete. configure.in:83: You should run autoupdate. ./lib/autoconf/general.m4:204: AC_HELP_STRING is expanded from... ./lib/autoconf/general.m4:1534: AC_ARG_ENABLE is expanded from... configure.in:83: the top level configure.in:94: warning: The macro 'AC_HELP_STRING' is obsolete. configure.in:94: You should run autoupdate. ./lib/autoconf/general.m4:204: AC_HELP_STRING is expanded from... ./lib/autoconf/general.m4:1534: AC_ARG_ENABLE is expanded from... configure.in:94: the top level configure.in:108: warning: The macro 'AC_HELP_STRING' is obsolete. configure.in:108: You should run autoupdate. ./lib/autoconf/general.m4:204: AC_HELP_STRING is expanded from... configure.in:108: the top level configure.in:118: warning: The macro 'AC_TRY_COMPILE' is obsolete. configure.in:118: You should run autoupdate. ./lib/autoconf/general.m4:2845: AC_TRY_COMPILE is expanded from... configure.in:118: the top level configure.in:124: warning: The macro 'ac_cv_prog_gcc' is obsolete. configure.in:124: You should run autoupdate. ./lib/autoconf/c.m4:448: ac_cv_prog_gcc is expanded from... configure.in:124: the top level configure.in:147: warning: AC_OUTPUT should be used without arguments. configure.in:147: You should run autoupdate. + autoheader autoheader: warning: autoconf input should be named 'configure.ac', not 'configure.in' + automake -a -c -f --foreign automake: warning: autoconf input should be named 'configure.ac', not 'configure.in' configure.in:14: installing './compile' configure.in:5: installing './missing' automake: warning: autoconf input should be named 'configure.ac', not 'configure.in' apps/Makefile.am: installing './depcomp' + ./configure 'LDFLAGS=-Wl,--as-needed -Wl,--no-copy-dt-needed-entries -Wl,-z,relro -Wl,-z,combreloc ' 'CFLAGS=-O2 -fwrapv -pipe -Wformat -Werror=format-security -gdwarf-4 -fno-debug-types-section -fvar-tracking-assignments -g2 -Wp,-D_FORTIFY_SOURCE=2 -fstack-protector-strong --param=ssp-buffer-size=4 -Werror=trampolines -fomit-frame-pointer -march=i686 -fasynchronous-unwind-tables -mtune=pentium4 -gdwarf-4 -fno-debug-types-section -fvar-tracking-assignments -g2 ' 'CXXFLAGS=-O2 -fwrapv -pipe -Wformat -Werror=format-security -gdwarf-4 -fno-debug-types-section -fvar-tracking-assignments -g2 -Wp,-D_FORTIFY_SOURCE=2 -fstack-protector-strong --param=ssp-buffer-size=4 -Werror=trampolines -fomit-frame-pointer -march=i686 -fasynchronous-unwind-tables -mtune=pentium4 -gdwarf-4 -fno-debug-types-section -fvar-tracking-assignments -g2 ' 'FFLAGS=-O2 -fwrapv -pipe -Wformat -Werror=format-security -gdwarf-4 -fno-debug-types-section -fvar-tracking-assignments -g2 -Wp,-D_FORTIFY_SOURCE=2 -fstack-protector-strong --param=ssp-buffer-size=4 -Werror=trampolines -fomit-frame-pointer -march=i686 -fasynchronous-unwind-tables -mtune=pentium4 -gdwarf-4 -fno-debug-types-section -fvar-tracking-assignments -g2 ' 'FCFLAGS=-O2 -fwrapv -pipe -Wformat -Werror=format-security -gdwarf-4 -fno-debug-types-section -fvar-tracking-assignments -g2 -Wp,-D_FORTIFY_SOURCE=2 -fstack-protector-strong --param=ssp-buffer-size=4 -Werror=trampolines -fomit-frame-pointer -march=i686 -fasynchronous-unwind-tables -mtune=pentium4 -gdwarf-4 -fno-debug-types-section -fvar-tracking-assignments -g2 ' 'CPPFLAGS=' 'CC=i686-pld-linux-gcc' 'CXX=i686-pld-linux-g++' '--host=i686-pld-linux' '--build=i686-pld-linux' '--prefix=/usr' '--exec-prefix=/usr' '--bindir=/usr/bin' '--sbindir=/usr/sbin' '--sysconfdir=/etc' '--datadir=/usr/share' '--includedir=/usr/include' '--libdir=/usr/lib' '--libexecdir=/usr/libexec' '--localstatedir=/var' '--sharedstatedir=/var/lib' '--mandir=/usr/share/man' '--infodir=/usr/share/info' '--x-libraries=/usr/lib' checking for a BSD-compatible install... /usr/bin/install -c checking whether build environment is sane... yes checking for a race-free mkdir -p... /bin/mkdir -p checking for mawk... mawk checking whether make sets $(MAKE)... yes checking whether make supports nested variables... yes checking whether make supports the include directive... yes (GNU style) checking for i686-pld-linux-gcc... i686-pld-linux-gcc checking whether the C compiler works... yes checking for C compiler default output file name... a.out checking for suffix of executables... checking whether we are cross compiling... no checking for suffix of object files... o checking whether the compiler supports GNU C... yes checking whether i686-pld-linux-gcc accepts -g... yes checking for i686-pld-linux-gcc option to enable C11 features... none needed checking whether i686-pld-linux-gcc understands -c and -o together... yes checking dependency style of i686-pld-linux-gcc... gcc3 checking for library containing strerror... none required checking for i686-pld-linux-gcc... (cached) i686-pld-linux-gcc checking whether the compiler supports GNU C... (cached) yes checking whether i686-pld-linux-gcc accepts -g... (cached) yes checking for i686-pld-linux-gcc option to enable C11 features... (cached) none needed checking whether i686-pld-linux-gcc understands -c and -o together... (cached) yes checking dependency style of i686-pld-linux-gcc... (cached) gcc3 checking whether ln -s works... yes checking build system type... i686-pld-linux-gnu checking host system type... i686-pld-linux-gnu checking how to print strings... print -r checking for a sed that does not truncate output... /bin/sed checking for grep that handles long lines and -e... /bin/grep checking for egrep... /bin/grep -E checking for fgrep... /bin/grep -F checking for ld used by i686-pld-linux-gcc... /usr/bin/ld checking if the linker (/usr/bin/ld) is GNU ld... yes checking for BSD- or MS-compatible name lister (nm)... /usr/bin/nm -B checking the name lister (/usr/bin/nm -B) interface... BSD nm checking the maximum length of command line arguments... 1572864 checking how to convert i686-pld-linux-gnu file names to i686-pld-linux-gnu format... func_convert_file_noop checking how to convert i686-pld-linux-gnu file names to toolchain format... func_convert_file_noop checking for /usr/bin/ld option to reload object files... -r checking for i686-pld-linux-file... no checking for file... file checking for i686-pld-linux-objdump... no checking for objdump... objdump checking how to recognize dependent libraries... pass_all checking for i686-pld-linux-dlltool... no checking for dlltool... no checking how to associate runtime and link libraries... print -r -- checking for i686-pld-linux-ar... no checking for ar... ar checking for archiver @FILE support... @ checking for i686-pld-linux-strip... no checking for strip... strip checking for i686-pld-linux-ranlib... no checking for ranlib... ranlib checking command to parse /usr/bin/nm -B output from i686-pld-linux-gcc object... ok checking for sysroot... no checking for a working dd... /bin/dd checking how to truncate binary pipes... /bin/dd bs=4096 count=1 checking for i686-pld-linux-mt... no checking for mt... no checking if : is a manifest tool... no checking for stdio.h... yes checking for stdlib.h... yes checking for string.h... yes checking for inttypes.h... yes checking for stdint.h... yes checking for strings.h... yes checking for sys/stat.h... yes checking for sys/types.h... yes checking for unistd.h... yes checking for dlfcn.h... yes checking for objdir... .libs checking if i686-pld-linux-gcc supports -fno-rtti -fno-exceptions... no checking for i686-pld-linux-gcc option to produce PIC... -fPIC -DPIC checking if i686-pld-linux-gcc PIC flag -fPIC -DPIC works... yes checking if i686-pld-linux-gcc static flag -static works... yes checking if i686-pld-linux-gcc supports -c -o file.o... yes checking if i686-pld-linux-gcc supports -c -o file.o... (cached) yes checking whether the i686-pld-linux-gcc linker (/usr/bin/ld) supports shared libraries... yes checking whether -lc should be explicitly linked in... no checking dynamic linker characteristics... GNU/Linux ld.so checking how to hardcode library paths into programs... immediate checking whether stripping libraries is possible... yes checking if libtool supports shared libraries... yes checking whether to build shared libraries... yes checking whether to build static libraries... yes checking for egrep... (cached) /bin/grep -E checking for dirent.h that defines DIR... yes checking for library containing opendir... none required checking for arpa/inet.h... yes checking for errno.h... yes checking for fcntl.h... yes checking for netdb.h... yes checking for netinet/in.h... yes checking for stdlib.h... (cached) yes checking for string.h... (cached) yes checking for sys/ioctl.h... yes checking for sys/socket.h... yes checking for sys/time.h... yes checking for termios.h... yes checking for unistd.h... (cached) yes checking for sys/select.h... yes checking for sys/times.h... yes checking for i686-pld-linux-pkg-config... no checking for pkg-config... /usr/bin/pkg-config checking pkg-config is at least version 0.9.0... yes checking for openobex... yes checking for ld... /usr/bin/ld checking if the linker (/usr/bin/ld) is GNU ld... yes checking for shared library run path origin... done checking 32-bit host C ABI... yes checking how to run the C preprocessor... i686-pld-linux-gcc -E checking for egrep -e... (cached) /bin/grep -E checking for ELF binary format... yes checking for the common suffixes of directories in the library search path... lib,lib,lib checking for iconv... yes checking for working iconv... yes checking whether iconv is compatible with its POSIX signature... yes checking for langinfo.h... yes checking for bluez... yes checking for Bluetooth SDP support... yes checking for USB support... yes checking for perl... yes checking for perl... /usr/bin/perl checking for python... yes checking for python... /usr/bin/python checking for python version... 3.10 checking for python platform... linux checking for GNU default python prefix... ${prefix} checking for GNU default python exec_prefix... ${exec_prefix} checking for python script directory (pythondir)... ${PYTHON_PREFIX}/share/python3.10/site-packages checking for python extension module directory (pyexecdir)... ${PYTHON_EXEC_PREFIX}/lib/python3.10/site-packages checking for ruby... yes checking for ruby... /usr/bin/ruby checking for tclsh... yes checking for tclsh... /usr/bin/tclsh checking that generated files are newer than configure... done configure: creating ./config.status config.status: creating Makefile config.status: creating swig/perl/Makefile config.status: creating swig/perl/Makefile.PL config.status: creating swig/python/Makefile config.status: creating swig/python/setup.py config.status: creating swig/ruby/Makefile config.status: creating swig/tcl/Makefile config.status: creating swig/Makefile config.status: creating examples/Makefile config.status: creating doc/Makefile config.status: creating apps/Makefile config.status: creating bfb/Makefile config.status: creating multicobex/Makefile config.status: creating obexftp/Makefile config.status: creating obexftp.spec config.status: creating obexftp.pc config.status: creating config.h config.status: executing depfiles commands config.status: executing libtool commands + /usr/bin/make -Otarget -j28 /usr/bin/make all-recursive Making all in bfb make[2]: Entering directory '/tmp/B.31rg53yw/BUILD/obexftp-0.23/bfb' /bin/sh ../libtool --tag=CC --mode=compile i686-pld-linux-gcc -DHAVE_CONFIG_H -I. -I.. -I../includes -O2 -fwrapv -pipe -Wformat -Werror=format-security -gdwarf-4 -fno-debug-types-section -fvar-tracking-assignments -g2 -Wp,-D_FORTIFY_SOURCE=2 -fstack-protector-strong --param=ssp-buffer-size=4 -Werror=trampolines -fomit-frame-pointer -march=i686 -fasynchronous-unwind-tables -mtune=pentium4 -gdwarf-4 -fno-debug-types-section -fvar-tracking-assignments -g2 -W -Wundef -Wmissing-declarations -Wmissing-prototypes -Wall -MT crc.lo -MD -MP -MF .deps/crc.Tpo -c -o crc.lo crc.c libtool: compile: i686-pld-linux-gcc -DHAVE_CONFIG_H -I. -I.. -I../includes -O2 -fwrapv -pipe -Wformat -Werror=format-security -gdwarf-4 -fno-debug-types-section -fvar-tracking-assignments -g2 -Wp,-D_FORTIFY_SOURCE=2 -fstack-protector-strong --param=ssp-buffer-size=4 -Werror=trampolines -fomit-frame-pointer -march=i686 -fasynchronous-unwind-tables -mtune=pentium4 -gdwarf-4 -fno-debug-types-section -fvar-tracking-assignments -g2 -W -Wundef -Wmissing-declarations -Wmissing-prototypes -Wall -MT crc.lo -MD -MP -MF .deps/crc.Tpo -c crc.c -fPIC -DPIC -o .libs/crc.o libtool: compile: i686-pld-linux-gcc -DHAVE_CONFIG_H -I. -I.. -I../includes -O2 -fwrapv -pipe -Wformat -Werror=format-security -gdwarf-4 -fno-debug-types-section -fvar-tracking-assignments -g2 -Wp,-D_FORTIFY_SOURCE=2 -fstack-protector-strong --param=ssp-buffer-size=4 -Werror=trampolines -fomit-frame-pointer -march=i686 -fasynchronous-unwind-tables -mtune=pentium4 -gdwarf-4 -fno-debug-types-section -fvar-tracking-assignments -g2 -W -Wundef -Wmissing-declarations -Wmissing-prototypes -Wall -MT crc.lo -MD -MP -MF .deps/crc.Tpo -c crc.c -o crc.o >/dev/null 2>&1 mv -f .deps/crc.Tpo .deps/crc.Plo make[2]: Leaving directory '/tmp/B.31rg53yw/BUILD/obexftp-0.23/bfb' make[2]: Entering directory '/tmp/B.31rg53yw/BUILD/obexftp-0.23/bfb' /bin/sh ../libtool --tag=CC --mode=compile i686-pld-linux-gcc -DHAVE_CONFIG_H -I. -I.. -I../includes -O2 -fwrapv -pipe -Wformat -Werror=format-security -gdwarf-4 -fno-debug-types-section -fvar-tracking-assignments -g2 -Wp,-D_FORTIFY_SOURCE=2 -fstack-protector-strong --param=ssp-buffer-size=4 -Werror=trampolines -fomit-frame-pointer -march=i686 -fasynchronous-unwind-tables -mtune=pentium4 -gdwarf-4 -fno-debug-types-section -fvar-tracking-assignments -g2 -W -Wundef -Wmissing-declarations -Wmissing-prototypes -Wall -MT bfb_io.lo -MD -MP -MF .deps/bfb_io.Tpo -c -o bfb_io.lo bfb_io.c libtool: compile: i686-pld-linux-gcc -DHAVE_CONFIG_H -I. -I.. -I../includes -O2 -fwrapv -pipe -Wformat -Werror=format-security -gdwarf-4 -fno-debug-types-section -fvar-tracking-assignments -g2 -Wp,-D_FORTIFY_SOURCE=2 -fstack-protector-strong --param=ssp-buffer-size=4 -Werror=trampolines -fomit-frame-pointer -march=i686 -fasynchronous-unwind-tables -mtune=pentium4 -gdwarf-4 -fno-debug-types-section -fvar-tracking-assignments -g2 -W -Wundef -Wmissing-declarations -Wmissing-prototypes -Wall -MT bfb_io.lo -MD -MP -MF .deps/bfb_io.Tpo -c bfb_io.c -fPIC -DPIC -o .libs/bfb_io.o bfb_io.c: In function 'do_at_cmd': bfb_io.c:239:30: warning: pointer targets in passing argument 2 of 'bfb_io_write' differ in signedness [-Wpointer-sign] 239 | if (bfb_io_write(fd, cmd, cmdlen) < cmdlen) | ^~~ | | | const char * bfb_io.c:54:42: note: expected 'const uint8_t *' {aka 'const unsigned char *'} but argument is of type 'const char *' 54 | int bfb_io_write(fd_t fd, const uint8_t *buffer, int length) | ~~~~~~~~~~~~~~~^~~~~~ bfb_io.c:244:42: warning: pointer targets in passing argument 2 of 'bfb_io_read' differ in signedness [-Wpointer-sign] 244 | actual = bfb_io_read(fd, &tmpbuf[total], sizeof(tmpbuf) - total, 2); | ^~~~~~~~~~~~~~ | | | char * bfb_io.c:82:35: note: expected 'uint8_t *' {aka 'unsigned char *'} but argument is of type 'char *' 82 | int bfb_io_read(fd_t fd, uint8_t *buffer, int length, int timeout) | ~~~~~~~~~^~~~~~ bfb_io.c:254:27: warning: comparison of integer expressions of different signedness: 'int' and 'unsigned int' [-Wsign-compare] 254 | if (total >= sizeof(tmpbuf)) | ^~ bfb_io.c:271:42: warning: pointer targets in passing argument 2 of 'bfb_io_read' differ in signedness [-Wpointer-sign] 271 | actual = bfb_io_read(fd, &tmpbuf[total], sizeof(tmpbuf) - total, 2); | ^~~~~~~~~~~~~~ | | | char * bfb_io.c:82:35: note: expected 'uint8_t *' {aka 'unsigned char *'} but argument is of type 'char *' 82 | int bfb_io_read(fd_t fd, uint8_t *buffer, int length, int timeout) | ~~~~~~~~~^~~~~~ bfb_io.c: In function 'bfb_io_open': bfb_io.c:415:61: warning: hex escape sequence out of range 415 | actual = bfb_io_write(ttyfd, "\xFF\x00\x08\xCBATZ\r", 8); | ^ bfb_io.c:415:38: warning: pointer targets in passing argument 2 of 'bfb_io_write' differ in signedness [-Wpointer-sign] 415 | actual = bfb_io_write(ttyfd, "\xFF\x00\x08\xCBATZ\r", 8); | ^~~~~~~~~~~~~~~~~~~~~~~ | | | char * bfb_io.c:54:42: note: expected 'const uint8_t *' {aka 'const unsigned char *'} but argument is of type 'char *' 54 | int bfb_io_write(fd_t fd, const uint8_t *buffer, int length) | ~~~~~~~~~~~~~~~^~~~~~ bfb_io.c:418:49: warning: pointer targets in passing argument 2 of 'bfb_io_read_all' differ in signedness [-Wpointer-sign] 418 | actual = bfb_io_read_all(ttyfd, rspbuf, sizeof(rspbuf), 2); | ^~~~~~ | | | char * bfb_io.c:126:45: note: expected 'uint8_t *' {aka 'unsigned char *'} but argument is of type 'char *' 126 | static int bfb_io_read_all(int fd, uint8_t *buffer, int length, int timeout) | ~~~~~~~~~^~~~~~ libtool: compile: i686-pld-linux-gcc -DHAVE_CONFIG_H -I. -I.. -I../includes -O2 -fwrapv -pipe -Wformat -Werror=format-security -gdwarf-4 -fno-debug-types-section -fvar-tracking-assignments -g2 -Wp,-D_FORTIFY_SOURCE=2 -fstack-protector-strong --param=ssp-buffer-size=4 -Werror=trampolines -fomit-frame-pointer -march=i686 -fasynchronous-unwind-tables -mtune=pentium4 -gdwarf-4 -fno-debug-types-section -fvar-tracking-assignments -g2 -W -Wundef -Wmissing-declarations -Wmissing-prototypes -Wall -MT bfb_io.lo -MD -MP -MF .deps/bfb_io.Tpo -c bfb_io.c -o bfb_io.o >/dev/null 2>&1 mv -f .deps/bfb_io.Tpo .deps/bfb_io.Plo make[2]: Leaving directory '/tmp/B.31rg53yw/BUILD/obexftp-0.23/bfb' make[2]: Entering directory '/tmp/B.31rg53yw/BUILD/obexftp-0.23/bfb' /bin/sh ../libtool --tag=CC --mode=compile i686-pld-linux-gcc -DHAVE_CONFIG_H -I. -I.. -I../includes -O2 -fwrapv -pipe -Wformat -Werror=format-security -gdwarf-4 -fno-debug-types-section -fvar-tracking-assignments -g2 -Wp,-D_FORTIFY_SOURCE=2 -fstack-protector-strong --param=ssp-buffer-size=4 -Werror=trampolines -fomit-frame-pointer -march=i686 -fasynchronous-unwind-tables -mtune=pentium4 -gdwarf-4 -fno-debug-types-section -fvar-tracking-assignments -g2 -W -Wundef -Wmissing-declarations -Wmissing-prototypes -Wall -MT bfb.lo -MD -MP -MF .deps/bfb.Tpo -c -o bfb.lo bfb.c libtool: compile: i686-pld-linux-gcc -DHAVE_CONFIG_H -I. -I.. -I../includes -O2 -fwrapv -pipe -Wformat -Werror=format-security -gdwarf-4 -fno-debug-types-section -fvar-tracking-assignments -g2 -Wp,-D_FORTIFY_SOURCE=2 -fstack-protector-strong --param=ssp-buffer-size=4 -Werror=trampolines -fomit-frame-pointer -march=i686 -fasynchronous-unwind-tables -mtune=pentium4 -gdwarf-4 -fno-debug-types-section -fvar-tracking-assignments -g2 -W -Wundef -Wmissing-declarations -Wmissing-prototypes -Wall -MT bfb.lo -MD -MP -MF .deps/bfb.Tpo -c bfb.c -fPIC -DPIC -o .libs/bfb.o libtool: compile: i686-pld-linux-gcc -DHAVE_CONFIG_H -I. -I.. -I../includes -O2 -fwrapv -pipe -Wformat -Werror=format-security -gdwarf-4 -fno-debug-types-section -fvar-tracking-assignments -g2 -Wp,-D_FORTIFY_SOURCE=2 -fstack-protector-strong --param=ssp-buffer-size=4 -Werror=trampolines -fomit-frame-pointer -march=i686 -fasynchronous-unwind-tables -mtune=pentium4 -gdwarf-4 -fno-debug-types-section -fvar-tracking-assignments -g2 -W -Wundef -Wmissing-declarations -Wmissing-prototypes -Wall -MT bfb.lo -MD -MP -MF .deps/bfb.Tpo -c bfb.c -o bfb.o >/dev/null 2>&1 mv -f .deps/bfb.Tpo .deps/bfb.Plo make[2]: Leaving directory '/tmp/B.31rg53yw/BUILD/obexftp-0.23/bfb' make[2]: Entering directory '/tmp/B.31rg53yw/BUILD/obexftp-0.23/bfb' /bin/sh ../libtool --tag=CC --mode=link i686-pld-linux-gcc -I../includes -O2 -fwrapv -pipe -Wformat -Werror=format-security -gdwarf-4 -fno-debug-types-section -fvar-tracking-assignments -g2 -Wp,-D_FORTIFY_SOURCE=2 -fstack-protector-strong --param=ssp-buffer-size=4 -Werror=trampolines -fomit-frame-pointer -march=i686 -fasynchronous-unwind-tables -mtune=pentium4 -gdwarf-4 -fno-debug-types-section -fvar-tracking-assignments -g2 -W -Wundef -Wmissing-declarations -Wmissing-prototypes -Wall -no-undefined -version-info 0\:5\:0 -Wl,--as-needed -Wl,--no-copy-dt-needed-entries -Wl,-z,relro -Wl,-z,combreloc -o libbfb.la -rpath /usr/lib bfb.lo crc.lo bfb_io.lo libtool: link: i686-pld-linux-gcc -shared -fPIC -DPIC -O2 -gdwarf-4 -g2 -fstack-protector-strong -march=i686 -mtune=pentium4 -gdwarf-4 -g2 -Wl,--as-needed -Wl,--no-copy-dt-needed-entries -Wl,-z -Wl,relro -Wl,-z -Wl,combreloc .libs/bfb.o .libs/crc.o .libs/bfb_io.o -Wl,-soname -Wl,libbfb.so.0 -o .libs/libbfb.so.0.0.5 libtool: link: (cd ".libs" && rm -f "libbfb.so.0" && ln -s "libbfb.so.0.0.5" "libbfb.so.0") libtool: link: (cd ".libs" && rm -f "libbfb.so" && ln -s "libbfb.so.0.0.5" "libbfb.so") libtool: link: ar cr .libs/libbfb.a bfb.o crc.o bfb_io.o libtool: link: ranlib .libs/libbfb.a libtool: link: ( cd ".libs" && rm -f "libbfb.la" && ln -s "../libbfb.la" "libbfb.la" ) make[2]: Leaving directory '/tmp/B.31rg53yw/BUILD/obexftp-0.23/bfb' Making all in multicobex make[2]: Entering directory '/tmp/B.31rg53yw/BUILD/obexftp-0.23/multicobex' /bin/sh ../libtool --tag=CC --mode=compile i686-pld-linux-gcc -DHAVE_CONFIG_H -I. -I.. -I/usr/include/openobex -I.. -I../includes -O2 -fwrapv -pipe -Wformat -Werror=format-security -gdwarf-4 -fno-debug-types-section -fvar-tracking-assignments -g2 -Wp,-D_FORTIFY_SOURCE=2 -fstack-protector-strong --param=ssp-buffer-size=4 -Werror=trampolines -fomit-frame-pointer -march=i686 -fasynchronous-unwind-tables -mtune=pentium4 -gdwarf-4 -fno-debug-types-section -fvar-tracking-assignments -g2 -W -Wundef -Wmissing-declarations -Wmissing-prototypes -Wall -MT multi_cobex.lo -MD -MP -MF .deps/multi_cobex.Tpo -c -o multi_cobex.lo multi_cobex.c libtool: compile: i686-pld-linux-gcc -DHAVE_CONFIG_H -I. -I.. -I/usr/include/openobex -I.. -I../includes -O2 -fwrapv -pipe -Wformat -Werror=format-security -gdwarf-4 -fno-debug-types-section -fvar-tracking-assignments -g2 -Wp,-D_FORTIFY_SOURCE=2 -fstack-protector-strong --param=ssp-buffer-size=4 -Werror=trampolines -fomit-frame-pointer -march=i686 -fasynchronous-unwind-tables -mtune=pentium4 -gdwarf-4 -fno-debug-types-section -fvar-tracking-assignments -g2 -W -Wundef -Wmissing-declarations -Wmissing-prototypes -Wall -MT multi_cobex.lo -MD -MP -MF .deps/multi_cobex.Tpo -c multi_cobex.c -fPIC -DPIC -o .libs/multi_cobex.o In file included from multi_cobex_private.h:26, from multi_cobex.c:54: multi_cobex.c: In function 'cobex_cleanup': multi_cobex.c:74:37: warning: pointer targets in passing argument 3 of 'bfb_write_packets' differ in signedness [-Wpointer-sign] 74 | bfb_write_at(c->fd, "AT^SBFB=0\r"); | ^~~~~~~~~~~~~ | | | char * ../bfb/bfb.h:93:45: note: in definition of macro 'bfb_write_at' 93 | bfb_write_packets(fd, BFB_FRAME_AT, data, strlen(data)) | ^~~~ ../bfb/bfb.h:90:59: note: expected 'uint8_t *' {aka 'unsigned char *'} but argument is of type 'char *' 90 | int bfb_write_packets(fd_t fd, uint8_t type, uint8_t *buffer, int length); | ~~~~~~~~~^~~~~~ multi_cobex.c:76:37: warning: pointer targets in passing argument 2 of 'bfb_io_write' differ in signedness [-Wpointer-sign] 76 | bfb_io_write(c->fd, "+++", 3); | ^~~~~ | | | char * In file included from multi_cobex.c:56: ../bfb/bfb_io.h:41:46: note: expected 'const uint8_t *' {aka 'const unsigned char *'} but argument is of type 'char *' 41 | int bfb_io_write(fd_t fd, const uint8_t *buffer, int length); | ~~~~~~~~~~~~~~~^~~~~~ multi_cobex.c:78:36: warning: pointer targets in passing argument 2 of 'bfb_io_write' differ in signedness [-Wpointer-sign] 78 | bfb_io_write(c->fd,"\r", 1); | ^~~~ | | | char * ../bfb/bfb_io.h:41:46: note: expected 'const uint8_t *' {aka 'const unsigned char *'} but argument is of type 'char *' 41 | int bfb_io_write(fd_t fd, const uint8_t *buffer, int length); | ~~~~~~~~~~~~~~~^~~~~~ libtool: compile: i686-pld-linux-gcc -DHAVE_CONFIG_H -I. -I.. -I/usr/include/openobex -I.. -I../includes -O2 -fwrapv -pipe -Wformat -Werror=format-security -gdwarf-4 -fno-debug-types-section -fvar-tracking-assignments -g2 -Wp,-D_FORTIFY_SOURCE=2 -fstack-protector-strong --param=ssp-buffer-size=4 -Werror=trampolines -fomit-frame-pointer -march=i686 -fasynchronous-unwind-tables -mtune=pentium4 -gdwarf-4 -fno-debug-types-section -fvar-tracking-assignments -g2 -W -Wundef -Wmissing-declarations -Wmissing-prototypes -Wall -MT multi_cobex.lo -MD -MP -MF .deps/multi_cobex.Tpo -c multi_cobex.c -o multi_cobex.o >/dev/null 2>&1 mv -f .deps/multi_cobex.Tpo .deps/multi_cobex.Plo make[2]: Leaving directory '/tmp/B.31rg53yw/BUILD/obexftp-0.23/multicobex' make[2]: Entering directory '/tmp/B.31rg53yw/BUILD/obexftp-0.23/multicobex' /bin/sh ../libtool --tag=CC --mode=link i686-pld-linux-gcc -I/usr/include/openobex -I.. -I../includes -O2 -fwrapv -pipe -Wformat -Werror=format-security -gdwarf-4 -fno-debug-types-section -fvar-tracking-assignments -g2 -Wp,-D_FORTIFY_SOURCE=2 -fstack-protector-strong --param=ssp-buffer-size=4 -Werror=trampolines -fomit-frame-pointer -march=i686 -fasynchronous-unwind-tables -mtune=pentium4 -gdwarf-4 -fno-debug-types-section -fvar-tracking-assignments -g2 -W -Wundef -Wmissing-declarations -Wmissing-prototypes -Wall -no-undefined -version-info 1\:1\:0 -Wl,--as-needed -Wl,--no-copy-dt-needed-entries -Wl,-z,relro -Wl,-z,combreloc -o libmulticobex.la -rpath /usr/lib multi_cobex.lo -lopenobex ../bfb/libbfb.la libtool: link: i686-pld-linux-gcc -shared -fPIC -DPIC -O2 -gdwarf-4 -g2 -fstack-protector-strong -march=i686 -mtune=pentium4 -gdwarf-4 -g2 -Wl,--as-needed -Wl,--no-copy-dt-needed-entries -Wl,-z -Wl,relro -Wl,-z -Wl,combreloc -pthread .libs/multi_cobex.o -Wl,-rpath -Wl,/tmp/B.31rg53yw/BUILD/obexftp-0.23/bfb/.libs /usr/lib/libopenobex.so -L/usr/lib /usr/lib/libusb.so /usr/lib/libusb-1.0.so -ludev ../bfb/.libs/libbfb.so -Wl,-soname -Wl,libmulticobex.so.1 -o .libs/libmulticobex.so.1.0.1 libtool: link: (cd ".libs" && rm -f "libmulticobex.so.1" && ln -s "libmulticobex.so.1.0.1" "libmulticobex.so.1") libtool: link: (cd ".libs" && rm -f "libmulticobex.so" && ln -s "libmulticobex.so.1.0.1" "libmulticobex.so") libtool: link: ar cr .libs/libmulticobex.a multi_cobex.o libtool: link: ranlib .libs/libmulticobex.a libtool: link: ( cd ".libs" && rm -f "libmulticobex.la" && ln -s "../libmulticobex.la" "libmulticobex.la" ) make[2]: Leaving directory '/tmp/B.31rg53yw/BUILD/obexftp-0.23/multicobex' Making all in obexftp make[2]: Entering directory '/tmp/B.31rg53yw/BUILD/obexftp-0.23/obexftp' /bin/sh ../libtool --tag=CC --mode=compile i686-pld-linux-gcc -DHAVE_CONFIG_H -I. -I.. -I/usr/include/openobex -I.. -I../includes -O2 -fwrapv -pipe -Wformat -Werror=format-security -gdwarf-4 -fno-debug-types-section -fvar-tracking-assignments -g2 -Wp,-D_FORTIFY_SOURCE=2 -fstack-protector-strong --param=ssp-buffer-size=4 -Werror=trampolines -fomit-frame-pointer -march=i686 -fasynchronous-unwind-tables -mtune=pentium4 -gdwarf-4 -fno-debug-types-section -fvar-tracking-assignments -g2 -W -Wundef -Wmissing-declarations -Wmissing-prototypes -Wall -MT unicode.lo -MD -MP -MF .deps/unicode.Tpo -c -o unicode.lo unicode.c libtool: compile: i686-pld-linux-gcc -DHAVE_CONFIG_H -I. -I.. -I/usr/include/openobex -I.. -I../includes -O2 -fwrapv -pipe -Wformat -Werror=format-security -gdwarf-4 -fno-debug-types-section -fvar-tracking-assignments -g2 -Wp,-D_FORTIFY_SOURCE=2 -fstack-protector-strong --param=ssp-buffer-size=4 -Werror=trampolines -fomit-frame-pointer -march=i686 -fasynchronous-unwind-tables -mtune=pentium4 -gdwarf-4 -fno-debug-types-section -fvar-tracking-assignments -g2 -W -Wundef -Wmissing-declarations -Wmissing-prototypes -Wall -MT unicode.lo -MD -MP -MF .deps/unicode.Tpo -c unicode.c -fPIC -DPIC -o .libs/unicode.o unicode.c: In function 'CharToUnicode': unicode.c:85:20: warning: initialization discards 'const' qualifier from pointer target type [-Wdiscarded-qualifiers] 85 | char *cc = c; | ^ unicode.c:86:21: warning: pointer targets in initialization of 'char *' from 'uint8_t *' {aka 'unsigned char *'} differ in signedness [-Wpointer-sign] 86 | char *ucc = uc; | ^~ unicode.c:106:12: warning: assignment discards 'const' qualifier from pointer target type [-Wdiscarded-qualifiers] 106 | cc = c; | ^ unicode.c:107:13: warning: pointer targets in assignment from 'uint8_t *' {aka 'unsigned char *'} to 'char *' differ in signedness [-Wpointer-sign] 107 | ucc = uc; | ^ unicode.c:120:12: warning: assignment discards 'const' qualifier from pointer target type [-Wdiscarded-qualifiers] 120 | cc = c; | ^ unicode.c:121:13: warning: pointer targets in assignment from 'uint8_t *' {aka 'unsigned char *'} to 'char *' differ in signedness [-Wpointer-sign] 121 | ucc = uc; | ^ unicode.c:83:13: warning: variable 'ret' set but not used [-Wunused-but-set-variable] 83 | int ret; | ^~~ unicode.c: In function 'UnicodeToChar': unicode.c:176:20: warning: pointer targets in initialization of 'char *' from 'uint8_t *' {aka 'unsigned char *'} differ in signedness [-Wpointer-sign] 176 | char *cc = c; | ^ unicode.c:177:21: warning: initialization discards 'const' qualifier from pointer target type [-Wdiscarded-qualifiers] 177 | char *ucc = uc; | ^~ unicode.c:174:13: warning: variable 'ret' set but not used [-Wunused-but-set-variable] 174 | int ret; | ^~~ unicode.c: In function 'Utf8ToChar': unicode.c:236:20: warning: pointer targets in initialization of 'char *' from 'uint8_t *' {aka 'unsigned char *'} differ in signedness [-Wpointer-sign] 236 | char *cc = c; | ^ unicode.c:237:21: warning: initialization discards 'const' qualifier from pointer target type [-Wdiscarded-qualifiers] 237 | char *ucc = uc; | ^~ unicode.c:234:13: warning: variable 'ret' set but not used [-Wunused-but-set-variable] 234 | int ret; | ^~~ libtool: compile: i686-pld-linux-gcc -DHAVE_CONFIG_H -I. -I.. -I/usr/include/openobex -I.. -I../includes -O2 -fwrapv -pipe -Wformat -Werror=format-security -gdwarf-4 -fno-debug-types-section -fvar-tracking-assignments -g2 -Wp,-D_FORTIFY_SOURCE=2 -fstack-protector-strong --param=ssp-buffer-size=4 -Werror=trampolines -fomit-frame-pointer -march=i686 -fasynchronous-unwind-tables -mtune=pentium4 -gdwarf-4 -fno-debug-types-section -fvar-tracking-assignments -g2 -W -Wundef -Wmissing-declarations -Wmissing-prototypes -Wall -MT unicode.lo -MD -MP -MF .deps/unicode.Tpo -c unicode.c -o unicode.o >/dev/null 2>&1 mv -f .deps/unicode.Tpo .deps/unicode.Plo make[2]: Leaving directory '/tmp/B.31rg53yw/BUILD/obexftp-0.23/obexftp' make[2]: Entering directory '/tmp/B.31rg53yw/BUILD/obexftp-0.23/obexftp' /bin/sh ../libtool --tag=CC --mode=compile i686-pld-linux-gcc -DHAVE_CONFIG_H -I. -I.. -I/usr/include/openobex -I.. -I../includes -O2 -fwrapv -pipe -Wformat -Werror=format-security -gdwarf-4 -fno-debug-types-section -fvar-tracking-assignments -g2 -Wp,-D_FORTIFY_SOURCE=2 -fstack-protector-strong --param=ssp-buffer-size=4 -Werror=trampolines -fomit-frame-pointer -march=i686 -fasynchronous-unwind-tables -mtune=pentium4 -gdwarf-4 -fno-debug-types-section -fvar-tracking-assignments -g2 -W -Wundef -Wmissing-declarations -Wmissing-prototypes -Wall -MT object.lo -MD -MP -MF .deps/object.Tpo -c -o object.lo object.c libtool: compile: i686-pld-linux-gcc -DHAVE_CONFIG_H -I. -I.. -I/usr/include/openobex -I.. -I../includes -O2 -fwrapv -pipe -Wformat -Werror=format-security -gdwarf-4 -fno-debug-types-section -fvar-tracking-assignments -g2 -Wp,-D_FORTIFY_SOURCE=2 -fstack-protector-strong --param=ssp-buffer-size=4 -Werror=trampolines -fomit-frame-pointer -march=i686 -fasynchronous-unwind-tables -mtune=pentium4 -gdwarf-4 -fno-debug-types-section -fvar-tracking-assignments -g2 -W -Wundef -Wmissing-declarations -Wmissing-prototypes -Wall -MT object.lo -MD -MP -MF .deps/object.Tpo -c object.c -fPIC -DPIC -o .libs/object.o libtool: compile: i686-pld-linux-gcc -DHAVE_CONFIG_H -I. -I.. -I/usr/include/openobex -I.. -I../includes -O2 -fwrapv -pipe -Wformat -Werror=format-security -gdwarf-4 -fno-debug-types-section -fvar-tracking-assignments -g2 -Wp,-D_FORTIFY_SOURCE=2 -fstack-protector-strong --param=ssp-buffer-size=4 -Werror=trampolines -fomit-frame-pointer -march=i686 -fasynchronous-unwind-tables -mtune=pentium4 -gdwarf-4 -fno-debug-types-section -fvar-tracking-assignments -g2 -W -Wundef -Wmissing-declarations -Wmissing-prototypes -Wall -MT object.lo -MD -MP -MF .deps/object.Tpo -c object.c -o object.o >/dev/null 2>&1 mv -f .deps/object.Tpo .deps/object.Plo make[2]: Leaving directory '/tmp/B.31rg53yw/BUILD/obexftp-0.23/obexftp' make[2]: Entering directory '/tmp/B.31rg53yw/BUILD/obexftp-0.23/obexftp' /bin/sh ../libtool --tag=CC --mode=compile i686-pld-linux-gcc -DHAVE_CONFIG_H -I. -I.. -I/usr/include/openobex -I.. -I../includes -O2 -fwrapv -pipe -Wformat -Werror=format-security -gdwarf-4 -fno-debug-types-section -fvar-tracking-assignments -g2 -Wp,-D_FORTIFY_SOURCE=2 -fstack-protector-strong --param=ssp-buffer-size=4 -Werror=trampolines -fomit-frame-pointer -march=i686 -fasynchronous-unwind-tables -mtune=pentium4 -gdwarf-4 -fno-debug-types-section -fvar-tracking-assignments -g2 -W -Wundef -Wmissing-declarations -Wmissing-prototypes -Wall -MT obexftp_io.lo -MD -MP -MF .deps/obexftp_io.Tpo -c -o obexftp_io.lo obexftp_io.c libtool: compile: i686-pld-linux-gcc -DHAVE_CONFIG_H -I. -I.. -I/usr/include/openobex -I.. -I../includes -O2 -fwrapv -pipe -Wformat -Werror=format-security -gdwarf-4 -fno-debug-types-section -fvar-tracking-assignments -g2 -Wp,-D_FORTIFY_SOURCE=2 -fstack-protector-strong --param=ssp-buffer-size=4 -Werror=trampolines -fomit-frame-pointer -march=i686 -fasynchronous-unwind-tables -mtune=pentium4 -gdwarf-4 -fno-debug-types-section -fvar-tracking-assignments -g2 -W -Wundef -Wmissing-declarations -Wmissing-prototypes -Wall -MT obexftp_io.lo -MD -MP -MF .deps/obexftp_io.Tpo -c obexftp_io.c -fPIC -DPIC -o .libs/obexftp_io.o libtool: compile: i686-pld-linux-gcc -DHAVE_CONFIG_H -I. -I.. -I/usr/include/openobex -I.. -I../includes -O2 -fwrapv -pipe -Wformat -Werror=format-security -gdwarf-4 -fno-debug-types-section -fvar-tracking-assignments -g2 -Wp,-D_FORTIFY_SOURCE=2 -fstack-protector-strong --param=ssp-buffer-size=4 -Werror=trampolines -fomit-frame-pointer -march=i686 -fasynchronous-unwind-tables -mtune=pentium4 -gdwarf-4 -fno-debug-types-section -fvar-tracking-assignments -g2 -W -Wundef -Wmissing-declarations -Wmissing-prototypes -Wall -MT obexftp_io.lo -MD -MP -MF .deps/obexftp_io.Tpo -c obexftp_io.c -o obexftp_io.o >/dev/null 2>&1 mv -f .deps/obexftp_io.Tpo .deps/obexftp_io.Plo make[2]: Leaving directory '/tmp/B.31rg53yw/BUILD/obexftp-0.23/obexftp' make[2]: Entering directory '/tmp/B.31rg53yw/BUILD/obexftp-0.23/obexftp' /bin/sh ../libtool --tag=CC --mode=compile i686-pld-linux-gcc -DHAVE_CONFIG_H -I. -I.. -I/usr/include/openobex -I.. -I../includes -O2 -fwrapv -pipe -Wformat -Werror=format-security -gdwarf-4 -fno-debug-types-section -fvar-tracking-assignments -g2 -Wp,-D_FORTIFY_SOURCE=2 -fstack-protector-strong --param=ssp-buffer-size=4 -Werror=trampolines -fomit-frame-pointer -march=i686 -fasynchronous-unwind-tables -mtune=pentium4 -gdwarf-4 -fno-debug-types-section -fvar-tracking-assignments -g2 -W -Wundef -Wmissing-declarations -Wmissing-prototypes -Wall -MT bt_kit.lo -MD -MP -MF .deps/bt_kit.Tpo -c -o bt_kit.lo bt_kit.c libtool: compile: i686-pld-linux-gcc -DHAVE_CONFIG_H -I. -I.. -I/usr/include/openobex -I.. -I../includes -O2 -fwrapv -pipe -Wformat -Werror=format-security -gdwarf-4 -fno-debug-types-section -fvar-tracking-assignments -g2 -Wp,-D_FORTIFY_SOURCE=2 -fstack-protector-strong --param=ssp-buffer-size=4 -Werror=trampolines -fomit-frame-pointer -march=i686 -fasynchronous-unwind-tables -mtune=pentium4 -gdwarf-4 -fno-debug-types-section -fvar-tracking-assignments -g2 -W -Wundef -Wmissing-declarations -Wmissing-prototypes -Wall -MT bt_kit.lo -MD -MP -MF .deps/bt_kit.Tpo -c bt_kit.c -fPIC -DPIC -o .libs/bt_kit.o bt_kit.c:63:5: warning: no previous prototype for 'btkit_init' [-Wmissing-prototypes] 63 | int btkit_init() | ^~~~~~~~~~ bt_kit.c:88:5: warning: no previous prototype for 'btkit_exit' [-Wmissing-prototypes] 88 | int btkit_exit() | ^~~~~~~~~~ bt_kit.c: In function 'btkit_browse': bt_kit.c:441:13: warning: variable 'dev_id' set but not used [-Wunused-but-set-variable] 441 | int dev_id; | ^~~~~~ bt_kit.c: In function 'btkit_unregister_service': bt_kit.c:544:1: warning: control reaches end of non-void function [-Wreturn-type] 544 | } | ^ libtool: compile: i686-pld-linux-gcc -DHAVE_CONFIG_H -I. -I.. -I/usr/include/openobex -I.. -I../includes -O2 -fwrapv -pipe -Wformat -Werror=format-security -gdwarf-4 -fno-debug-types-section -fvar-tracking-assignments -g2 -Wp,-D_FORTIFY_SOURCE=2 -fstack-protector-strong --param=ssp-buffer-size=4 -Werror=trampolines -fomit-frame-pointer -march=i686 -fasynchronous-unwind-tables -mtune=pentium4 -gdwarf-4 -fno-debug-types-section -fvar-tracking-assignments -g2 -W -Wundef -Wmissing-declarations -Wmissing-prototypes -Wall -MT bt_kit.lo -MD -MP -MF .deps/bt_kit.Tpo -c bt_kit.c -o bt_kit.o >/dev/null 2>&1 mv -f .deps/bt_kit.Tpo .deps/bt_kit.Plo make[2]: Leaving directory '/tmp/B.31rg53yw/BUILD/obexftp-0.23/obexftp' make[2]: Entering directory '/tmp/B.31rg53yw/BUILD/obexftp-0.23/obexftp' /bin/sh ../libtool --tag=CC --mode=compile i686-pld-linux-gcc -DHAVE_CONFIG_H -I. -I.. -I/usr/include/openobex -I.. -I../includes -O2 -fwrapv -pipe -Wformat -Werror=format-security -gdwarf-4 -fno-debug-types-section -fvar-tracking-assignments -g2 -Wp,-D_FORTIFY_SOURCE=2 -fstack-protector-strong --param=ssp-buffer-size=4 -Werror=trampolines -fomit-frame-pointer -march=i686 -fasynchronous-unwind-tables -mtune=pentium4 -gdwarf-4 -fno-debug-types-section -fvar-tracking-assignments -g2 -W -Wundef -Wmissing-declarations -Wmissing-prototypes -Wall -MT cache.lo -MD -MP -MF .deps/cache.Tpo -c -o cache.lo cache.c libtool: compile: i686-pld-linux-gcc -DHAVE_CONFIG_H -I. -I.. -I/usr/include/openobex -I.. -I../includes -O2 -fwrapv -pipe -Wformat -Werror=format-security -gdwarf-4 -fno-debug-types-section -fvar-tracking-assignments -g2 -Wp,-D_FORTIFY_SOURCE=2 -fstack-protector-strong --param=ssp-buffer-size=4 -Werror=trampolines -fomit-frame-pointer -march=i686 -fasynchronous-unwind-tables -mtune=pentium4 -gdwarf-4 -fno-debug-types-section -fvar-tracking-assignments -g2 -W -Wundef -Wmissing-declarations -Wmissing-prototypes -Wall -MT cache.lo -MD -MP -MF .deps/cache.Tpo -c cache.c -fPIC -DPIC -o .libs/cache.o cache.c: In function 'obexftp_cache_list': cache.c:214:29: warning: pointer targets in passing argument 1 of 'strdup' differ in signedness [-Wpointer-sign] 214 | listing = strdup(cli->buf_data); | ~~~^~~~~~~~~~ | | | uint8_t * {aka unsigned char *} In file included from cache.c:30: /usr/include/string.h:187:34: note: expected 'const char *' but argument is of type 'uint8_t *' {aka 'unsigned char *'} 187 | extern char *strdup (const char *__s) | ~~~~~~~~~~~~^~~ cache.c: In function 'parse_directory': cache.c:265:26: warning: pointer targets in passing argument 1 of 'Utf8ToChar' differ in signedness [-Wpointer-sign] 265 | ret = Utf8ToChar(xml_conv, xml, n); | ^~~~~~~~ | | | char * In file included from cache.c:44: unicode.h:33:25: note: expected 'uint8_t *' {aka 'unsigned char *'} but argument is of type 'char *' 33 | int Utf8ToChar(uint8_t *c, const uint8_t *uc, int size); | ~~~~~~~~~^ cache.c:265:36: warning: pointer targets in passing argument 2 of 'Utf8ToChar' differ in signedness [-Wpointer-sign] 265 | ret = Utf8ToChar(xml_conv, xml, n); | ^~~ | | | char * unicode.h:33:43: note: expected 'const uint8_t *' {aka 'const unsigned char *'} but argument is of type 'char *' 33 | int Utf8ToChar(uint8_t *c, const uint8_t *uc, int size); | ~~~~~~~~~~~~~~~^~ cache.c:323:22: warning: writing 1 byte into a region of size 0 [-Wstringop-overflow=] 323 | dir->name[0] = '\0'; | ~~~~~~~~~~~~~^~~~~~ cache.c:277:27: note: destination object of size 0 allocated by 'calloc' 277 | dir_start = dir = calloc(i, sizeof(stat_entry_t)); | ^~~~~~~~~~~~~~~~~~~~~~~~~~~~~~~ libtool: compile: i686-pld-linux-gcc -DHAVE_CONFIG_H -I. -I.. -I/usr/include/openobex -I.. -I../includes -O2 -fwrapv -pipe -Wformat -Werror=format-security -gdwarf-4 -fno-debug-types-section -fvar-tracking-assignments -g2 -Wp,-D_FORTIFY_SOURCE=2 -fstack-protector-strong --param=ssp-buffer-size=4 -Werror=trampolines -fomit-frame-pointer -march=i686 -fasynchronous-unwind-tables -mtune=pentium4 -gdwarf-4 -fno-debug-types-section -fvar-tracking-assignments -g2 -W -Wundef -Wmissing-declarations -Wmissing-prototypes -Wall -MT cache.lo -MD -MP -MF .deps/cache.Tpo -c cache.c -o cache.o >/dev/null 2>&1 mv -f .deps/cache.Tpo .deps/cache.Plo make[2]: Leaving directory '/tmp/B.31rg53yw/BUILD/obexftp-0.23/obexftp' make[2]: Entering directory '/tmp/B.31rg53yw/BUILD/obexftp-0.23/obexftp' /bin/sh ../libtool --tag=CC --mode=compile i686-pld-linux-gcc -DHAVE_CONFIG_H -I. -I.. -I/usr/include/openobex -I.. -I../includes -O2 -fwrapv -pipe -Wformat -Werror=format-security -gdwarf-4 -fno-debug-types-section -fvar-tracking-assignments -g2 -Wp,-D_FORTIFY_SOURCE=2 -fstack-protector-strong --param=ssp-buffer-size=4 -Werror=trampolines -fomit-frame-pointer -march=i686 -fasynchronous-unwind-tables -mtune=pentium4 -gdwarf-4 -fno-debug-types-section -fvar-tracking-assignments -g2 -W -Wundef -Wmissing-declarations -Wmissing-prototypes -Wall -MT client.lo -MD -MP -MF .deps/client.Tpo -c -o client.lo client.c libtool: compile: i686-pld-linux-gcc -DHAVE_CONFIG_H -I. -I.. -I/usr/include/openobex -I.. -I../includes -O2 -fwrapv -pipe -Wformat -Werror=format-security -gdwarf-4 -fno-debug-types-section -fvar-tracking-assignments -g2 -Wp,-D_FORTIFY_SOURCE=2 -fstack-protector-strong --param=ssp-buffer-size=4 -Werror=trampolines -fomit-frame-pointer -march=i686 -fasynchronous-unwind-tables -mtune=pentium4 -gdwarf-4 -fno-debug-types-section -fvar-tracking-assignments -g2 -W -Wundef -Wmissing-declarations -Wmissing-prototypes -Wall -MT client.lo -MD -MP -MF .deps/client.Tpo -c client.c -fPIC -DPIC -o .libs/client.o client.c: In function 'client_done': client.c:306:56: warning: pointer targets in passing argument 2 of 'cli->infocb' differ in signedness [-Wpointer-sign] 306 | cli->infocb(OBEXFTP_EV_BODY, hv.bs, hlen, cli->infocb_data); | ~~^~~ | | | const uint8_t * {aka const unsigned char *} client.c:306:56: note: expected 'const char *' but argument is of type 'const uint8_t *' {aka 'const unsigned char *'} client.c: In function 'obexftp_connect_service': client.c:572:22: warning: assignment discards 'const' qualifier from pointer target type [-Wdiscarded-qualifiers] 572 | uuid = UUID_FBS; | ^ client.c:576:22: warning: assignment discards 'const' qualifier from pointer target type [-Wdiscarded-qualifiers] 576 | uuid = UUID_IRMC; | ^ client.c: In function 'obexftp_put_data': client.c:1174:23: warning: pointer targets in assignment from 'const char *' to 'const uint8_t *' {aka 'const unsigned char *'} differ in signedness [-Wpointer-sign] 1174 | cli->out_data = data; /* memcpy would be safer */ | ^ client.c: In function 'client_done': client.c:347:48: warning: ignoring return value of 'write' declared with attribute 'warn_unused_result' [-Wunused-result] 347 | (void) write(fd, body_data, body_len); | ^~~~~~~~~~~~~~~~~~~~~~~~~~~~~~ client.c: In function 'obexftp_connect_service': client.c:580:16: warning: dangling pointer 'uuid' to an unnamed temporary may be used [-Wdangling-pointer=] 580 | return obexftp_connect_src(cli, src, device, port, uuid, uuid_len); | ^~~~~~~~~~~~~~~~~~~~~~~~~~~~~~~~~~~~~~~~~~~~~~~~~~~~~~~~~~~ In file included from client.h:34, from client.c:62: uuid.h:39:1: note: unnamed temporary defined here 39 | { 'I', 'R', 'M', 'C', '-', 'S', 'Y', 'N', 'C' } | ^ uuid.h:41:39: note: in expansion of macro '__UUID_IRMC_bytes' 41 | #define UUID_IRMC ((const uint8_t []) __UUID_IRMC_bytes) | ^~~~~~~~~~~~~~~~~ client.c:576:24: note: in expansion of macro 'UUID_IRMC' 576 | uuid = UUID_IRMC; | ^~~~~~~~~ client.c:580:16: warning: dangling pointer 'uuid' to an unnamed temporary may be used [-Wdangling-pointer=] 580 | return obexftp_connect_src(cli, src, device, port, uuid, uuid_len); | ^~~~~~~~~~~~~~~~~~~~~~~~~~~~~~~~~~~~~~~~~~~~~~~~~~~~~~~~~~~ uuid.h:39:1: note: unnamed temporary defined here 39 | { 'I', 'R', 'M', 'C', '-', 'S', 'Y', 'N', 'C' } | ^ uuid.h:41:39: note: in expansion of macro '__UUID_IRMC_bytes' 41 | #define UUID_IRMC ((const uint8_t []) __UUID_IRMC_bytes) | ^~~~~~~~~~~~~~~~~ client.c:576:24: note: in expansion of macro 'UUID_IRMC' 576 | uuid = UUID_IRMC; | ^~~~~~~~~ libtool: compile: i686-pld-linux-gcc -DHAVE_CONFIG_H -I. -I.. -I/usr/include/openobex -I.. -I../includes -O2 -fwrapv -pipe -Wformat -Werror=format-security -gdwarf-4 -fno-debug-types-section -fvar-tracking-assignments -g2 -Wp,-D_FORTIFY_SOURCE=2 -fstack-protector-strong --param=ssp-buffer-size=4 -Werror=trampolines -fomit-frame-pointer -march=i686 -fasynchronous-unwind-tables -mtune=pentium4 -gdwarf-4 -fno-debug-types-section -fvar-tracking-assignments -g2 -W -Wundef -Wmissing-declarations -Wmissing-prototypes -Wall -MT client.lo -MD -MP -MF .deps/client.Tpo -c client.c -o client.o >/dev/null 2>&1 mv -f .deps/client.Tpo .deps/client.Plo make[2]: Leaving directory '/tmp/B.31rg53yw/BUILD/obexftp-0.23/obexftp' make[2]: Entering directory '/tmp/B.31rg53yw/BUILD/obexftp-0.23/obexftp' /bin/sh ../libtool --tag=CC --mode=link i686-pld-linux-gcc -I/usr/include/openobex -I.. -I../includes -O2 -fwrapv -pipe -Wformat -Werror=format-security -gdwarf-4 -fno-debug-types-section -fvar-tracking-assignments -g2 -Wp,-D_FORTIFY_SOURCE=2 -fstack-protector-strong --param=ssp-buffer-size=4 -Werror=trampolines -fomit-frame-pointer -march=i686 -fasynchronous-unwind-tables -mtune=pentium4 -gdwarf-4 -fno-debug-types-section -fvar-tracking-assignments -g2 -W -Wundef -Wmissing-declarations -Wmissing-prototypes -Wall -no-undefined -version-info 3\:0\:3 -Wl,--as-needed -Wl,--no-copy-dt-needed-entries -Wl,-z,relro -Wl,-z,combreloc -o libobexftp.la -rpath /usr/lib object.lo client.lo obexftp_io.lo cache.lo unicode.lo bt_kit.lo ../multicobex/libmulticobex.la ../bfb/libbfb.la -lopenobex -lbluetooth libtool: link: i686-pld-linux-gcc -shared -fPIC -DPIC -O2 -gdwarf-4 -g2 -fstack-protector-strong -march=i686 -mtune=pentium4 -gdwarf-4 -g2 -Wl,--as-needed -Wl,--no-copy-dt-needed-entries -Wl,-z -Wl,relro -Wl,-z -Wl,combreloc -pthread .libs/object.o .libs/client.o .libs/obexftp_io.o .libs/cache.o .libs/unicode.o .libs/bt_kit.o -Wl,-rpath -Wl,/tmp/B.31rg53yw/BUILD/obexftp-0.23/multicobex/.libs -Wl,-rpath -Wl,/tmp/B.31rg53yw/BUILD/obexftp-0.23/bfb/.libs -L/tmp/B.31rg53yw/BUILD/obexftp-0.23/bfb/.libs ../multicobex/.libs/libmulticobex.so -L/usr/lib -ldl /tmp/B.31rg53yw/BUILD/obexftp-0.23/bfb/.libs/libbfb.so ../bfb/.libs/libbfb.so /usr/lib/libopenobex.so /usr/lib/libusb.so /usr/lib/libusb-1.0.so -ludev -lbluetooth -Wl,-soname -Wl,libobexftp.so.0 -o .libs/libobexftp.so.0.3.0 libtool: link: (cd ".libs" && rm -f "libobexftp.so.0" && ln -s "libobexftp.so.0.3.0" "libobexftp.so.0") libtool: link: (cd ".libs" && rm -f "libobexftp.so" && ln -s "libobexftp.so.0.3.0" "libobexftp.so") libtool: link: ar cr .libs/libobexftp.a object.o client.o obexftp_io.o cache.o unicode.o bt_kit.o libtool: link: ranlib .libs/libobexftp.a libtool: link: ( cd ".libs" && rm -f "libobexftp.la" && ln -s "../libobexftp.la" "libobexftp.la" ) make[2]: Leaving directory '/tmp/B.31rg53yw/BUILD/obexftp-0.23/obexftp' Making all in apps make[2]: Entering directory '/tmp/B.31rg53yw/BUILD/obexftp-0.23/apps' i686-pld-linux-gcc -DHAVE_CONFIG_H -I. -I.. -I/usr/include/openobex -I.. -I../includes -O2 -fwrapv -pipe -Wformat -Werror=format-security -gdwarf-4 -fno-debug-types-section -fvar-tracking-assignments -g2 -Wp,-D_FORTIFY_SOURCE=2 -fstack-protector-strong --param=ssp-buffer-size=4 -Werror=trampolines -fomit-frame-pointer -march=i686 -fasynchronous-unwind-tables -mtune=pentium4 -gdwarf-4 -fno-debug-types-section -fvar-tracking-assignments -g2 -W -Wundef -Wmissing-declarations -Wmissing-prototypes -Wall -MT discovery.o -MD -MP -MF .deps/discovery.Tpo -c -o discovery.o discovery.c discovery.c: In function 'probe_tty': discovery.c:274:45: warning: pointer targets in passing argument 3 of 'do_at_cmd' differ in signedness [-Wpointer-sign] 274 | if(do_at_cmd(ttyfd, "AT\r", rspbuf, sizeof(rspbuf)) < 0) { | ^~~~~~ | | | uint8_t * {aka unsigned char *} discovery.c:86:54: note: expected 'char *' but argument is of type 'uint8_t *' {aka 'unsigned char *'} 86 | static int do_at_cmd(fd_t fd, const char *cmd, char *rspbuf, int rspbuflen) | ~~~~~~^~~~~~ discovery.c:277:42: warning: pointer targets in passing argument 2 of 'strcasecmp' differ in signedness [-Wpointer-sign] 277 | else if(strcasecmp("OK", rspbuf) == 0) { | ^~~~~~ | | | uint8_t * {aka unsigned char *} In file included from /usr/include/string.h:462, from discovery.c:26: /usr/include/strings.h:116:54: note: expected 'const char *' but argument is of type 'uint8_t *' {aka 'unsigned char *'} 116 | extern int strcasecmp (const char *__s1, const char *__s2) | ~~~~~~~~~~~~^~~~ discovery.c:292:41: warning: pointer targets in passing argument 3 of 'do_at_cmd' differ in signedness [-Wpointer-sign] 292 | if(do_at_cmd(ttyfd, "AT+GMI\r", rspbuf, sizeof(rspbuf)) < 0) { | ^~~~~~ | | | uint8_t * {aka unsigned char *} discovery.c:86:54: note: expected 'char *' but argument is of type 'uint8_t *' {aka 'unsigned char *'} 86 | static int do_at_cmd(fd_t fd, const char *cmd, char *rspbuf, int rspbuflen) | ~~~~~~^~~~~~ discovery.c:298:23: warning: pointer targets in passing argument 1 of 'strchr' differ in signedness [-Wpointer-sign] 298 | if ((p=strchr(rspbuf, '\r')) != NULL) *p = 0; | ^~~~~~ | | | uint8_t * {aka unsigned char *} /usr/include/string.h:246:34: note: expected 'const char *' but argument is of type 'uint8_t *' {aka 'unsigned char *'} 246 | extern char *strchr (const char *__s, int __c) | ~~~~~~~~~~~~^~~ discovery.c:299:23: warning: pointer targets in passing argument 1 of 'strchr' differ in signedness [-Wpointer-sign] 299 | if ((p=strchr(rspbuf, '\n')) != NULL) *p = 0; | ^~~~~~ | | | uint8_t * {aka unsigned char *} /usr/include/string.h:246:34: note: expected 'const char *' but argument is of type 'uint8_t *' {aka 'unsigned char *'} 246 | extern char *strchr (const char *__s, int __c) | ~~~~~~~~~~~~^~~ discovery.c:300:28: warning: pointer targets in passing argument 1 of 'strdup' differ in signedness [-Wpointer-sign] 300 | info->gmi = strdup(rspbuf); | ^~~~~~ | | | uint8_t * {aka unsigned char *} /usr/include/string.h:187:34: note: expected 'const char *' but argument is of type 'uint8_t *' {aka 'unsigned char *'} 187 | extern char *strdup (const char *__s) | ~~~~~~~~~~~~^~~ discovery.c:302:41: warning: pointer targets in passing argument 3 of 'do_at_cmd' differ in signedness [-Wpointer-sign] 302 | if(do_at_cmd(ttyfd, "AT+GMM\r", rspbuf, sizeof(rspbuf)) < 0) { | ^~~~~~ | | | uint8_t * {aka unsigned char *} discovery.c:86:54: note: expected 'char *' but argument is of type 'uint8_t *' {aka 'unsigned char *'} 86 | static int do_at_cmd(fd_t fd, const char *cmd, char *rspbuf, int rspbuflen) | ~~~~~~^~~~~~ discovery.c:308:23: warning: pointer targets in passing argument 1 of 'strchr' differ in signedness [-Wpointer-sign] 308 | if ((p=strchr(rspbuf, '\r')) != NULL) *p = 0; | ^~~~~~ | | | uint8_t * {aka unsigned char *} /usr/include/string.h:246:34: note: expected 'const char *' but argument is of type 'uint8_t *' {aka 'unsigned char *'} 246 | extern char *strchr (const char *__s, int __c) | ~~~~~~~~~~~~^~~ discovery.c:309:23: warning: pointer targets in passing argument 1 of 'strchr' differ in signedness [-Wpointer-sign] 309 | if ((p=strchr(rspbuf, '\n')) != NULL) *p = 0; | ^~~~~~ | | | uint8_t * {aka unsigned char *} /usr/include/string.h:246:34: note: expected 'const char *' but argument is of type 'uint8_t *' {aka 'unsigned char *'} 246 | extern char *strchr (const char *__s, int __c) | ~~~~~~~~~~~~^~~ discovery.c:310:28: warning: pointer targets in passing argument 1 of 'strdup' differ in signedness [-Wpointer-sign] 310 | info->gmm = strdup(rspbuf); | ^~~~~~ | | | uint8_t * {aka unsigned char *} /usr/include/string.h:187:34: note: expected 'const char *' but argument is of type 'uint8_t *' {aka 'unsigned char *'} 187 | extern char *strdup (const char *__s) | ~~~~~~~~~~~~^~~ discovery.c:312:41: warning: pointer targets in passing argument 3 of 'do_at_cmd' differ in signedness [-Wpointer-sign] 312 | if(do_at_cmd(ttyfd, "AT+GMR\r", rspbuf, sizeof(rspbuf)) < 0) { | ^~~~~~ | | | uint8_t * {aka unsigned char *} discovery.c:86:54: note: expected 'char *' but argument is of type 'uint8_t *' {aka 'unsigned char *'} 86 | static int do_at_cmd(fd_t fd, const char *cmd, char *rspbuf, int rspbuflen) | ~~~~~~^~~~~~ discovery.c:318:23: warning: pointer targets in passing argument 1 of 'strchr' differ in signedness [-Wpointer-sign] 318 | if ((p=strchr(rspbuf, '\r')) != NULL) *p = 0; | ^~~~~~ | | | uint8_t * {aka unsigned char *} /usr/include/string.h:246:34: note: expected 'const char *' but argument is of type 'uint8_t *' {aka 'unsigned char *'} 246 | extern char *strchr (const char *__s, int __c) | ~~~~~~~~~~~~^~~ discovery.c:319:23: warning: pointer targets in passing argument 1 of 'strchr' differ in signedness [-Wpointer-sign] 319 | if ((p=strchr(rspbuf, '\n')) != NULL) *p = 0; | ^~~~~~ | | | uint8_t * {aka unsigned char *} /usr/include/string.h:246:34: note: expected 'const char *' but argument is of type 'uint8_t *' {aka 'unsigned char *'} 246 | extern char *strchr (const char *__s, int __c) | ~~~~~~~~~~~~^~~ discovery.c:320:27: warning: pointer targets in passing argument 1 of 'strdup' differ in signedness [-Wpointer-sign] 320 | info->gmr= strdup(rspbuf); | ^~~~~~ | | | uint8_t * {aka unsigned char *} /usr/include/string.h:187:34: note: expected 'const char *' but argument is of type 'uint8_t *' {aka 'unsigned char *'} 187 | extern char *strdup (const char *__s) | ~~~~~~~~~~~~^~~ discovery.c:322:42: warning: pointer targets in passing argument 3 of 'do_at_cmd' differ in signedness [-Wpointer-sign] 322 | if(do_at_cmd(ttyfd, "AT+CGMI\r", rspbuf, sizeof(rspbuf)) < 0) { | ^~~~~~ | | | uint8_t * {aka unsigned char *} discovery.c:86:54: note: expected 'char *' but argument is of type 'uint8_t *' {aka 'unsigned char *'} 86 | static int do_at_cmd(fd_t fd, const char *cmd, char *rspbuf, int rspbuflen) | ~~~~~~^~~~~~ discovery.c:328:23: warning: pointer targets in passing argument 1 of 'strchr' differ in signedness [-Wpointer-sign] 328 | if ((p=strchr(rspbuf, '\r')) != NULL) *p = 0; | ^~~~~~ | | | uint8_t * {aka unsigned char *} /usr/include/string.h:246:34: note: expected 'const char *' but argument is of type 'uint8_t *' {aka 'unsigned char *'} 246 | extern char *strchr (const char *__s, int __c) | ~~~~~~~~~~~~^~~ discovery.c:329:23: warning: pointer targets in passing argument 1 of 'strchr' differ in signedness [-Wpointer-sign] 329 | if ((p=strchr(rspbuf, '\n')) != NULL) *p = 0; | ^~~~~~ | | | uint8_t * {aka unsigned char *} /usr/include/string.h:246:34: note: expected 'const char *' but argument is of type 'uint8_t *' {aka 'unsigned char *'} 246 | extern char *strchr (const char *__s, int __c) | ~~~~~~~~~~~~^~~ discovery.c:330:29: warning: pointer targets in passing argument 1 of 'strdup' differ in signedness [-Wpointer-sign] 330 | info->cgmi = strdup(rspbuf); | ^~~~~~ | | | uint8_t * {aka unsigned char *} /usr/include/string.h:187:34: note: expected 'const char *' but argument is of type 'uint8_t *' {aka 'unsigned char *'} 187 | extern char *strdup (const char *__s) | ~~~~~~~~~~~~^~~ discovery.c:332:42: warning: pointer targets in passing argument 3 of 'do_at_cmd' differ in signedness [-Wpointer-sign] 332 | if(do_at_cmd(ttyfd, "AT+CGMM\r", rspbuf, sizeof(rspbuf)) < 0) { | ^~~~~~ | | | uint8_t * {aka unsigned char *} discovery.c:86:54: note: expected 'char *' but argument is of type 'uint8_t *' {aka 'unsigned char *'} 86 | static int do_at_cmd(fd_t fd, const char *cmd, char *rspbuf, int rspbuflen) | ~~~~~~^~~~~~ discovery.c:338:23: warning: pointer targets in passing argument 1 of 'strchr' differ in signedness [-Wpointer-sign] 338 | if ((p=strchr(rspbuf, '\r')) != NULL) *p = 0; | ^~~~~~ | | | uint8_t * {aka unsigned char *} /usr/include/string.h:246:34: note: expected 'const char *' but argument is of type 'uint8_t *' {aka 'unsigned char *'} 246 | extern char *strchr (const char *__s, int __c) | ~~~~~~~~~~~~^~~ discovery.c:339:23: warning: pointer targets in passing argument 1 of 'strchr' differ in signedness [-Wpointer-sign] 339 | if ((p=strchr(rspbuf, '\n')) != NULL) *p = 0; | ^~~~~~ | | | uint8_t * {aka unsigned char *} /usr/include/string.h:246:34: note: expected 'const char *' but argument is of type 'uint8_t *' {aka 'unsigned char *'} 246 | extern char *strchr (const char *__s, int __c) | ~~~~~~~~~~~~^~~ discovery.c:340:29: warning: pointer targets in passing argument 1 of 'strdup' differ in signedness [-Wpointer-sign] 340 | info->cgmm = strdup(rspbuf); | ^~~~~~ | | | uint8_t * {aka unsigned char *} /usr/include/string.h:187:34: note: expected 'const char *' but argument is of type 'uint8_t *' {aka 'unsigned char *'} 187 | extern char *strdup (const char *__s) | ~~~~~~~~~~~~^~~ discovery.c:342:42: warning: pointer targets in passing argument 3 of 'do_at_cmd' differ in signedness [-Wpointer-sign] 342 | if(do_at_cmd(ttyfd, "AT+CGMR\r", rspbuf, sizeof(rspbuf)) < 0) { | ^~~~~~ | | | uint8_t * {aka unsigned char *} discovery.c:86:54: note: expected 'char *' but argument is of type 'uint8_t *' {aka 'unsigned char *'} 86 | static int do_at_cmd(fd_t fd, const char *cmd, char *rspbuf, int rspbuflen) | ~~~~~~^~~~~~ discovery.c:348:23: warning: pointer targets in passing argument 1 of 'strchr' differ in signedness [-Wpointer-sign] 348 | if ((p=strchr(rspbuf, '\r')) != NULL) *p = 0; | ^~~~~~ | | | uint8_t * {aka unsigned char *} /usr/include/string.h:246:34: note: expected 'const char *' but argument is of type 'uint8_t *' {aka 'unsigned char *'} 246 | extern char *strchr (const char *__s, int __c) | ~~~~~~~~~~~~^~~ discovery.c:349:23: warning: pointer targets in passing argument 1 of 'strchr' differ in signedness [-Wpointer-sign] 349 | if ((p=strchr(rspbuf, '\n')) != NULL) *p = 0; | ^~~~~~ | | | uint8_t * {aka unsigned char *} /usr/include/string.h:246:34: note: expected 'const char *' but argument is of type 'uint8_t *' {aka 'unsigned char *'} 246 | extern char *strchr (const char *__s, int __c) | ~~~~~~~~~~~~^~~ discovery.c:350:28: warning: pointer targets in passing argument 1 of 'strdup' differ in signedness [-Wpointer-sign] 350 | info->cgmr= strdup(rspbuf); | ^~~~~~ | | | uint8_t * {aka unsigned char *} /usr/include/string.h:187:34: note: expected 'const char *' but argument is of type 'uint8_t *' {aka 'unsigned char *'} 187 | extern char *strdup (const char *__s) | ~~~~~~~~~~~~^~~ discovery.c: In function 'main': discovery.c:363:27: warning: the comparison will always evaluate as 'true' for the address of 'mobile_param' will never be NULL [-Waddress] 363 | if (mobile_param != NULL) { }; | ^~ discovery.c:48:28: note: 'mobile_param' declared here 48 | static struct mobile_param mobile_param[] = { | ^~~~~~~~~~~~ mv -f .deps/discovery.Tpo .deps/discovery.Po make[2]: Leaving directory '/tmp/B.31rg53yw/BUILD/obexftp-0.23/apps' make[2]: Entering directory '/tmp/B.31rg53yw/BUILD/obexftp-0.23/apps' i686-pld-linux-gcc -DHAVE_CONFIG_H -I. -I.. -I/usr/include/openobex -I.. -I../includes -O2 -fwrapv -pipe -Wformat -Werror=format-security -gdwarf-4 -fno-debug-types-section -fvar-tracking-assignments -g2 -Wp,-D_FORTIFY_SOURCE=2 -fstack-protector-strong --param=ssp-buffer-size=4 -Werror=trampolines -fomit-frame-pointer -march=i686 -fasynchronous-unwind-tables -mtune=pentium4 -gdwarf-4 -fno-debug-types-section -fvar-tracking-assignments -g2 -W -Wundef -Wmissing-declarations -Wmissing-prototypes -Wall -MT obexftp.o -MD -MP -MF .deps/obexftp.Tpo -c -o obexftp.o obexftp.c obexftp.c: In function 'cli_connect_uuid': obexftp.c:277:25: warning: implicit declaration of function 'times'; did you mean 'time'? [-Wimplicit-function-declaration] 277 | clock = times(NULL); | ^~~~~ | time obexftp.c:279:74: warning: pointer targets in passing argument 5 of 'obexftp_connect_src' differ in signedness [-Wpointer-sign] 279 | ret = obexftp_connect_src(cli, src_dev, device, channel, uuid, uuid_len); | ^~~~ | | | const char * In file included from obexftp.c:37: ../obexftp/client.h:129:58: note: expected 'const uint8_t *' {aka 'const unsigned char *'} but argument is of type 'const char *' 129 | /*@null@*/ const uint8_t uuid[], uint32_t uuid_len); | ~~~~~~~~~~~~~~^~~~~~ In file included from ../obexftp/client.h:34: obexftp.c: In function 'probe_device': ../obexftp/uuid.h:21:18: warning: pointer targets in passing argument 1 of 'probe_device_uuid' differ in signedness [-Wpointer-sign] 21 | #define UUID_FBS ((const uint8_t []) __UUID_FBS_bytes) | ^~~~~~~~~~~~~~~~~~~~~~~~~~~~~~~~~~~~~ | | | const uint8_t * {aka const unsigned char *} obexftp.c:425:27: note: in expansion of macro 'UUID_FBS' 425 | probe_device_uuid(UUID_FBS, sizeof(UUID_FBS)); | ^~~~~~~~ obexftp.c:346:43: note: expected 'const char *' but argument is of type 'const uint8_t *' {aka 'const unsigned char *'} 346 | static void probe_device_uuid(const char *uuid, int uuid_len) | ~~~~~~~~~~~~^~~~ ../obexftp/uuid.h:32:18: warning: pointer targets in passing argument 1 of 'probe_device_uuid' differ in signedness [-Wpointer-sign] 32 | #define UUID_S45 ((const uint8_t []) __UUID_S45_bytes) | ^~~~~~~~~~~~~~~~~~~~~~~~~~~~~~~~~~~~~ | | | const uint8_t * {aka const unsigned char *} obexftp.c:428:27: note: in expansion of macro 'UUID_S45' 428 | probe_device_uuid(UUID_S45, sizeof(UUID_S45)); | ^~~~~~~~ obexftp.c:346:43: note: expected 'const char *' but argument is of type 'const uint8_t *' {aka 'const unsigned char *'} 346 | static void probe_device_uuid(const char *uuid, int uuid_len) | ~~~~~~~~~~~~^~~~ obexftp.c: In function 'main': obexftp.c:578:25: warning: this statement may fall through [-Wimplicit-fallthrough=] 578 | fprintf(stderr,"Option -%c is deprecated, use -%c instead\n",'N','n'); | ^~~~~~~~~~~~~~~~~~~~~~~~~~~~~~~~~~~~~~~~~~~~~~~~~~~~~~~~~~~~~~~~~~~~~ obexftp.c:579:17: note: here 579 | case 'n': | ^~~~ obexftp.c:593:32: warning: this statement may fall through [-Wimplicit-fallthrough=] 593 | optarg = "none"; | ~~~~~~~^~~~~~~~ obexftp.c:594:17: note: here 594 | case 'U': | ^~~~ obexftp.c:712:25: warning: this statement may fall through [-Wimplicit-fallthrough=] 712 | fprintf(stderr,"Option -%c is deprecated, use -%c instead\n",'P','Y'); | ^~~~~~~~~~~~~~~~~~~~~~~~~~~~~~~~~~~~~~~~~~~~~~~~~~~~~~~~~~~~~~~~~~~~~ obexftp.c:713:17: note: here 713 | case 'Y': | ^~~~ obexftp.c: In function 'info_cb': obexftp.c:119:33: warning: ignoring return value of 'write' declared with attribute 'warn_unused_result' [-Wunused-result] 119 | write(STDOUT_FILENO, msg, len); | ^~~~~~~~~~~~~~~~~~~~~~~~~~~~~~ mv -f .deps/obexftp.Tpo .deps/obexftp.Po make[2]: Leaving directory '/tmp/B.31rg53yw/BUILD/obexftp-0.23/apps' make[2]: Entering directory '/tmp/B.31rg53yw/BUILD/obexftp-0.23/apps' i686-pld-linux-gcc -DHAVE_CONFIG_H -I. -I.. -I/usr/include/openobex -I.. -I../includes -O2 -fwrapv -pipe -Wformat -Werror=format-security -gdwarf-4 -fno-debug-types-section -fvar-tracking-assignments -g2 -Wp,-D_FORTIFY_SOURCE=2 -fstack-protector-strong --param=ssp-buffer-size=4 -Werror=trampolines -fomit-frame-pointer -march=i686 -fasynchronous-unwind-tables -mtune=pentium4 -gdwarf-4 -fno-debug-types-section -fvar-tracking-assignments -g2 -W -Wundef -Wmissing-declarations -Wmissing-prototypes -Wall -MT obexftpd.o -MD -MP -MF .deps/obexftpd.Tpo -c -o obexftpd.o obexftpd.c obexftpd.c: In function 'start_server': obexftpd.c:884:25: warning: implicit declaration of function 'BtOBEX_ServerRegister'; did you mean 'IrOBEX_ServerRegister'? [-Wimplicit-function-declaration] 884 | if (0 > BtOBEX_ServerRegister(handle, /*bdaddr_t *bt_src*/NULL, channel)) { | ^~~~~~~~~~~~~~~~~~~~~ | IrOBEX_ServerRegister obexftpd.c: In function 'main': obexftpd.c:985:25: warning: ignoring return value of 'chdir' declared with attribute 'warn_unused_result' [-Wunused-result] 985 | chdir(optarg); | ^~~~~~~~~~~~~ obexftpd.c: In function 'set_server_path': obexftpd.c:345:33: warning: ignoring return value of 'chdir' declared with attribute 'warn_unused_result' [-Wunused-result] 345 | chdir(init_work_path); | ^~~~~~~~~~~~~~~~~~~~~ obexftpd.c: In function 'get_server': obexftpd.c:454:25: warning: this statement may fall through [-Wimplicit-fallthrough=] 454 | printf("%s() type:%s\n", __FUNCTION__, type); | ^~~~~~~~~~~~~~~~~~~~~~~~~~~~~~~~~~~~~~~~~~~~ obexftpd.c:456:17: note: here 456 | case 0xbe: // user-defined inverse push | ^~~~ mv -f .deps/obexftpd.Tpo .deps/obexftpd.Po make[2]: Leaving directory '/tmp/B.31rg53yw/BUILD/obexftp-0.23/apps' make[2]: Entering directory '/tmp/B.31rg53yw/BUILD/obexftp-0.23/apps' /bin/sh ../libtool --tag=CC --mode=link i686-pld-linux-gcc -I/usr/include/openobex -I.. -I../includes -O2 -fwrapv -pipe -Wformat -Werror=format-security -gdwarf-4 -fno-debug-types-section -fvar-tracking-assignments -g2 -Wp,-D_FORTIFY_SOURCE=2 -fstack-protector-strong --param=ssp-buffer-size=4 -Werror=trampolines -fomit-frame-pointer -march=i686 -fasynchronous-unwind-tables -mtune=pentium4 -gdwarf-4 -fno-debug-types-section -fvar-tracking-assignments -g2 -W -Wundef -Wmissing-declarations -Wmissing-prototypes -Wall -Wl,--as-needed -Wl,--no-copy-dt-needed-entries -Wl,-z,relro -Wl,-z,combreloc -o discovery discovery.o ../obexftp/libobexftp.la ../multicobex/libmulticobex.la ../bfb/libbfb.la -lopenobex -lbluetooth libtool: link: i686-pld-linux-gcc -I/usr/include/openobex -I.. -I../includes -O2 -fwrapv -pipe -Wformat -Werror=format-security -gdwarf-4 -fno-debug-types-section -fvar-tracking-assignments -g2 -Wp,-D_FORTIFY_SOURCE=2 -fstack-protector-strong --param=ssp-buffer-size=4 -Werror=trampolines -fomit-frame-pointer -march=i686 -fasynchronous-unwind-tables -mtune=pentium4 -gdwarf-4 -fno-debug-types-section -fvar-tracking-assignments -g2 -W -Wundef -Wmissing-declarations -Wmissing-prototypes -Wall -Wl,--as-needed -Wl,--no-copy-dt-needed-entries -Wl,-z -Wl,relro -Wl,-z -Wl,combreloc -o .libs/discovery discovery.o ../obexftp/.libs/libobexftp.so /tmp/B.31rg53yw/BUILD/obexftp-0.23/multicobex/.libs/libmulticobex.so ../multicobex/.libs/libmulticobex.so /tmp/B.31rg53yw/BUILD/obexftp-0.23/bfb/.libs/libbfb.so ../bfb/.libs/libbfb.so /usr/lib/libopenobex.so /usr/lib/libusb.so -ldl /usr/lib/libusb-1.0.so -ludev -lbluetooth -pthread make[2]: Leaving directory '/tmp/B.31rg53yw/BUILD/obexftp-0.23/apps' make[2]: Entering directory '/tmp/B.31rg53yw/BUILD/obexftp-0.23/apps' /bin/sh ../libtool --tag=CC --mode=link i686-pld-linux-gcc -I/usr/include/openobex -I.. -I../includes -O2 -fwrapv -pipe -Wformat -Werror=format-security -gdwarf-4 -fno-debug-types-section -fvar-tracking-assignments -g2 -Wp,-D_FORTIFY_SOURCE=2 -fstack-protector-strong --param=ssp-buffer-size=4 -Werror=trampolines -fomit-frame-pointer -march=i686 -fasynchronous-unwind-tables -mtune=pentium4 -gdwarf-4 -fno-debug-types-section -fvar-tracking-assignments -g2 -W -Wundef -Wmissing-declarations -Wmissing-prototypes -Wall -Wl,--as-needed -Wl,--no-copy-dt-needed-entries -Wl,-z,relro -Wl,-z,combreloc -o obexftp obexftp.o ../obexftp/libobexftp.la ../multicobex/libmulticobex.la ../bfb/libbfb.la -lopenobex -lbluetooth libtool: link: i686-pld-linux-gcc -I/usr/include/openobex -I.. -I../includes -O2 -fwrapv -pipe -Wformat -Werror=format-security -gdwarf-4 -fno-debug-types-section -fvar-tracking-assignments -g2 -Wp,-D_FORTIFY_SOURCE=2 -fstack-protector-strong --param=ssp-buffer-size=4 -Werror=trampolines -fomit-frame-pointer -march=i686 -fasynchronous-unwind-tables -mtune=pentium4 -gdwarf-4 -fno-debug-types-section -fvar-tracking-assignments -g2 -W -Wundef -Wmissing-declarations -Wmissing-prototypes -Wall -Wl,--as-needed -Wl,--no-copy-dt-needed-entries -Wl,-z -Wl,relro -Wl,-z -Wl,combreloc -o .libs/obexftp obexftp.o ../obexftp/.libs/libobexftp.so /tmp/B.31rg53yw/BUILD/obexftp-0.23/multicobex/.libs/libmulticobex.so ../multicobex/.libs/libmulticobex.so /tmp/B.31rg53yw/BUILD/obexftp-0.23/bfb/.libs/libbfb.so ../bfb/.libs/libbfb.so /usr/lib/libopenobex.so /usr/lib/libusb.so -ldl /usr/lib/libusb-1.0.so -ludev -lbluetooth -pthread make[2]: Leaving directory '/tmp/B.31rg53yw/BUILD/obexftp-0.23/apps' make[2]: Entering directory '/tmp/B.31rg53yw/BUILD/obexftp-0.23/apps' /bin/sh ../libtool --tag=CC --mode=link i686-pld-linux-gcc -I/usr/include/openobex -I.. -I../includes -O2 -fwrapv -pipe -Wformat -Werror=format-security -gdwarf-4 -fno-debug-types-section -fvar-tracking-assignments -g2 -Wp,-D_FORTIFY_SOURCE=2 -fstack-protector-strong --param=ssp-buffer-size=4 -Werror=trampolines -fomit-frame-pointer -march=i686 -fasynchronous-unwind-tables -mtune=pentium4 -gdwarf-4 -fno-debug-types-section -fvar-tracking-assignments -g2 -W -Wundef -Wmissing-declarations -Wmissing-prototypes -Wall -Wl,--as-needed -Wl,--no-copy-dt-needed-entries -Wl,-z,relro -Wl,-z,combreloc -o obexftpd obexftpd.o ../obexftp/libobexftp.la ../multicobex/libmulticobex.la ../bfb/libbfb.la -lopenobex -lbluetooth libtool: link: i686-pld-linux-gcc -I/usr/include/openobex -I.. -I../includes -O2 -fwrapv -pipe -Wformat -Werror=format-security -gdwarf-4 -fno-debug-types-section -fvar-tracking-assignments -g2 -Wp,-D_FORTIFY_SOURCE=2 -fstack-protector-strong --param=ssp-buffer-size=4 -Werror=trampolines -fomit-frame-pointer -march=i686 -fasynchronous-unwind-tables -mtune=pentium4 -gdwarf-4 -fno-debug-types-section -fvar-tracking-assignments -g2 -W -Wundef -Wmissing-declarations -Wmissing-prototypes -Wall -Wl,--as-needed -Wl,--no-copy-dt-needed-entries -Wl,-z -Wl,relro -Wl,-z -Wl,combreloc -o .libs/obexftpd obexftpd.o ../obexftp/.libs/libobexftp.so /tmp/B.31rg53yw/BUILD/obexftp-0.23/multicobex/.libs/libmulticobex.so ../multicobex/.libs/libmulticobex.so /tmp/B.31rg53yw/BUILD/obexftp-0.23/bfb/.libs/libbfb.so ../bfb/.libs/libbfb.so /usr/lib/libopenobex.so /usr/lib/libusb.so -ldl /usr/lib/libusb-1.0.so -ludev -lbluetooth -pthread make[2]: Leaving directory '/tmp/B.31rg53yw/BUILD/obexftp-0.23/apps' Making all in doc make[2]: Nothing to be done for 'all'. Making all in examples make[2]: Nothing to be done for 'all'. Making all in swig Making all in perl make[3]: Entering directory '/tmp/B.31rg53yw/BUILD/obexftp-0.23/swig/perl' /usr/bin/perl Makefile.PL PREFIX=/usr MAKEFILE=Makefile.perl INSTALLDIRS=vendor Warning: -L../../obexftp/.libs changed to -L/tmp/B.31rg53yw/BUILD/obexftp-0.23/swig/perl/../../obexftp/.libs Warning: -L../../multicobex/.libs changed to -L/tmp/B.31rg53yw/BUILD/obexftp-0.23/swig/perl/../../multicobex/.libs Warning: -L../../bfb/.libs changed to -L/tmp/B.31rg53yw/BUILD/obexftp-0.23/swig/perl/../../bfb/.libs Generating a Unix-style Makefile.perl Writing Makefile.perl for OBEXFTP Writing MYMETA.yml and MYMETA.json make[3]: Leaving directory '/tmp/B.31rg53yw/BUILD/obexftp-0.23/swig/perl' make[3]: Entering directory '/tmp/B.31rg53yw/BUILD/obexftp-0.23/swig/perl' if test ! -f perl_wrap.c; then cp ./perl_wrap.c . ; fi make[3]: Leaving directory '/tmp/B.31rg53yw/BUILD/obexftp-0.23/swig/perl' /usr/bin/make -fMakefile.perl make[4]: Entering directory '/tmp/B.31rg53yw/BUILD/obexftp-0.23/swig/perl' Running Mkbootstrap for OBEXFTP () chmod 644 "OBEXFTP.bs" make[4]: Leaving directory '/tmp/B.31rg53yw/BUILD/obexftp-0.23/swig/perl' make[4]: Entering directory '/tmp/B.31rg53yw/BUILD/obexftp-0.23/swig/perl' "/usr/bin/perl5.40.0" -MExtUtils::Command::MM -e 'cp_nonempty' -- OBEXFTP.bs blib/arch/auto/OBEXFTP/OBEXFTP.bs 644 make[4]: Leaving directory '/tmp/B.31rg53yw/BUILD/obexftp-0.23/swig/perl' make[4]: Entering directory '/tmp/B.31rg53yw/BUILD/obexftp-0.23/swig/perl' cp OBEXFTP.pm blib/lib/OBEXFTP.pm make[4]: Leaving directory '/tmp/B.31rg53yw/BUILD/obexftp-0.23/swig/perl' make[4]: Entering directory '/tmp/B.31rg53yw/BUILD/obexftp-0.23/swig/perl' i686-pld-linux-gcc -c -I../.. -D_REENTRANT -D_GNU_SOURCE -fwrapv -fno-strict-aliasing -pipe -fstack-protector-strong -I/usr/local/include -D_LARGEFILE_SOURCE -D_FILE_OFFSET_BITS=64 -O2 -fwrapv -pipe -Wformat -Werror=format-security -gdwarf-4 -fno-debug-types-section -fvar-tracking-assignments -g2 -Wp,-D_FORTIFY_SOURCE=2 -fstack-protector-strong --param=ssp-buffer-size=4 -Werror=trampolines -fomit-frame-pointer -march=i686 -fasynchronous-unwind-tables -mtune=pentium4 -gdwarf-4 -fno-debug-types-section -fvar-tracking-assignments -g2 -DVERSION=\"\" -DXS_VERSION=\"\" -fPIC "-I/usr/lib/perl5/5.40.0/i686-pld-linux-thread-multi/CORE" -DSKIP_SEARCH_H -DHAVE_CONFIG_H perl_wrap.c make[4]: Leaving directory '/tmp/B.31rg53yw/BUILD/obexftp-0.23/swig/perl' make[4]: Entering directory '/tmp/B.31rg53yw/BUILD/obexftp-0.23/swig/perl' rm -f blib/arch/auto/OBEXFTP/OBEXFTP.so LD_RUN_PATH="/tmp/B.31rg53yw/BUILD/obexftp-0.23/swig/perl/../../obexftp/.libs:/tmp/B.31rg53yw/BUILD/obexftp-0.23/swig/perl/../../multicobex/.libs:/tmp/B.31rg53yw/BUILD/obexftp-0.23/swig/perl/../../bfb/.libs:/usr/lib" i686-pld-linux-gcc -shared perl_wrap.o -o blib/arch/auto/OBEXFTP/OBEXFTP.so \ -L/tmp/B.31rg53yw/BUILD/obexftp-0.23/swig/perl/../../obexftp/.libs -lobexftp -L/tmp/B.31rg53yw/BUILD/obexftp-0.23/swig/perl/../../multicobex/.libs -lmulticobex -L/tmp/B.31rg53yw/BUILD/obexftp-0.23/swig/perl/../../bfb/.libs -lbfb -lopenobex \ chmod 755 blib/arch/auto/OBEXFTP/OBEXFTP.so make[4]: Leaving directory '/tmp/B.31rg53yw/BUILD/obexftp-0.23/swig/perl' Making all in python make[3]: Entering directory '/tmp/B.31rg53yw/BUILD/obexftp-0.23/swig/python' if test ! -f python_wrap.c; then cp ./python_wrap.c . ; fi /usr/bin/python setup.py build Traceback (most recent call last): File "/tmp/B.31rg53yw/BUILD/obexftp-0.23/swig/python/setup.py", line 16, in <module> extra_link_args = string.split('-L../../obexftp/.libs -lobexftp -L../../multicobex/.libs -lmulticobex -L../../bfb/.libs -lbfb -lopenobex'), AttributeError: module 'string' has no attribute 'split' make[3]: *** [Makefile:481: all-local] Error 1 make[3]: Leaving directory '/tmp/B.31rg53yw/BUILD/obexftp-0.23/swig/python' make[2]: *** [Makefile:385: all-recursive] Error 1 make[1]: *** [Makefile:504: all-recursive] Error 1 make: *** [Makefile:411: all] Error 2 error: Bad exit status from /tmp/B.31rg53yw/BUILD/tmp/rpm-tmp.APRsdc (%build) RPM build warnings: Could not canonicalize hostname: nereid RPM build errors: Bad exit status from /tmp/B.31rg53yw/BUILD/tmp/rpm-tmp.APRsdc (%build) ended at: Sun Jun 30 13:47:11 2024, done in 0:00:20.556895 error: No files produced. + chmod -R u+rwX /tmp/B.31rg53yw/BUILD + rm -rf /tmp/B.31rg53yw/tmp /tmp/B.31rg53yw/BUILD + rm -rf /tmp/B.31rg53yw Begin-PLD-Builder-Info Build-Time: user:21.30s sys:8.49s real:23.22s (faults io:5 non-io:1281080) End-PLD-Builder-Info
[Back to list of logs] [View rpm -qa of builder]