FailedOk

th/SRPMS[OK]
th/x32[OK]
th/i686[OK]
th/x86_64[OK]

ac/SRPMS[OK]
ac/i386[OK]
ac/i586[OK]
ac/i686[OK]
ac/alpha[OK]
ac/amd64[OK]
ac/athlon[OK]
ac/ppc[OK]
ac/sparc[OK]
ac/sparc64[OK]

Advanced Search
main()
Powered by PLD Linux
(c) 2002-2024 PLD Team
$Revision: 1.37 $
Powered by ed.
Your IP: 35.172.230.21

perl-XML-GDOME 04c9cc45-d871-47eb-a232-706292d65073

Status:Failed
Source URL:https://buildlogs.pld-linux.org/pld/th/i686/FAIL/perl-XML-GDOME,04c9cc45-d871-47eb-a232-706292d65073.bz2
text/plain URL:View!
full text:View!
rpm -qa of builder:View!
Date:2024/06/30 13:58:59
Runtime:0:00:01.712421

Toc:

  • error 1
  • dom.h:4:1: error: unknown type name 'xmlChar'
  • error 2
  • dom.h:7:46: error: unknown type name 'xmlChar'
  • error 3
  • GDOME.xs:24:3: error: unknown type name 'xmlNode'
  • error 4
  • GDOME.xs:27:3: error: unknown type name 'xmlNs'
  • error 5
  • GDOME.xs:30:1: error: unknown type name 'xmlNs'
  • error 6
  • GDOME.xs:30:35: error: unknown type name 'xmlAttr'
  • error 7
  • GDOME.xs:575:9: error: unknown type name 'xmlNs'
  • error 8
  • GDOME.xs:578:20: error: request for member 'type' in something not a structure or union
  • error 9
  • GDOME.xs:578:30: error: 'XML_ATTRIBUTE_NODE' undeclared (first use in this function); did you mean 'GDOME_ATTRIBUTE_NODE'?
  • error 10
  • GDOME.xs:579:42: error: 'xmlAttr' undeclared (first use in this function)
  • error 11
  • GDOME.xs:579:51: error: expected expression before ')' token
  • error 12
  • GDOME.xs:584:27: error: request for member 'type' in something not a structure or union
  • error 13
  • GDOME.xs:584:37: error: 'XML_NAMESPACE_DECL' undeclared (first use in this function)
  • error 14
  • GDOME.xs:585:33: error: request for member 'ns' in something not a structure or union
  • error 15
  • GDOME.xs:596:9: error: unknown type name 'xmlBufferPtr'
  • error 16
  • GDOME.xs:601:37: error: request for member 'doc' in something not a structure or union
  • error 17
  • GDOME.xs:602:20: error: invalid type argument of '->' (have 'int')
  • error 18
  • GDOME.xs:603:35: error: invalid type argument of '->' (have 'int')
  • error 19
  • GDOME.xs:607:21: error: request for member 'doc' in something not a structure or union
  • error 20
  • GDOME.xs:608:13: error: unknown type name 'xmlChar'
  • error 21
  • GDOME.xs:608:59: error: request for member 'doc' in something not a structure or union
  • error 22
  • GDOME.xs:630:21: error: request for member 'doc' in something not a structure or union
  • error 23
  • GDOME.xs:631:13: error: unknown type name 'xmlChar'
  • error 24
  • GDOME.xs:631:59: error: request for member 'doc' in something not a structure or union
  • error 25
  • GDOME.xs:1116:29: error: 'xmlDocPtr' undeclared (first use in this function); did you mean 'xmlErrorPtr'?
  • error 26
  • GDOME.xs:1116:39: error: expected ')' before 'priv'
  • error 27
  • GDOME.xs:315:32: error: 'xmlInputMatchCallback' undeclared (first use in this function)
  • error 28
  • GDOME.xs:315:54: error: expected ')' before 'GDOMEPerl_input_match'
  • error 29
  • error: Bad exit status from /tmp/B.zlj6ncai/BUILD/tmp/rpm-tmp.x02l54 (%build)
  • error 30
  • RPM build errors:
  • error 31
  • error: No files produced.

Content:

Updating / installing...
perl-XML-GDOME-0.86-19                ########################################
+ rm -f perl-XML-GDOME-0.86-19.src.rpm
+ install -m 700 -d /tmp/B.zlj6ncai/BUILD/tmp
+ TMPDIR=/tmp/B.zlj6ncai/BUILD/tmp
+ exec nice -n 0 rpmbuild -bp --short-circuit --nodeps --define '_topdir /tmp/B.zlj6ncai' --define '_specdir %{_topdir}' --define '_sourcedir %{_specdir}' --define '_rpmdir %{_topdir}/RPMS' --define '_builddir %{_topdir}/BUILD' --target i686-pld-linux --define 'prep exit 0' /tmp/B.zlj6ncai/perl-XML-GDOME.spec
warning: Could not canonicalize hostname: nereid
Building target platforms: i686-pld-linux
Building for target i686-pld-linux

RPM build warnings:
    Could not canonicalize hostname: nereid
checking BuildConflict-ing packages
rpm: warning: Could not canonicalize hostname: nereid
rpm: Building target platforms: i686-pld-linux
rpm: Building for target i686-pld-linux
rpm: 
rpm: RPM build warnings:
rpm:     Could not canonicalize hostname: nereid
no BuildConflicts found
checking BR
rpm: warning: Could not canonicalize hostname: nereid
rpm: Building target platforms: i686-pld-linux
rpm: Building for target i686-pld-linux
rpm: 
rpm: RPM build warnings:
rpm:     Could not canonicalize hostname: nereid
no BR needed
building RPM using: set -ex; : build-id: 04c9cc45-d871-47eb-a232-706292d65073; TMPDIR=/tmp/B.zlj6ncai/BUILD/tmp exec nice -n 0 rpmbuild -bb --define '__jobs 28' --define '_smp_mflags -j28' --define '_make_opts -Otarget' --define '_pld_builder 1' --define '_topdir /tmp/B.zlj6ncai' --define '_specdir %{_topdir}' --define '_sourcedir %{_specdir}' --define '_rpmdir %{_topdir}/RPMS' --define '_builddir %{_topdir}/BUILD'  --target i686-pld-linux /tmp/B.zlj6ncai/perl-XML-GDOME.spec
+ : build-id: 04c9cc45-d871-47eb-a232-706292d65073
+ TMPDIR=/tmp/B.zlj6ncai/BUILD/tmp
+ exec nice -n 0 rpmbuild -bb --define '__jobs 28' --define '_smp_mflags -j28' --define '_make_opts -Otarget' --define '_pld_builder 1' --define '_topdir /tmp/B.zlj6ncai' --define '_specdir %{_topdir}' --define '_sourcedir %{_specdir}' --define '_rpmdir %{_topdir}/RPMS' --define '_builddir %{_topdir}/BUILD' --target i686-pld-linux /tmp/B.zlj6ncai/perl-XML-GDOME.spec
warning: Could not canonicalize hostname: nereid
Building target platforms: i686-pld-linux
Building for target i686-pld-linux
Executing(%prep): /bin/sh -e /tmp/B.zlj6ncai/BUILD/tmp/rpm-tmp.wwPIfA
+ umask 022
+ cd /tmp/B.zlj6ncai/BUILD
+ cd /tmp/B.zlj6ncai/BUILD
+ rm -rf XML-GDOME-0.86
+ /bin/gzip -dc /tmp/B.zlj6ncai/XML-GDOME-0.86.tar.gz
+ /bin/tar -xof -
+ STATUS=0 
+ '[' 0 -ne 0 ']'
+ cd XML-GDOME-0.86
+ /bin/chmod -Rf a+rX,u+w,g-w,o-w .
+ RPM_EC=0 
+ jobs -p
+ exit 0
Executing(%build): /bin/sh -e /tmp/B.zlj6ncai/BUILD/tmp/rpm-tmp.x02l54
TMP=/home/users/builder/tmp
HOME=/home/users/builder
PATH=/home/users/builder/GNUstep/Tools:/bin:/usr/bin:/usr/local/bin:/home/users/builder/bin
TMPDIR=/tmp/B.zlj6ncai/BUILD/tmp
+ umask 022
+ cd /tmp/B.zlj6ncai/BUILD
+ cd XML-GDOME-0.86
+ /usr/bin/perl Makefile.PL 'INSTALLDIRS=vendor'
running gdome-config... Warning: prerequisite XML::LibXML::Common 0 not found.
ok
Checking if your kit is complete...
Looks good
Generating a Unix-style Makefile
Writing Makefile for XML::GDOME
Writing MYMETA.yml and MYMETA.json
+ /usr/bin/make -Otarget -j28 'CC=i686-pld-linux-gcc' 'OPTIMIZE=-O2 -fwrapv -pipe -Wformat -Werror=format-security -gdwarf-4 -fno-debug-types-section -fvar-tracking-assignments -g2 -Wp,-D_FORTIFY_SOURCE=2 -fstack-protector-strong --param=ssp-buffer-size=4 -Werror=trampolines -fomit-frame-pointer -march=i686 -fasynchronous-unwind-tables -mtune=pentium4 -gdwarf-4 -fno-debug-types-section -fvar-tracking-assignments -g2 '
Running Mkbootstrap for GDOME ()
chmod 644 "GDOME.bs"
"/usr/bin/perl5.40.0" -MExtUtils::Command::MM -e 'cp_nonempty' -- GDOME.bs blib/arch/auto/XML/GDOME/GDOME.bs 644
cp lib/XML/GDOME/XPath/NSResolver.pod blib/lib/XML/GDOME/XPath/NSResolver.pod
cp lib/XML/GDOME/Text.pod blib/lib/XML/GDOME/Text.pod
cp lib/XML/GDOME/NodeList.pod blib/lib/XML/GDOME/NodeList.pod
cp lib/XML/GDOME/XPath/Result.pod blib/lib/XML/GDOME/XPath/Result.pod
cp lib/XML/GDOME/Comment.pod blib/lib/XML/GDOME/Comment.pod
cp lib/XML/GDOME/ProcessingInstruction.pod blib/lib/XML/GDOME/ProcessingInstruction.pod
cp lib/XML/GDOME/SAX/Generator.pm blib/lib/XML/GDOME/SAX/Generator.pm
cp lib/XML/GDOME/Document.pod blib/lib/XML/GDOME/Document.pod
cp GDOME.pm blib/lib/XML/GDOME.pm
cp lib/XML/GDOME/DocumentType.pod blib/lib/XML/GDOME/DocumentType.pod
cp lib/XML/GDOME/Attr.pod blib/lib/XML/GDOME/Attr.pod
cp lib/XML/GDOME/SAX/Parser.pm blib/lib/XML/GDOME/SAX/Parser.pm
cp lib/XML/GDOME/SAX/Builder.pm blib/lib/XML/GDOME/SAX/Builder.pm
cp lib/XML/GDOME/XPath/Namespace.pod blib/lib/XML/GDOME/XPath/Namespace.pod
cp lib/XML/GDOME/Notation.pod blib/lib/XML/GDOME/Notation.pod
cp lib/XML/GDOME.pod blib/lib/XML/GDOME.pod
cp lib/XML/GDOME/CDATASection.pod blib/lib/XML/GDOME/CDATASection.pod
cp lib/XML/GDOME/Node.pod blib/lib/XML/GDOME/Node.pod
cp lib/XML/GDOME/EntityReference.pod blib/lib/XML/GDOME/EntityReference.pod
cp lib/XML/GDOME/XPath/Evaluator.pod blib/lib/XML/GDOME/XPath/Evaluator.pod
cp lib/XML/GDOME/Entity.pod blib/lib/XML/GDOME/Entity.pod
cp lib/XML/GDOME/Element.pod blib/lib/XML/GDOME/Element.pod
cp lib/XML/GDOME/DocumentFragment.pod blib/lib/XML/GDOME/DocumentFragment.pod
cp lib/XML/GDOME/NamedNodeMap.pod blib/lib/XML/GDOME/NamedNodeMap.pod
cp lib/XML/GDOME/CharacterData.pod blib/lib/XML/GDOME/CharacterData.pod
i686-pld-linux-gcc -c  -I/usr/include -I/usr/include/libgdome -I/usr/include/glib-1.2 -I/usr/lib/glib/include -I/usr/include/libxml2 -D_REENTRANT -D_GNU_SOURCE -fwrapv -fno-strict-aliasing -pipe -fstack-protector-strong -I/usr/local/include -D_LARGEFILE_SOURCE -D_FILE_OFFSET_BITS=64 -O2 -fwrapv -pipe -Wformat -Werror=format-security -gdwarf-4 -fno-debug-types-section -fvar-tracking-assignments -g2 -Wp,-D_FORTIFY_SOURCE=2 -fstack-protector-strong --param=ssp-buffer-size=4 -Werror=trampolines -fomit-frame-pointer -march=i686 -fasynchronous-unwind-tables -mtune=pentium4 -gdwarf-4 -fno-debug-types-section -fvar-tracking-assignments -g2    -DVERSION=\"0.86\" -DXS_VERSION=\"0.86\" -fPIC "-I/usr/lib/perl5/5.40.0/i686-pld-linux-thread-multi/CORE"   dom.c
"/usr/bin/perl5.40.0" "/usr/share/perl5/5.40.0/ExtUtils/xsubpp"  -typemap '/usr/share/perl5/5.40.0/ExtUtils/typemap' -typemap '/tmp/B.zlj6ncai/BUILD/XML-GDOME-0.86/typemap'  GDOME.xs > GDOME.xsc
mv GDOME.xsc GDOME.c
i686-pld-linux-gcc -c  -I/usr/include -I/usr/include/libgdome -I/usr/include/glib-1.2 -I/usr/lib/glib/include -I/usr/include/libxml2 -D_REENTRANT -D_GNU_SOURCE -fwrapv -fno-strict-aliasing -pipe -fstack-protector-strong -I/usr/local/include -D_LARGEFILE_SOURCE -D_FILE_OFFSET_BITS=64 -O2 -fwrapv -pipe -Wformat -Werror=format-security -gdwarf-4 -fno-debug-types-section -fvar-tracking-assignments -g2 -Wp,-D_FORTIFY_SOURCE=2 -fstack-protector-strong --param=ssp-buffer-size=4 -Werror=trampolines -fomit-frame-pointer -march=i686 -fasynchronous-unwind-tables -mtune=pentium4 -gdwarf-4 -fno-debug-types-section -fvar-tracking-assignments -g2    -DVERSION=\"0.86\" -DXS_VERSION=\"0.86\" -fPIC "-I/usr/lib/perl5/5.40.0/i686-pld-linux-thread-multi/CORE"   GDOME.c
In file included from GDOME.xs:17:
dom.h:4:1: error: unknown type name 'xmlChar'
    4 | xmlChar*
      | ^~~~~~~
dom.h:7:46: error: unknown type name 'xmlChar'
    7 | domDecodeString( const char *encoding, const xmlChar *string);
      |                                              ^~~~~~~
GDOME.xs:24:3: error: unknown type name 'xmlNode'
   24 |   xmlNode *n;
      |   ^~~~~~~
GDOME.xs:27:3: error: unknown type name 'xmlNs'
   27 |   xmlNs *ns;
      |   ^~~~~
GDOME.xs:30:1: error: unknown type name 'xmlNs'
   30 | xmlNs * gdome_xmlGetNsDeclByAttr (xmlAttr *a);
      | ^~~~~
GDOME.xs:30:35: error: unknown type name 'xmlAttr'
   30 | xmlNs * gdome_xmlGetNsDeclByAttr (xmlAttr *a);
      |                                   ^~~~~~~
In file included from /usr/lib/perl5/5.40.0/i686-pld-linux-thread-multi/CORE/perl.h:6225,
                 from GDOME.xs:7:
GDOME.c: In function 'XS_XML__GDOME__DOMImplementation_saveDocToString':
GDOME.c:1029:40: warning: implicit declaration of function 'xmlStrlen'; did you mean 'strlen'? [-Wimplicit-function-declaration]
 1029 |             RETVALSV = newSVpv(RETVAL, xmlStrlen(RETVAL));
      |                                        ^~~~~~~~~
/usr/lib/perl5/5.40.0/i686-pld-linux-thread-multi/CORE/embed.h:438:70: note: in definition of macro 'newSVpv'
  438 | # define newSVpv(a,b)                           Perl_newSVpv(aTHX_ a,b)
      |                                                                      ^
GDOME.xs: In function 'XS_XML__GDOME__Node_gdome_ref':
GDOME.xs:575:9: error: unknown type name 'xmlNs'
  575 |         xmlNs *ns;
      |         ^~~~~
GDOME.xs:578:20: error: request for member 'type' in something not a structure or union
  578 |         if (priv->n->type == XML_ATTRIBUTE_NODE) {
      |                    ^~
GDOME.xs:578:30: error: 'XML_ATTRIBUTE_NODE' undeclared (first use in this function); did you mean 'GDOME_ATTRIBUTE_NODE'?
  578 |         if (priv->n->type == XML_ATTRIBUTE_NODE) {
      |                              ^~~~~~~~~~~~~~~~~~
      |                              GDOME_ATTRIBUTE_NODE
GDOME.xs:578:30: note: each undeclared identifier is reported only once for each function it appears in
GDOME.xs:579:16: warning: implicit declaration of function 'gdome_xmlGetNsDeclByAttr' [-Wimplicit-function-declaration]
  579 |           ns = gdome_xmlGetNsDeclByAttr((xmlAttr *)priv->n);
      |                ^~~~~~~~~~~~~~~~~~~~~~~~
GDOME.xs:579:42: error: 'xmlAttr' undeclared (first use in this function)
  579 |           ns = gdome_xmlGetNsDeclByAttr((xmlAttr *)priv->n);
      |                                          ^~~~~~~
GDOME.xs:579:51: error: expected expression before ')' token
  579 |           ns = gdome_xmlGetNsDeclByAttr((xmlAttr *)priv->n);
      |                                                   ^
GDOME.xs:584:27: error: request for member 'type' in something not a structure or union
  584 |         } else if (priv->n->type == XML_NAMESPACE_DECL)
      |                           ^~
GDOME.xs:584:37: error: 'XML_NAMESPACE_DECL' undeclared (first use in this function)
  584 |         } else if (priv->n->type == XML_NAMESPACE_DECL)
      |                                     ^~~~~~~~~~~~~~~~~~
GDOME.xs:585:33: error: request for member 'ns' in something not a structure or union
  585 |           RETVAL = (int) priv->n->ns;
      |                                 ^~
GDOME.xs: In function 'XS_XML__GDOME__Node_toString':
GDOME.xs:596:9: error: unknown type name 'xmlBufferPtr'
  596 |         xmlBufferPtr buffer;
      |         ^~~~~~~~~~~~
GDOME.xs:600:18: warning: implicit declaration of function 'xmlBufferCreate' [-Wimplicit-function-declaration]
  600 |         buffer = xmlBufferCreate();
      |                  ^~~~~~~~~~~~~~~
GDOME.xs:601:9: warning: implicit declaration of function 'xmlNodeDump' [-Wimplicit-function-declaration]
  601 |         xmlNodeDump( buffer, priv->n->doc, priv->n, 0, 0 );
      |         ^~~~~~~~~~~
GDOME.xs:601:37: error: request for member 'doc' in something not a structure or union
  601 |         xmlNodeDump( buffer, priv->n->doc, priv->n, 0, 0 );
      |                                     ^~
GDOME.xs:602:20: error: invalid type argument of '->' (have 'int')
  602 |         if ( buffer->content != 0 ) {
      |                    ^~
GDOME.xs:603:18: warning: implicit declaration of function 'xmlStrdup' [-Wimplicit-function-declaration]
  603 |             ret= xmlStrdup( buffer->content );
      |                  ^~~~~~~~~
GDOME.xs:603:35: error: invalid type argument of '->' (have 'int')
  603 |             ret= xmlStrdup( buffer->content );
      |                                   ^~
GDOME.xs:605:9: warning: implicit declaration of function 'xmlBufferFree' [-Wimplicit-function-declaration]
  605 |         xmlBufferFree( buffer );
      |         ^~~~~~~~~~~~~
GDOME.xs:607:21: error: request for member 'doc' in something not a structure or union
  607 |         if ( priv->n->doc != NULL ) {
      |                     ^~
GDOME.xs:608:13: error: unknown type name 'xmlChar'
  608 |             xmlChar *retDecoded = domDecodeString( priv->n->doc->encoding, ret );
      |             ^~~~~~~
GDOME.xs:608:59: error: request for member 'doc' in something not a structure or union
  608 |             xmlChar *retDecoded = domDecodeString( priv->n->doc->encoding, ret );
      |                                                           ^~
GDOME.xs:608:76: warning: passing argument 2 of 'domDecodeString' from incompatible pointer type [-Wincompatible-pointer-types]
  608 |             xmlChar *retDecoded = domDecodeString( priv->n->doc->encoding, ret );
      |                                                                            ^~~
      |                                                                            |
      |                                                                            char *
dom.h:7:55: note: expected 'const int *' but argument is of type 'char *'
    7 | domDecodeString( const char *encoding, const xmlChar *string);
      |                                        ~~~~~~~~~~~~~~~^~~~~~
GDOME.xs:609:13: warning: implicit declaration of function 'xmlFree' [-Wimplicit-function-declaration]
  609 |             xmlFree( ret );
      |             ^~~~~~~
GDOME.xs:610:20: warning: assignment to 'char *' from incompatible pointer type 'int *' [-Wincompatible-pointer-types]
  610 |             RETVAL = retDecoded;
      |                    ^
GDOME.xs: In function 'XS_XML__GDOME__Node_string_value':
GDOME.xs:628:23: warning: implicit declaration of function 'xmlXPathCastNodeToString' [-Wimplicit-function-declaration]
  628 |         ret = (char *)xmlXPathCastNodeToString(priv->n);
      |                       ^~~~~~~~~~~~~~~~~~~~~~~~
GDOME.xs:630:21: error: request for member 'doc' in something not a structure or union
  630 |         if ( priv->n->doc != NULL ) {
      |                     ^~
GDOME.xs:631:13: error: unknown type name 'xmlChar'
  631 |             xmlChar *retDecoded = domDecodeString( priv->n->doc->encoding, ret );
      |             ^~~~~~~
GDOME.xs:631:59: error: request for member 'doc' in something not a structure or union
  631 |             xmlChar *retDecoded = domDecodeString( priv->n->doc->encoding, ret );
      |                                                           ^~
GDOME.xs:631:76: warning: passing argument 2 of 'domDecodeString' from incompatible pointer type [-Wincompatible-pointer-types]
  631 |             xmlChar *retDecoded = domDecodeString( priv->n->doc->encoding, ret );
      |                                                                            ^~~
      |                                                                            |
      |                                                                            char *
dom.h:7:55: note: expected 'const int *' but argument is of type 'char *'
    7 | domDecodeString( const char *encoding, const xmlChar *string);
      |                                        ~~~~~~~~~~~~~~~^~~~~~
GDOME.xs:633:20: warning: assignment to 'char *' from incompatible pointer type 'int *' [-Wincompatible-pointer-types]
  633 |             RETVAL = retDecoded;
      |                    ^
GDOME.xs: In function 'XS_XML__GDOME__Document_process_xinclude':
GDOME.xs:1116:9: warning: implicit declaration of function 'xmlXIncludeProcess' [-Wimplicit-function-declaration]
 1116 |         xmlXIncludeProcess((xmlDocPtr)priv->n);
      |         ^~~~~~~~~~~~~~~~~~
GDOME.xs:1116:29: error: 'xmlDocPtr' undeclared (first use in this function); did you mean 'xmlErrorPtr'?
 1116 |         xmlXIncludeProcess((xmlDocPtr)priv->n);
      |                             ^~~~~~~~~
      |                             xmlErrorPtr
GDOME.xs:1116:39: error: expected ')' before 'priv'
 1116 |         xmlXIncludeProcess((xmlDocPtr)priv->n);
      |                           ~           ^~~~
      |                                       )
GDOME.xs: In function 'boot_XML__GDOME':
GDOME.xs:314:5: warning: implicit declaration of function 'xmlInitParser' [-Wimplicit-function-declaration]
  314 |     xmlInitParser();
      |     ^~~~~~~~~~~~~
GDOME.xs:315:5: warning: implicit declaration of function 'xmlRegisterInputCallbacks' [-Wimplicit-function-declaration]
  315 |     xmlRegisterInputCallbacks((xmlInputMatchCallback) GDOMEPerl_input_match,
      |     ^~~~~~~~~~~~~~~~~~~~~~~~~
GDOME.xs:315:32: error: 'xmlInputMatchCallback' undeclared (first use in this function)
  315 |     xmlRegisterInputCallbacks((xmlInputMatchCallback) GDOMEPerl_input_match,
      |                                ^~~~~~~~~~~~~~~~~~~~~
GDOME.xs:315:54: error: expected ')' before 'GDOMEPerl_input_match'
  315 |     xmlRegisterInputCallbacks((xmlInputMatchCallback) GDOMEPerl_input_match,
      |                              ~                       ^~~~~~~~~~~~~~~~~~~~~~
      |                                                      )
make: *** [Makefile:391: GDOME.o] Error 1
error: Bad exit status from /tmp/B.zlj6ncai/BUILD/tmp/rpm-tmp.x02l54 (%build)

RPM build warnings:
    Could not canonicalize hostname: nereid

RPM build errors:
    Bad exit status from /tmp/B.zlj6ncai/BUILD/tmp/rpm-tmp.x02l54 (%build)
ended at: Sun Jun 30 13:58:58 2024, done in 0:00:01.712421
error: No files produced.
+ chmod -R u+rwX /tmp/B.zlj6ncai/BUILD
+ rm -rf /tmp/B.zlj6ncai/tmp /tmp/B.zlj6ncai/BUILD
+ rm -rf /tmp/B.zlj6ncai
Begin-PLD-Builder-Info
Build-Time: user:2.98s sys:1.22s real:3.90s (faults io:1 non-io:158566)

End-PLD-Builder-Info
[Back to list of logs] [View rpm -qa of builder]