FailedOk

th/SRPMS[OK]
th/x32[OK]
th/i686[OK]
th/x86_64[OK]

ac/SRPMS[OK]
ac/i386[OK]
ac/i586[OK]
ac/i686[OK]
ac/alpha[OK]
ac/amd64[OK]
ac/athlon[OK]
ac/ppc[OK]
ac/sparc[OK]
ac/sparc64[OK]

Advanced Search
main()
Powered by PLD Linux
(c) 2002-2024 PLD Team
$Revision: 1.37 $
Powered by penguin.
Your IP: 35.172.230.21

perl-cdk a8218812-da0c-4ded-828c-6e03d7a9b04d

Status:Failed
Source URL:https://buildlogs.pld-linux.org/pld/th/i686/FAIL/perl-cdk,a8218812-da0c-4ded-828c-6e03d7a9b04d.bz2
text/plain URL:View!
rpm -qa of builder:View!
Date:2024/06/30 13:59:48
Runtime:0:00:03.809525

Toc:

  • prep
  • Executing(%prep): /bin/sh -e /tmp/B.s4n_c69i/BUILD/tmp/rpm-tmp.euTmjc
  • build
  • Executing(%build): /bin/sh -e /tmp/B.s4n_c69i/BUILD/tmp/rpm-tmp.5np3oG
  • error 1
  • Cdk.xs:938:57: error: invalid use of incomplete typedef 'WINDOW' {aka 'struct _win_st'}
  • error 2
  • Cdk.xs:939:57: error: invalid use of incomplete typedef 'WINDOW' {aka 'struct _win_st'}
  • error 3
  • error: Bad exit status from /tmp/B.s4n_c69i/BUILD/tmp/rpm-tmp.5np3oG (%build)
  • error 4
  • RPM build errors:
  • error 5
  • error: No files produced.

Content:

request from: atler
checking if we should skip the build
started at: Sun Jun 30 13:59:42 2024
killing old processes on a builder
sending signal 9 to pid -1
cleaning up /tmp
fetching https://srcbuilder.pld-linux.org/th//srpms/a8218812-da0c-4ded-828c-6e03d7a9b04d/perl-cdk-20150928-6.src.rpm
fetched 172284 bytes, 548.8 K/s
installing srpm: perl-cdk-20150928-6.src.rpm
+ install -d /tmp/B.s4n_c69i/BUILD /tmp/B.s4n_c69i/RPMS
+ LC_ALL=en_US.UTF-8
+ rpm -qp --changelog perl-cdk-20150928-6.src.rpm
* Sun Jun 30 2024 PLD Linux Team <feedback@pld-linux.org>
- For complete changelog see: http://git.pld-linux.org/?p=packages/perl-cdk.git;a=log;h=master
* Thu Jul 06 2023 Jan Palus <atler@pld-linux.org> 845afc4
- perl 5.38.0 rebuild * Mon Aug 22 2022 Jan Palus <atler@pld-linux.org> 87534f2
- perl 5.36.0 rebuild * Sun Feb 27 2022 Jan Rękorajski <baggins@pld-linux.org> 73f1ab4
- rebuild with perl 5.34.0 * Fri May 07 2021 Jan Rękorajski <baggins@pld-linux.org> 75cd773
- rebuild with perl 5.32 * Sat Jan 25 2020 Jan Rękorajski <baggins@pld-linux.org> 7bc46a1
- drop obsolete and outdated manual inclusion of rpm macros * Wed Dec 04 2019 Jan Rękorajski <baggins@pld-linux.org> fe5207e
- rebuild with perl 5.30.0 - release 2 (by relup.sh) * Sat Sep 01 2018 Jakub Bogusz <qboosh@pld-linux.org> 5b04b81
- updated to 20150928 * Tue Mar 25 2008 Jakub Bogusz <qboosh@pld-linux.org> 4780c04
- updated Source0 URL - added cdk URL * Thu Jan 10 2008 Elan Ruusamäe <glen@pld-linux.org> d53c3f9
- add CC to %{__make} grep OPTIMIZE= perl-* -l|xargs grep -c CC=|grep :0|cut -d: -f1|xargs sed -i -e '/%{__make} \\$/a\\tCC="%{__cc}" \\' * Tue Feb 13 2007 Elan Ruusamäe <glen@pld-linux.org> f2c7cce
- tabs in preamble * Mon Feb 12 2007 Jan Rękorajski <baggins@pld-linux.org> 79943c8
- converted to UTF-8 * Tue Dec 13 2005 Elan Ruusamäe <glen@pld-linux.org> 03194f3
- adapterized (avoid macros with /usr/include/{ncurses,freetype}*) * Sun Oct 24 2004 paladine <paladine@pld-linux.org> 26a9378
- spelling fixes, uppercases, etc. * Thu May 06 2004 ankry <ankry@pld-linux.org> c81ebe2
- fixed perl-devel BR * Tue Apr 27 2004 ankry <ankry@pld-linux.org> bfa4900
- new bconds * Sat Jan 31 2004 kosmo <kosmo@pld-linux.org> 686c66c
- updated to 20031210 * Mon Aug 18 2003 Tomasz Pala <gotar@pld-linux.org> 37b902d
- mass commit: cosmetics (removed trailing white spaces) * Mon May 26 2003 Michal Moskal <michal@moskal.me> fefc1ab
- massive attack: adding Source-md5 * Sun May 25 2003 misi3k <misi3k@pld-linux.org> c9cb1f7
- massive attack s/pld.org.pl/pld-linux.org/ * Fri Apr 11 2003 radek <radek@pld-linux.org> ba652aa
- BR: perl-devel; do not BR: perl + rpm -Uhv --nodeps --define '_topdir /tmp/B.s4n_c69i' --define '_specdir %{_topdir}' --define '_sourcedir %{_specdir}' --define '_rpmdir %{_topdir}/RPMS' --define '_builddir %{_topdir}/BUILD' perl-cdk-20150928-6.src.rpm Updating / installing... perl-cdk-20150928-6 ######################################## + rm -f perl-cdk-20150928-6.src.rpm + install -m 700 -d /tmp/B.s4n_c69i/BUILD/tmp + TMPDIR=/tmp/B.s4n_c69i/BUILD/tmp + exec nice -n 0 rpmbuild -bp --short-circuit --nodeps --define '_topdir /tmp/B.s4n_c69i' --define '_specdir %{_topdir}' --define '_sourcedir %{_specdir}' --define '_rpmdir %{_topdir}/RPMS' --define '_builddir %{_topdir}/BUILD' --target i686-pld-linux --define 'prep exit 0' /tmp/B.s4n_c69i/perl-cdk.spec warning: Could not canonicalize hostname: nereid Building target platforms: i686-pld-linux Building for target i686-pld-linux RPM build warnings: Could not canonicalize hostname: nereid checking BuildConflict-ing packages rpm: warning: Could not canonicalize hostname: nereid rpm: Building target platforms: i686-pld-linux rpm: Building for target i686-pld-linux rpm: rpm: RPM build warnings: rpm: Could not canonicalize hostname: nereid no BuildConflicts found checking BR rpm: warning: Could not canonicalize hostname: nereid rpm: Building target platforms: i686-pld-linux rpm: Building for target i686-pld-linux rpm: rpm: RPM build warnings: rpm: Could not canonicalize hostname: nereid no BR needed building RPM using: set -ex; : build-id: a8218812-da0c-4ded-828c-6e03d7a9b04d; TMPDIR=/tmp/B.s4n_c69i/BUILD/tmp exec nice -n 0 rpmbuild -bb --define '__jobs 28' --define '_smp_mflags -j28' --define '_make_opts -Otarget' --define '_pld_builder 1' --define '_topdir /tmp/B.s4n_c69i' --define '_specdir %{_topdir}' --define '_sourcedir %{_specdir}' --define '_rpmdir %{_topdir}/RPMS' --define '_builddir %{_topdir}/BUILD' --target i686-pld-linux /tmp/B.s4n_c69i/perl-cdk.spec + : build-id: a8218812-da0c-4ded-828c-6e03d7a9b04d + TMPDIR=/tmp/B.s4n_c69i/BUILD/tmp + exec nice -n 0 rpmbuild -bb --define '__jobs 28' --define '_smp_mflags -j28' --define '_make_opts -Otarget' --define '_pld_builder 1' --define '_topdir /tmp/B.s4n_c69i' --define '_specdir %{_topdir}' --define '_sourcedir %{_specdir}' --define '_rpmdir %{_topdir}/RPMS' --define '_builddir %{_topdir}/BUILD' --target i686-pld-linux /tmp/B.s4n_c69i/perl-cdk.spec warning: Could not canonicalize hostname: nereid Building target platforms: i686-pld-linux Building for target i686-pld-linux Executing(%prep): /bin/sh -e /tmp/B.s4n_c69i/BUILD/tmp/rpm-tmp.euTmjc + umask 022 + cd /tmp/B.s4n_c69i/BUILD + cd /tmp/B.s4n_c69i/BUILD + rm -rf cdk-perl-20150928 + /bin/gzip -dc /tmp/B.s4n_c69i/cdk-perl-20150928.tgz + /bin/tar -xof - + STATUS=0 + '[' 0 -ne 0 ']' + cd cdk-perl-20150928 + /bin/chmod -Rf a+rX,u+w,g-w,o-w . + RPM_EC=0 + jobs -p + exit 0 Executing(%build): /bin/sh -e /tmp/B.s4n_c69i/BUILD/tmp/rpm-tmp.5np3oG TMP=/home/users/builder/tmp HOME=/home/users/builder PATH=/home/users/builder/GNUstep/Tools:/bin:/usr/bin:/usr/local/bin:/home/users/builder/bin TMPDIR=/tmp/B.s4n_c69i/BUILD/tmp + umask 022 + cd /tmp/B.s4n_c69i/BUILD + cd cdk-perl-20150928 + ./configure 'LDFLAGS=-Wl,--as-needed -Wl,--no-copy-dt-needed-entries -Wl,-z,relro -Wl,-z,combreloc ' 'CFLAGS=-O2 -fwrapv -pipe -Wformat -Werror=format-security -gdwarf-4 -fno-debug-types-section -fvar-tracking-assignments -g2 -Wp,-D_FORTIFY_SOURCE=2 -fstack-protector-strong --param=ssp-buffer-size=4 -Werror=trampolines -fomit-frame-pointer -march=i686 -fasynchronous-unwind-tables -mtune=pentium4 -gdwarf-4 -fno-debug-types-section -fvar-tracking-assignments -g2 ' 'CXXFLAGS=-O2 -fwrapv -pipe -Wformat -Werror=format-security -gdwarf-4 -fno-debug-types-section -fvar-tracking-assignments -g2 -Wp,-D_FORTIFY_SOURCE=2 -fstack-protector-strong --param=ssp-buffer-size=4 -Werror=trampolines -fomit-frame-pointer -march=i686 -fasynchronous-unwind-tables -mtune=pentium4 -gdwarf-4 -fno-debug-types-section -fvar-tracking-assignments -g2 ' 'FFLAGS=-O2 -fwrapv -pipe -Wformat -Werror=format-security -gdwarf-4 -fno-debug-types-section -fvar-tracking-assignments -g2 -Wp,-D_FORTIFY_SOURCE=2 -fstack-protector-strong --param=ssp-buffer-size=4 -Werror=trampolines -fomit-frame-pointer -march=i686 -fasynchronous-unwind-tables -mtune=pentium4 -gdwarf-4 -fno-debug-types-section -fvar-tracking-assignments -g2 ' 'FCFLAGS=-O2 -fwrapv -pipe -Wformat -Werror=format-security -gdwarf-4 -fno-debug-types-section -fvar-tracking-assignments -g2 -Wp,-D_FORTIFY_SOURCE=2 -fstack-protector-strong --param=ssp-buffer-size=4 -Werror=trampolines -fomit-frame-pointer -march=i686 -fasynchronous-unwind-tables -mtune=pentium4 -gdwarf-4 -fno-debug-types-section -fvar-tracking-assignments -g2 ' 'CPPFLAGS=' 'CC=i686-pld-linux-gcc' 'CXX=i686-pld-linux-g++' '--host=i686-pld-linux' '--build=i686-pld-linux' '--prefix=/usr' '--exec-prefix=/usr' '--bindir=/usr/bin' '--sbindir=/usr/sbin' '--sysconfdir=/etc' '--datadir=/usr/share' '--includedir=/usr/include' '--libdir=/usr/lib' '--libexecdir=/usr/libexec' '--localstatedir=/var' '--sharedstatedir=/var/lib' '--mandir=/usr/share/man' '--infodir=/usr/share/info' '--x-libraries=/usr/lib' checking for version used by Cdk.pm... egrep: warning: egrep is obsolescent; using grep -E 5.20150928 checking for i686-pld-linux-gcc... i686-pld-linux-gcc checking for C compiler default output... a.out checking whether the C compiler works... yes checking whether we are cross compiling... no checking for executable suffix... checking for object suffix... o checking whether we are using the GNU C compiler... yes checking whether i686-pld-linux-gcc accepts -g... yes checking version of i686-pld-linux-gcc... 686 checking for i686-pld-linux-gcc option to accept ANSI C... none needed checking $CC variable... ok checking for i686-pld-linux-ar... no checking for ar... ar checking for i686-pld-linux-ld... no checking for ld... ld checking for i686-pld-linux-ar... no checking for ar... /usr/bin/ar checking for i686-pld-linux-ranlib... no checking for ranlib... ranlib checking build system type... i686-pld-linux-gnu checking host system type... i686-pld-linux-gnu Configuring for linux-gnu checking if we must define _GNU_SOURCE... yes checking if _XOPEN_SOURCE really is set... yes checking if you want to check for gcc warnings... no checking how to run the C preprocessor... egrep: warning: egrep is obsolescent; using grep -E egrep: warning: egrep is obsolescent; using grep -E i686-pld-linux-gcc -E egrep: warning: egrep is obsolescent; using grep -E egrep: warning: egrep is obsolescent; using grep -E checking if you want to use dmalloc for testing... no checking if you want to use dbmalloc for testing... no checking if you want to use valgrind for testing... no checking if you want to perform memory-leak testing... no checking for perl... perl checking if you want to use cdk5-config for C flags... no checking if you want to use cdkw5-config for C flags... no checking for cdk.h... egrep: warning: egrep is obsolescent; using grep -E yes checking for initCDKScreen in -lcdk... yes configure: creating ./config.status config.status: creating Makefile.PL fgrep: warning: fgrep is obsolescent; using grep -F fgrep: warning: fgrep is obsolescent; using grep -F fgrep: warning: fgrep is obsolescent; using grep -F egrep: warning: egrep is obsolescent; using grep -E egrep: warning: egrep is obsolescent; using grep -E Checking if your kit is complete... Looks good Generating a Unix-style Makefile Writing Makefile for Cdk Writing MYMETA.yml and MYMETA.json fgrep: warning: fgrep is obsolescent; using grep -F ** updated Makefile to allow in-tree test-builds 57,58c57,58 < SITELIBEXP = /usr/local/share/perl5 < SITEARCHEXP = /usr/local/lib/perl5/5.40.0/i686-pld-linux-thread-multi --- > SITELIBEXP = $(BUILDDIR)/usr/local/share/perl5 > SITEARCHEXP = $(BUILDDIR)/usr/local/lib/perl5/5.40.0/i686-pld-linux-thread-multi 129c129 < PERL_LIB = /usr/share/perl5/5.40.0 --- > PERL_LIB = $(BUILDDIR)/usr/share/perl5/5.40.0 590d589 < - $(MV) $(FIRST_MAKEFILE) $(MAKEFILE_OLD) $(DEV_NULL) 814c813 < read "$(PERL_ARCHLIB)/auto/$(FULLEXT)/.packlist" \ --- > read "$(BUILDDIR)$(PERL_ARCHLIB)/auto/$(FULLEXT)/.packlist" \ 837c836 < "$(PERL_ARCHLIB)/auto/$(FULLEXT)" --- > "$(BUILDDIR)$(PERL_ARCHLIB)/auto/$(FULLEXT)" 889c888 < $(NOECHO) $(UNINSTALL) "$(PERL_ARCHLIB)/auto/$(FULLEXT)/.packlist" --- > $(NOECHO) $(UNINSTALL) "$(BUILDDIR)$(PERL_ARCHLIB)/auto/$(FULLEXT)/.packlist" + /usr/bin/perl Makefile.PL 'INSTALLDIRS=vendor' Generating a Unix-style Makefile Writing Makefile for Cdk Writing MYMETA.yml and MYMETA.json + /usr/bin/make -Otarget -j28 'CC=i686-pld-linux-gcc' 'OPTIMIZE=-O2 -fwrapv -pipe -Wformat -Werror=format-security -gdwarf-4 -fno-debug-types-section -fvar-tracking-assignments -g2 -Wp,-D_FORTIFY_SOURCE=2 -fstack-protector-strong --param=ssp-buffer-size=4 -Werror=trampolines -fomit-frame-pointer -march=i686 -fasynchronous-unwind-tables -mtune=pentium4 -gdwarf-4 -fno-debug-types-section -fvar-tracking-assignments -g2 ' Running Mkbootstrap for Cdk () chmod 644 "Cdk.bs" "/usr/bin/perl5.40.0" -MExtUtils::Command::MM -e 'cp_nonempty' -- Cdk.bs blib/arch/auto/Cdk/Cdk.bs 644 cp Cdk/Selection.pm blib/lib/Cdk/Selection.pm cp Cdk/Histogram.pm blib/lib/Cdk/Histogram.pm cp Cdk/Slider.pm blib/lib/Cdk/Slider.pm cp Cdk/Alphalist.pm blib/lib/Cdk/Alphalist.pm cp Cdk/Scale.pm blib/lib/Cdk/Scale.pm cp Cdk/Mentry.pm blib/lib/Cdk/Mentry.pm cp Cdk/Entry.pm blib/lib/Cdk/Entry.pm cp Cdk/Fselect.pm blib/lib/Cdk/Fselect.pm cp Cdk/Debug.pm blib/lib/Cdk/Debug.pm cp Cdk/Buttonbox.pm blib/lib/Cdk/Buttonbox.pm cp Cdk/Label.pm blib/lib/Cdk/Label.pm cp Cdk/Calendar.pm blib/lib/Cdk/Calendar.pm cp Cdk/Swindow.pm blib/lib/Cdk/Swindow.pm cp Cdk/Dialog.pm blib/lib/Cdk/Dialog.pm cp Cdk/Graph.pm blib/lib/Cdk/Graph.pm cp Cdk/Diag.pm blib/lib/Cdk/Diag.pm cp Cdk/Menu.pm blib/lib/Cdk/Menu.pm cp Cdk.pm blib/lib/Cdk.pm AutoSplitting blib/lib/Cdk.pm (blib/lib/auto/Cdk) cp Cdk/Radio.pm blib/lib/Cdk/Radio.pm cp Cdk/Template.pm blib/lib/Cdk/Template.pm cp Cdk/Itemlist.pm blib/lib/Cdk/Itemlist.pm cp Cdk/Scroll.pm blib/lib/Cdk/Scroll.pm cp Cdk/Matrix.pm blib/lib/Cdk/Matrix.pm cp Cdk/Marquee.pm blib/lib/Cdk/Marquee.pm cp Cdk/Viewer.pm blib/lib/Cdk/Viewer.pm "/usr/bin/perl5.40.0" "/usr/share/perl5/5.40.0/ExtUtils/xsubpp" -typemap '/usr/share/perl5/5.40.0/ExtUtils/typemap' -typemap '/tmp/B.s4n_c69i/BUILD/cdk-perl-20150928/typemap' Cdk.xs > Cdk.xsc mv Cdk.xsc Cdk.c i686-pld-linux-gcc -c -D_GNU_SOURCE -D_REENTRANT -D_GNU_SOURCE -fwrapv -fno-strict-aliasing -pipe -fstack-protector-strong -I/usr/local/include -D_LARGEFILE_SOURCE -D_FILE_OFFSET_BITS=64 -O2 -fwrapv -pipe -Wformat -Werror=format-security -gdwarf-4 -fno-debug-types-section -fvar-tracking-assignments -g2 -Wp,-D_FORTIFY_SOURCE=2 -fstack-protector-strong --param=ssp-buffer-size=4 -Werror=trampolines -fomit-frame-pointer -march=i686 -fasynchronous-unwind-tables -mtune=pentium4 -gdwarf-4 -fno-debug-types-section -fvar-tracking-assignments -g2 -DVERSION=\"5.20150928\" -DXS_VERSION=\"5.20150928\" -fPIC "-I/usr/lib/perl5/5.40.0/i686-pld-linux-thread-multi/CORE" Cdk.c In file included from /usr/lib/perl5/5.40.0/i686-pld-linux-thread-multi/CORE/perl.h:6166, from Cdk.xs:8: Cdk.xs: In function 'XS_Cdk_getCdkScreenDim': Cdk.xs:938:57: error: invalid use of incomplete typedef 'WINDOW' {aka 'struct _win_st'} 938 | XPUSHs (sv_2mortal(newSViv(GCDKSCREEN->window->_maxy))); | ^~ /usr/lib/perl5/5.40.0/i686-pld-linux-thread-multi/CORE/pp.h:549:35: note: in definition of macro 'PUSHs' 549 | # define PUSHs(s) (*++sp = (s)) | ^ Cdk.xs:938:12: note: in expansion of macro 'XPUSHs' 938 | XPUSHs (sv_2mortal(newSViv(GCDKSCREEN->window->_maxy))); | ^~~~~~ Cdk.xs:938:20: note: in expansion of macro 'sv_2mortal' 938 | XPUSHs (sv_2mortal(newSViv(GCDKSCREEN->window->_maxy))); | ^~~~~~~~~~ Cdk.xs:938:31: note: in expansion of macro 'newSViv' 938 | XPUSHs (sv_2mortal(newSViv(GCDKSCREEN->window->_maxy))); | ^~~~~~~ Cdk.xs:939:57: error: invalid use of incomplete typedef 'WINDOW' {aka 'struct _win_st'} 939 | XPUSHs (sv_2mortal(newSViv(GCDKSCREEN->window->_maxx))); | ^~ /usr/lib/perl5/5.40.0/i686-pld-linux-thread-multi/CORE/pp.h:549:35: note: in definition of macro 'PUSHs' 549 | # define PUSHs(s) (*++sp = (s)) | ^ Cdk.xs:939:12: note: in expansion of macro 'XPUSHs' 939 | XPUSHs (sv_2mortal(newSViv(GCDKSCREEN->window->_maxx))); | ^~~~~~ Cdk.xs:939:20: note: in expansion of macro 'sv_2mortal' 939 | XPUSHs (sv_2mortal(newSViv(GCDKSCREEN->window->_maxx))); | ^~~~~~~~~~ Cdk.xs:939:31: note: in expansion of macro 'newSViv' 939 | XPUSHs (sv_2mortal(newSViv(GCDKSCREEN->window->_maxx))); | ^~~~~~~ make: *** [Makefile:370: Cdk.o] Error 1 error: Bad exit status from /tmp/B.s4n_c69i/BUILD/tmp/rpm-tmp.5np3oG (%build) RPM build warnings: Could not canonicalize hostname: nereid RPM build errors: Bad exit status from /tmp/B.s4n_c69i/BUILD/tmp/rpm-tmp.5np3oG (%build) ended at: Sun Jun 30 13:59:47 2024, done in 0:00:03.809525 error: No files produced. + chmod -R u+rwX /tmp/B.s4n_c69i/BUILD + rm -rf /tmp/B.s4n_c69i/tmp /tmp/B.s4n_c69i/BUILD + rm -rf /tmp/B.s4n_c69i Begin-PLD-Builder-Info Build-Time: user:4.52s sys:1.94s real:6.18s (faults io:0 non-io:258007) End-PLD-Builder-Info
[Back to list of logs] [View rpm -qa of builder]