FailedOk

th/SRPMS[OK]
th/x32[OK]
th/i686[OK]
th/x86_64[OK]

ac/SRPMS[OK]
ac/i386[OK]
ac/i586[OK]
ac/i686[OK]
ac/alpha[OK]
ac/amd64[OK]
ac/athlon[OK]
ac/ppc[OK]
ac/sparc[OK]
ac/sparc64[OK]

Advanced Search
main()
Powered by PLD Linux
(c) 2002-2024 PLD Team
$Revision: 1.37 $
Powered by matrix.
Your IP: 35.172.230.21

perl-cdk a8218812-da0c-4ded-828c-6e03d7a9b04d

Status:Failed
Source URL:https://buildlogs.pld-linux.org/pld/th/i686/FAIL/perl-cdk,a8218812-da0c-4ded-828c-6e03d7a9b04d.bz2
text/plain URL:View!
full text:View!
rpm -qa of builder:View!
Date:2024/06/30 13:59:48
Runtime:0:00:03.809525

Toc:

  • error 1
  • Cdk.xs:938:57: error: invalid use of incomplete typedef 'WINDOW' {aka 'struct _win_st'}
  • error 2
  • Cdk.xs:939:57: error: invalid use of incomplete typedef 'WINDOW' {aka 'struct _win_st'}
  • error 3
  • error: Bad exit status from /tmp/B.s4n_c69i/BUILD/tmp/rpm-tmp.5np3oG (%build)
  • error 4
  • RPM build errors:
  • error 5
  • error: No files produced.

Content:

checking build system type... i686-pld-linux-gnu
checking host system type... i686-pld-linux-gnu
Configuring for linux-gnu
checking if we must define _GNU_SOURCE... yes
checking if _XOPEN_SOURCE really is set... yes
checking if you want to check for gcc warnings... no
checking how to run the C preprocessor... egrep: warning: egrep is obsolescent; using grep -E
egrep: warning: egrep is obsolescent; using grep -E
i686-pld-linux-gcc -E
egrep: warning: egrep is obsolescent; using grep -E
egrep: warning: egrep is obsolescent; using grep -E
checking if you want to use dmalloc for testing... no
checking if you want to use dbmalloc for testing... no
checking if you want to use valgrind for testing... no
checking if you want to perform memory-leak testing... no
checking for perl... perl
checking if you want to use cdk5-config for C flags... no
checking if you want to use cdkw5-config for C flags... no
checking for cdk.h... egrep: warning: egrep is obsolescent; using grep -E
yes
checking for initCDKScreen in -lcdk... yes
configure: creating ./config.status
config.status: creating Makefile.PL
fgrep: warning: fgrep is obsolescent; using grep -F
fgrep: warning: fgrep is obsolescent; using grep -F
fgrep: warning: fgrep is obsolescent; using grep -F
egrep: warning: egrep is obsolescent; using grep -E
egrep: warning: egrep is obsolescent; using grep -E
Checking if your kit is complete...
Looks good
Generating a Unix-style Makefile
Writing Makefile for Cdk
Writing MYMETA.yml and MYMETA.json
fgrep: warning: fgrep is obsolescent; using grep -F
** updated Makefile to allow in-tree test-builds
57,58c57,58
< SITELIBEXP = /usr/local/share/perl5
< SITEARCHEXP = /usr/local/lib/perl5/5.40.0/i686-pld-linux-thread-multi
---
> SITELIBEXP = $(BUILDDIR)/usr/local/share/perl5
> SITEARCHEXP = $(BUILDDIR)/usr/local/lib/perl5/5.40.0/i686-pld-linux-thread-multi
129c129
< PERL_LIB = /usr/share/perl5/5.40.0
---
> PERL_LIB = $(BUILDDIR)/usr/share/perl5/5.40.0
590d589
< 	- $(MV) $(FIRST_MAKEFILE) $(MAKEFILE_OLD) $(DEV_NULL)
814c813
< 		read "$(PERL_ARCHLIB)/auto/$(FULLEXT)/.packlist" \
---
> 		read "$(BUILDDIR)$(PERL_ARCHLIB)/auto/$(FULLEXT)/.packlist" \
837c836
< 		"$(PERL_ARCHLIB)/auto/$(FULLEXT)"
---
> 		"$(BUILDDIR)$(PERL_ARCHLIB)/auto/$(FULLEXT)"
889c888
< 	$(NOECHO) $(UNINSTALL) "$(PERL_ARCHLIB)/auto/$(FULLEXT)/.packlist"
---
> 	$(NOECHO) $(UNINSTALL) "$(BUILDDIR)$(PERL_ARCHLIB)/auto/$(FULLEXT)/.packlist"
+ /usr/bin/perl Makefile.PL 'INSTALLDIRS=vendor'
Generating a Unix-style Makefile
Writing Makefile for Cdk
Writing MYMETA.yml and MYMETA.json
+ /usr/bin/make -Otarget -j28 'CC=i686-pld-linux-gcc' 'OPTIMIZE=-O2 -fwrapv -pipe -Wformat -Werror=format-security -gdwarf-4 -fno-debug-types-section -fvar-tracking-assignments -g2 -Wp,-D_FORTIFY_SOURCE=2 -fstack-protector-strong --param=ssp-buffer-size=4 -Werror=trampolines -fomit-frame-pointer -march=i686 -fasynchronous-unwind-tables -mtune=pentium4 -gdwarf-4 -fno-debug-types-section -fvar-tracking-assignments -g2 '
Running Mkbootstrap for Cdk ()
chmod 644 "Cdk.bs"
"/usr/bin/perl5.40.0" -MExtUtils::Command::MM -e 'cp_nonempty' -- Cdk.bs blib/arch/auto/Cdk/Cdk.bs 644
cp Cdk/Selection.pm blib/lib/Cdk/Selection.pm
cp Cdk/Histogram.pm blib/lib/Cdk/Histogram.pm
cp Cdk/Slider.pm blib/lib/Cdk/Slider.pm
cp Cdk/Alphalist.pm blib/lib/Cdk/Alphalist.pm
cp Cdk/Scale.pm blib/lib/Cdk/Scale.pm
cp Cdk/Mentry.pm blib/lib/Cdk/Mentry.pm
cp Cdk/Entry.pm blib/lib/Cdk/Entry.pm
cp Cdk/Fselect.pm blib/lib/Cdk/Fselect.pm
cp Cdk/Debug.pm blib/lib/Cdk/Debug.pm
cp Cdk/Buttonbox.pm blib/lib/Cdk/Buttonbox.pm
cp Cdk/Label.pm blib/lib/Cdk/Label.pm
cp Cdk/Calendar.pm blib/lib/Cdk/Calendar.pm
cp Cdk/Swindow.pm blib/lib/Cdk/Swindow.pm
cp Cdk/Dialog.pm blib/lib/Cdk/Dialog.pm
cp Cdk/Graph.pm blib/lib/Cdk/Graph.pm
cp Cdk/Diag.pm blib/lib/Cdk/Diag.pm
cp Cdk/Menu.pm blib/lib/Cdk/Menu.pm
cp Cdk.pm blib/lib/Cdk.pm
AutoSplitting blib/lib/Cdk.pm (blib/lib/auto/Cdk)
cp Cdk/Radio.pm blib/lib/Cdk/Radio.pm
cp Cdk/Template.pm blib/lib/Cdk/Template.pm
cp Cdk/Itemlist.pm blib/lib/Cdk/Itemlist.pm
cp Cdk/Scroll.pm blib/lib/Cdk/Scroll.pm
cp Cdk/Matrix.pm blib/lib/Cdk/Matrix.pm
cp Cdk/Marquee.pm blib/lib/Cdk/Marquee.pm
cp Cdk/Viewer.pm blib/lib/Cdk/Viewer.pm
"/usr/bin/perl5.40.0" "/usr/share/perl5/5.40.0/ExtUtils/xsubpp"  -typemap '/usr/share/perl5/5.40.0/ExtUtils/typemap' -typemap '/tmp/B.s4n_c69i/BUILD/cdk-perl-20150928/typemap'  Cdk.xs > Cdk.xsc
mv Cdk.xsc Cdk.c
i686-pld-linux-gcc -c  -D_GNU_SOURCE -D_REENTRANT -D_GNU_SOURCE -fwrapv -fno-strict-aliasing -pipe -fstack-protector-strong -I/usr/local/include -D_LARGEFILE_SOURCE -D_FILE_OFFSET_BITS=64 -O2 -fwrapv -pipe -Wformat -Werror=format-security -gdwarf-4 -fno-debug-types-section -fvar-tracking-assignments -g2 -Wp,-D_FORTIFY_SOURCE=2 -fstack-protector-strong --param=ssp-buffer-size=4 -Werror=trampolines -fomit-frame-pointer -march=i686 -fasynchronous-unwind-tables -mtune=pentium4 -gdwarf-4 -fno-debug-types-section -fvar-tracking-assignments -g2    -DVERSION=\"5.20150928\" -DXS_VERSION=\"5.20150928\" -fPIC "-I/usr/lib/perl5/5.40.0/i686-pld-linux-thread-multi/CORE"   Cdk.c
In file included from /usr/lib/perl5/5.40.0/i686-pld-linux-thread-multi/CORE/perl.h:6166,
                 from Cdk.xs:8:
Cdk.xs: In function 'XS_Cdk_getCdkScreenDim':
Cdk.xs:938:57: error: invalid use of incomplete typedef 'WINDOW' {aka 'struct _win_st'}
  938 |            XPUSHs (sv_2mortal(newSViv(GCDKSCREEN->window->_maxy)));
      |                                                         ^~
/usr/lib/perl5/5.40.0/i686-pld-linux-thread-multi/CORE/pp.h:549:35: note: in definition of macro 'PUSHs'
  549 | #  define PUSHs(s)      (*++sp = (s))
      |                                   ^
Cdk.xs:938:12: note: in expansion of macro 'XPUSHs'
  938 |            XPUSHs (sv_2mortal(newSViv(GCDKSCREEN->window->_maxy)));
      |            ^~~~~~
Cdk.xs:938:20: note: in expansion of macro 'sv_2mortal'
  938 |            XPUSHs (sv_2mortal(newSViv(GCDKSCREEN->window->_maxy)));
      |                    ^~~~~~~~~~
Cdk.xs:938:31: note: in expansion of macro 'newSViv'
  938 |            XPUSHs (sv_2mortal(newSViv(GCDKSCREEN->window->_maxy)));
      |                               ^~~~~~~
Cdk.xs:939:57: error: invalid use of incomplete typedef 'WINDOW' {aka 'struct _win_st'}
  939 |            XPUSHs (sv_2mortal(newSViv(GCDKSCREEN->window->_maxx)));
      |                                                         ^~
/usr/lib/perl5/5.40.0/i686-pld-linux-thread-multi/CORE/pp.h:549:35: note: in definition of macro 'PUSHs'
  549 | #  define PUSHs(s)      (*++sp = (s))
      |                                   ^
Cdk.xs:939:12: note: in expansion of macro 'XPUSHs'
  939 |            XPUSHs (sv_2mortal(newSViv(GCDKSCREEN->window->_maxx)));
      |            ^~~~~~
Cdk.xs:939:20: note: in expansion of macro 'sv_2mortal'
  939 |            XPUSHs (sv_2mortal(newSViv(GCDKSCREEN->window->_maxx)));
      |                    ^~~~~~~~~~
Cdk.xs:939:31: note: in expansion of macro 'newSViv'
  939 |            XPUSHs (sv_2mortal(newSViv(GCDKSCREEN->window->_maxx)));
      |                               ^~~~~~~
make: *** [Makefile:370: Cdk.o] Error 1
error: Bad exit status from /tmp/B.s4n_c69i/BUILD/tmp/rpm-tmp.5np3oG (%build)

RPM build warnings:
    Could not canonicalize hostname: nereid

RPM build errors:
    Bad exit status from /tmp/B.s4n_c69i/BUILD/tmp/rpm-tmp.5np3oG (%build)
ended at: Sun Jun 30 13:59:47 2024, done in 0:00:03.809525
error: No files produced.
+ chmod -R u+rwX /tmp/B.s4n_c69i/BUILD
+ rm -rf /tmp/B.s4n_c69i/tmp /tmp/B.s4n_c69i/BUILD
+ rm -rf /tmp/B.s4n_c69i
Begin-PLD-Builder-Info
Build-Time: user:4.52s sys:1.94s real:6.18s (faults io:0 non-io:258007)

End-PLD-Builder-Info
[Back to list of logs] [View rpm -qa of builder]