FailedOk

th/SRPMS[OK]
th/x32[OK]
th/i686[OK]
th/x86_64[OK]

ac/SRPMS[OK]
ac/i386[OK]
ac/i586[OK]
ac/i686[OK]
ac/alpha[OK]
ac/amd64[OK]
ac/athlon[OK]
ac/ppc[OK]
ac/sparc[OK]
ac/sparc64[OK]

Advanced Search
main()
Powered by PLD Linux
(c) 2002-2024 PLD Team
$Revision: 1.37 $
Powered by /dev/zero.
Your IP: 35.174.62.162

php-pecl-imagick 207d7545-1149-4e04-824d-875062a0d100

Status:Failed
Source URL:https://buildlogs.pld-linux.org/pld/th/i686/FAIL/php-pecl-imagick,207d7545-1149-4e04-824d-875062a0d100.bz2
text/plain URL:View!
rpm -qa of builder:View!
Date:2024/01/26 12:00:20
Runtime:0:00:00.371099

Toc:

  • error 1
  • rpm: error: Failed build dependencies:
  • error 2
  • rpm: error: Failed build dependencies:
  • error 3
  • rpm: error: Failed build dependencies:
  • error 4
  • error: Failed build dependencies:
  • error 5
  • error: No files produced.

Content:

request from: arekm2
checking if we should skip the build
started at: Fri Jan 26 11:59:54 2024
killing old processes on a builder
sending signal 9 to pid -1
cleaning up /tmp
fetching https://srcbuilder.pld-linux.org/th//srpms/207d7545-1149-4e04-824d-875062a0d100/php52-pecl-imagick-3.7.0-4.src.rpm
fetched 374393 bytes, 1000.8 K/s
installing srpm: php52-pecl-imagick-3.7.0-4.src.rpm
+ install -d /tmp/B.d8zfpy5u/BUILD /tmp/B.d8zfpy5u/RPMS
+ LC_ALL=en_US.UTF-8
+ rpm -qp --changelog php52-pecl-imagick-3.7.0-4.src.rpm
* Fri Jan 26 2024 PLD Linux Team <feedback@pld-linux.org>
- For complete changelog see: http://git.pld-linux.org/?p=packages/php-pecl-imagick.git;a=log;h=auto/th/php-pecl-imagick-3.7.0-4
* Fri Jan 26 2024 Arkadiusz Miśkiewicz <arekm@maven.pl> 11a5972
- Rel 4 * Tue Oct 10 2023 Arkadiusz Miśkiewicz <arekm@maven.pl> 5eeb698
- Rel 3 * Wed Oct 12 2022 Jakub Bogusz <qboosh@pld-linux.org> 1385708
- stick to POSIX sh syntax * Fri Apr 15 2022 Jan Rękorajski <baggins@pld-linux.org> 0226b76
- Release 2 (by relup.sh) * Sun Jan 23 2022 Arkadiusz Miśkiewicz <arekm@maven.pl> 6b38fc7
- Up to 3.7.0. * Mon Jul 26 2021 Elan Ruusamäe <glen@pld-linux.org> cb8c1b5
- Up to 3.5.1; PHP 8 support * Fri Mar 05 2021 Elan Ruusamäe <glen@pld-linux.org> 881d33e
- Release 6 * Fri Mar 05 2021 Elan Ruusamäe <glen@pld-linux.org> 5ee919f
- Skip localContrastImage test * Fri Mar 05 2021 Elan Ruusamäe <glen@pld-linux.org> fec66c9
- Update more failed tests * Fri Mar 05 2021 Elan Ruusamäe <glen@pld-linux.org> 96575c7
- Update failed tests * Fri Mar 05 2021 Elan Ruusamäe <glen@pld-linux.org> 6807139
- Release 5 * Fri Mar 05 2021 Elan Ruusamäe <glen@pld-linux.org> 671f177
- Fix for rpm 4.16 * Sun Feb 07 2021 Jan Rękorajski <baggins@pld-linux.org> 6d92c22
- release 4 (by relup.sh) * Sat Mar 14 2020 Arkadiusz Miśkiewicz <arekm@maven.pl> e795c55
- release 3 (by relup.sh) * Mon Sep 23 2019 Elan Ruusamäe <glen@pld-linux.org> 7628200
- Always perform module load test * Mon Sep 23 2019 Elan Ruusamäe <glen@pld-linux.org> e8211de
- Fix build on PHP 7.4 without shared builtin extensions * Mon Sep 23 2019 Elan Ruusamäe <glen@delfi.ee> 88904c6
- Rebuild with 7.4 RC2 - release 2 (by relup.sh) * Sun Jun 23 2019 Elan Ruusamäe <glen@pld-linux.org> 90d6d7a
- up to 3.4.4 * Wed Oct 31 2018 Elan Ruusamäe <glen@pld-linux.org> fa75259
- disable failing test: tests/229_Tutorial_fxAnalyzeImage_case1.phpt * Wed Oct 31 2018 Elan Ruusamäe <glen@pld-linux.org> 4f00096
- provide imagick library version built against + rpm -Uhv --nodeps --define '_topdir /tmp/B.d8zfpy5u' --define '_specdir %{_topdir}' --define '_sourcedir %{_specdir}' --define '_rpmdir %{_topdir}/RPMS' --define '_builddir %{_topdir}/BUILD' --without tests --define 'php_suffix 52' php52-pecl-imagick-3.7.0-4.src.rpm Updating / installing... php52-pecl-imagick-3.7.0-4 ######################################## + rm -f php52-pecl-imagick-3.7.0-4.src.rpm + install -m 700 -d /tmp/B.d8zfpy5u/BUILD/tmp + TMPDIR=/tmp/B.d8zfpy5u/BUILD/tmp + exec nice -n 0 rpmbuild -bp --short-circuit --nodeps --define '_topdir /tmp/B.d8zfpy5u' --define '_specdir %{_topdir}' --define '_sourcedir %{_specdir}' --define '_rpmdir %{_topdir}/RPMS' --define '_builddir %{_topdir}/BUILD' --without tests --target i686-pld-linux --define 'php_suffix 52' --define 'prep exit 0' /tmp/B.d8zfpy5u/php-pecl-imagick.spec warning: Could not canonicalize hostname: nereid Building target platforms: i686-pld-linux Building for target i686-pld-linux RPM build warnings: Could not canonicalize hostname: nereid checking BuildConflict-ing packages rpm: warning: Could not canonicalize hostname: nereid rpm: error: Failed build dependencies: rpm: php52-devel >= 4:5.3 is needed by php52-pecl-imagick-3.7.0-4.i686 rpm: Building target platforms: i686-pld-linux rpm: Building for target i686-pld-linux rpm: rpm: RPM build warnings: rpm: Could not canonicalize hostname: nereid no BuildConflicts found checking BR rpm: warning: Could not canonicalize hostname: nereid rpm: error: Failed build dependencies: rpm: php52-devel >= 4:5.3 is needed by php52-pecl-imagick-3.7.0-4.i686 rpm: Building target platforms: i686-pld-linux rpm: Building for target i686-pld-linux rpm: rpm: RPM build warnings: rpm: Could not canonicalize hostname: nereid updating poldek cache... ready is up to date th is up to date th is up to date th-ready is up to date th-ready is up to date th-test is up to date th-test is up to date checking conflicting packages in BRed packages poldek: Loading [pndir]ready... poldek: Loading [pndir]th-test... poldek: Loading [pndir]th-test... poldek: Loading [pndir]th-ready... poldek: Loading [pndir]th-ready... poldek: Loading [pndir]th... poldek: Loading [pndir]th... poldek: 33176 packages read poldek: Removed 2403 duplicate packages from available set poldek: Processing dependencies... poldek: php53-devel-5.3.29-65 obsoleted by php52-devel-5.2.17-20130717.41 poldek: There are 1 package to install, 1 to remove: poldek: A php52-devel-5.2.17-20130717.41 poldek: R php53-devel-5.3.29-65 poldek: This operation will free 229.3KB of disk space. poldek: Need to get 330.4KB of archives (330.4KB to download). poldek: poldek: Retrieving th::php52-devel-5.2.17-20130717.41.i686.rpm.....................................done poldek: php52-devel-5.2.17-20130717.41.i686.rpm: digests OK poldek: Executing pm-command.sh --upgrade -vh --test --root / --define _check_dirname_deps 0... poldek: warning: /root/.cache/poldek/ftp_ftp1.pld-linux.org.dists.th.PLD.i686.RPMS/php52-devel-5.2.17-20130717.41.i686.rpm: Header V4 DSA/SHA1 Signature, key ID e4f1bc2d: NOKEY poldek: Verifying... ######################################## poldek: Preparing... ######################################## no conflicts found checking BR rpm: warning: Could not canonicalize hostname: nereid rpm: error: Failed build dependencies: rpm: php52-devel >= 4:5.3 is needed by php52-pecl-imagick-3.7.0-4.i686 rpm: Building target platforms: i686-pld-linux rpm: Building for target i686-pld-linux rpm: rpm: RPM build warnings: rpm: Could not canonicalize hostname: nereid installing BR: php52\-devel + poldek --noask --caplookup -Q -v '--ignore=hhvm-*' '--ignore=php4-*' '--ignore=php53-*' '--ignore=php54-*' '--ignore=php55-*' '--ignore=php56-*' '--ignore=php70-*' '--ignore=php71-*' '--ignore=php72-*' '--ignore=php73-*' '--ignore=php74-*' '--ignore=php80-*' '--ignore=php81-*' '--ignore=php82-*' --upgrade php52-devel Loading [pndir]ready... Loading [pndir]th-test... Loading [pndir]th-test... Loading [pndir]th-ready... Loading [pndir]th-ready... Loading [pndir]th... Loading [pndir]th... 33176 packages read Removed 2403 duplicate packages from available set Processing dependencies... php53-devel-5.3.29-65 obsoleted by php52-devel-5.2.17-20130717.41 There are 1 package to install, 1 to remove: A php52-devel-5.2.17-20130717.41 R php53-devel-5.3.29-65 This operation will free 229.3KB of disk space. php52-devel-5.2.17-20130717.41.i686.rpm: digests OK Need to get 330.4KB of archives. php52-devel-5.2.17-20130717.41.i686.rpm: digests OK Executing pm-command.sh --upgrade -vh --root / --define _check_dirname_deps 0... warning: /root/.cache/poldek/ftp_ftp1.pld-linux.org.dists.th.PLD.i686.RPMS/php52-devel-5.2.17-20130717.41.i686.rpm: Header V4 DSA/SHA1 Signature, key ID e4f1bc2d: NOKEY Verifying... ######################################## Preparing... ######################################## Updating / installing... php52-devel-4:5.2.17-20130717.41 ######################################## Cleaning up / removing... php53-devel-4:5.3.29-65 ######################################## building RPM using: set -ex; : build-id: 207d7545-1149-4e04-824d-875062a0d100; TMPDIR=/tmp/B.d8zfpy5u/BUILD/tmp exec nice -n 0 rpmbuild -bb --define '__jobs 28' --define '_smp_mflags -j28' --define '_make_opts -Otarget' --define '_pld_builder 1' --define '_topdir /tmp/B.d8zfpy5u' --define '_specdir %{_topdir}' --define '_sourcedir %{_specdir}' --define '_rpmdir %{_topdir}/RPMS' --define '_builddir %{_topdir}/BUILD' --without tests --target i686-pld-linux --define 'php_suffix 52' /tmp/B.d8zfpy5u/php-pecl-imagick.spec + : build-id: 207d7545-1149-4e04-824d-875062a0d100 + TMPDIR=/tmp/B.d8zfpy5u/BUILD/tmp + exec nice -n 0 rpmbuild -bb --define '__jobs 28' --define '_smp_mflags -j28' --define '_make_opts -Otarget' --define '_pld_builder 1' --define '_topdir /tmp/B.d8zfpy5u' --define '_specdir %{_topdir}' --define '_sourcedir %{_specdir}' --define '_rpmdir %{_topdir}/RPMS' --define '_builddir %{_topdir}/BUILD' --without tests --target i686-pld-linux --define 'php_suffix 52' /tmp/B.d8zfpy5u/php-pecl-imagick.spec warning: Could not canonicalize hostname: nereid error: Failed build dependencies: php52-devel >= 4:5.3 is needed by php52-pecl-imagick-3.7.0-4.i686 Building target platforms: i686-pld-linux Building for target i686-pld-linux RPM build warnings: Could not canonicalize hostname: nereid ended at: Fri Jan 26 12:00:19 2024, done in 0:00:00.371099 error: No files produced. + chmod -R u+rwX /tmp/B.d8zfpy5u/BUILD + rm -rf /tmp/B.d8zfpy5u/tmp /tmp/B.d8zfpy5u/BUILD + rm -rf /tmp/B.d8zfpy5u Begin-PLD-Builder-Info Build-Time: user:7.68s sys:2.87s real:25.61s (faults io:0 non-io:479660) End-PLD-Builder-Info
[Back to list of logs] [View rpm -qa of builder]