FailedOk

th/SRPMS[OK]
th/x32[OK]
th/i686[OK]
th/x86_64[OK]

ac/SRPMS[OK]
ac/i386[OK]
ac/i586[OK]
ac/i686[OK]
ac/alpha[OK]
ac/amd64[OK]
ac/athlon[OK]
ac/ppc[OK]
ac/sparc[OK]
ac/sparc64[OK]

Advanced Search
main()
Powered by PLD Linux
(c) 2002-2024 PLD Team
$Revision: 1.37 $
Powered by ITS.
Your IP: 44.200.140.218

postgresql 7baac286-dd5e-416e-8d98-70ad2a7873e0

Status:Failed
Source URL:https://buildlogs.pld-linux.org/pld/th/i686/FAIL/postgresql,7baac286-dd5e-416e-8d98-70ad2a7873e0.bz2
text/plain URL:View!
full text:View!
rpm -qa of builder:View!
Date:2024/06/30 14:03:44
Runtime:0:02:18.384971

Toc:

  • error 1
  • make[1]: *** [GNUmakefile:118: check] Error 1
  • error 2
  • error: Bad exit status from /tmp/B.j7oxjqyr/BUILD/tmp/rpm-tmp.jCsGJr (%build)
  • error 3
  • RPM build errors:
  • error 4
  • error: No files produced.

Content:

     alter_generic                ... ok           97 ms
     alter_operator               ... ok           31 ms
     misc                         ... ok          110 ms
     async                        ... ok           18 ms
     dbsize                       ... ok           18 ms
     merge                        ... ok          252 ms
     misc_functions               ... ok           72 ms
     sysviews                     ... ok           66 ms
     tsrf                         ... ok           46 ms
     tid                          ... ok           47 ms
     tidscan                      ... ok           45 ms
     tidrangescan                 ... ok           32 ms
     collate.icu.utf8             ... ok           20 ms
     incremental_sort             ... ok          110 ms
     create_role                  ... ok           48 ms
parallel group (6 tests):  collate.linux.utf8 amutils psql_crosstab rules psql stats_ext
     rules                        ... ok          340 ms
     psql                         ... ok          358 ms
     psql_crosstab                ... ok           37 ms
     amutils                      ... ok           27 ms
     stats_ext                    ... ok         1184 ms
     collate.linux.utf8           ... ok           16 ms
test select_parallel              ... ok          962 ms
test write_parallel               ... ok          114 ms
test vacuum_parallel              ... ok          125 ms
parallel group (2 tests):  subscription publication
     publication                  ... ok          381 ms
     subscription                 ... ok           56 ms
parallel group (17 tests):  portals_p2 advisory_lock combocid xmlmap functional_deps tsdicts equivclass guc dependency select_views window bitmapops tsearch indirect_toast cluster foreign_data foreign_key
     select_views                 ... ok          118 ms
     portals_p2                   ... ok           28 ms
     foreign_key                  ... ok         1010 ms
     cluster                      ... ok          303 ms
     dependency                   ... ok           74 ms
     guc                          ... ok           73 ms
     bitmapops                    ... ok          241 ms
     combocid                     ... ok           42 ms
     tsearch                      ... ok          252 ms
     tsdicts                      ... ok           54 ms
     foreign_data                 ... ok          443 ms
     window                       ... ok          226 ms
     xmlmap                       ... ok           43 ms
     functional_deps              ... ok           51 ms
     advisory_lock                ... ok           31 ms
     indirect_toast               ... ok          253 ms
     equivclass                   ... ok           59 ms
parallel group (6 tests):  jsonpath_encoding json_encoding jsonpath jsonb_jsonpath json jsonb
     json                         ... ok          108 ms
     jsonb                        ... ok          297 ms
     json_encoding                ... ok           21 ms
     jsonpath                     ... ok           41 ms
     jsonpath_encoding            ... ok           20 ms
     jsonb_jsonpath               ... ok           88 ms
parallel group (18 tests):  prepare returning limit plancache conversion temp copy2 polymorphism rowtypes with rangefuncs largeobject sequence domain truncate plpgsql xml alter_table
     plancache                    ... ok           81 ms
     limit                        ... ok           68 ms
     plpgsql                      ... ok          524 ms
     copy2                        ... ok          132 ms
     temp                         ... ok          130 ms
     domain                       ... ok          267 ms
     rangefuncs                   ... ok          206 ms
     prepare                      ... ok           42 ms
     conversion                   ... ok           85 ms
     truncate                     ... ok          295 ms
     alter_table                  ... ok         1439 ms
     sequence                     ... ok          220 ms
     polymorphism                 ... ok          160 ms
     rowtypes                     ... ok          172 ms
     returning                    ... ok           49 ms
     largeobject                  ... ok          207 ms
     with                         ... ok          197 ms
     xml                          ... FAILED     1049 ms
parallel group (12 tests):  hash_part explain reloptions partition_info memoize compression stats partition_aggregate indexing partition_join tuplesort partition_prune
     partition_join               ... ok          795 ms
     partition_prune              ... ok          870 ms
     reloptions                   ... ok           49 ms
     hash_part                    ... ok           34 ms
     indexing                     ... ok          760 ms
     partition_aggregate          ... ok          593 ms
     partition_info               ... ok           69 ms
     tuplesort                    ... ok          863 ms
     explain                      ... ok           42 ms
     compression                  ... ok          120 ms
     memoize                      ... ok           91 ms
     stats                        ... ok          532 ms
parallel group (2 tests):  event_trigger oidjoins
     event_trigger                ... ok          127 ms
     oidjoins                     ... ok          207 ms
test fast_default                 ... ok          195 ms
============== shutting down postmaster               ==============

========================
 1 of 212 tests failed. 
========================

The differences that caused some tests to fail can be viewed in the
file "/tmp/B.j7oxjqyr/BUILD/postgresql-15.6/src/test/regress/regression.diffs".  A copy of the test summary that you see
above is saved in the file "/tmp/B.j7oxjqyr/BUILD/postgresql-15.6/src/test/regress/regression.out".

make[1]: *** [GNUmakefile:118: check] Error 1
make[1]: Leaving directory '/tmp/B.j7oxjqyr/BUILD/postgresql-15.6/src/test/regress'
make: *** [GNUmakefile:69: check] Error 2
error: Bad exit status from /tmp/B.j7oxjqyr/BUILD/tmp/rpm-tmp.jCsGJr (%build)

RPM build warnings:
    line 119: It's not recommended to have unversioned Obsoletes: Obsoletes:	postgresql-server
    line 120: It's not recommended to have unversioned Obsoletes: Obsoletes:	postgresql-test
    Could not canonicalize hostname: nereid

RPM build errors:
    Bad exit status from /tmp/B.j7oxjqyr/BUILD/tmp/rpm-tmp.jCsGJr (%build)
ended at: Sun Jun 30 14:03:42 2024, done in 0:02:18.384971
error: No files produced.
+ chmod -R u+rwX /tmp/B.j7oxjqyr/BUILD
+ rm -rf /tmp/B.j7oxjqyr/tmp /tmp/B.j7oxjqyr/BUILD
+ rm -rf /tmp/B.j7oxjqyr
Begin-PLD-Builder-Info
Build-Time: user:635.70s sys:76.65s real:143.28s (faults io:258 non-io:9719390)

End-PLD-Builder-Info
[Back to list of logs] [View rpm -qa of builder]