FailedOk

th/SRPMS[OK]
th/x32[OK]
th/i686[OK]
th/x86_64[OK]

ac/SRPMS[OK]
ac/i386[OK]
ac/i586[OK]
ac/i686[OK]
ac/alpha[OK]
ac/amd64[OK]
ac/athlon[OK]
ac/ppc[OK]
ac/sparc[OK]
ac/sparc64[OK]

Advanced Search
main()
Powered by PLD Linux
(c) 2002-2021 PLD Team
$Revision: 1.37 $
Powered by Microsoft Windows 2003.
Your IP: 54.80.173.217

python-lxml 3f308749-2942-44e6-b7be-0cce552b8d0a

Status:Failed
Source URL:https://buildlogs.pld-linux.org/pld/th/i686/FAIL/python-lxml,3f308749-2942-44e6-b7be-0cce552b8d0a.bz2
text/plain URL:View!
full text:View!
rpm -qa of builder:View!
Date:2021/11/21 04:20:55
Runtime:0:02:21.783959

Toc:

  • error 1
  • FAIL: test_html_prefix_nsmap (lxml.tests.test_etree.ETreeOnlyTestCase)
  • error 2
  • AssertionError: {'hha': None} != {}
  • error 3
  • error: Bad exit status from /tmp/B.3yqn1p_z/BUILD/tmp/rpm-tmp.UgEg2o (%build)
  • error 4
  • RPM build errors:
  • error 5
  • error: No files produced.

Content:

creating build-2
creating build-2/lib.linux-i686-2.7
creating build-2/lib.linux-i686-2.7/lxml
copying src/lxml/sax.py -> build-2/lib.linux-i686-2.7/lxml
copying src/lxml/_elementpath.py -> build-2/lib.linux-i686-2.7/lxml
copying src/lxml/builder.py -> build-2/lib.linux-i686-2.7/lxml
copying src/lxml/ElementInclude.py -> build-2/lib.linux-i686-2.7/lxml
copying src/lxml/__init__.py -> build-2/lib.linux-i686-2.7/lxml
copying src/lxml/usedoctest.py -> build-2/lib.linux-i686-2.7/lxml
copying src/lxml/cssselect.py -> build-2/lib.linux-i686-2.7/lxml
copying src/lxml/pyclasslookup.py -> build-2/lib.linux-i686-2.7/lxml
copying src/lxml/doctestcompare.py -> build-2/lib.linux-i686-2.7/lxml
creating build-2/lib.linux-i686-2.7/lxml/includes
copying src/lxml/includes/__init__.py -> build-2/lib.linux-i686-2.7/lxml/includes
creating build-2/lib.linux-i686-2.7/lxml/html
copying src/lxml/html/diff.py -> build-2/lib.linux-i686-2.7/lxml/html
copying src/lxml/html/ElementSoup.py -> build-2/lib.linux-i686-2.7/lxml/html
copying src/lxml/html/html5parser.py -> build-2/lib.linux-i686-2.7/lxml/html
copying src/lxml/html/builder.py -> build-2/lib.linux-i686-2.7/lxml/html
copying src/lxml/html/__init__.py -> build-2/lib.linux-i686-2.7/lxml/html
copying src/lxml/html/usedoctest.py -> build-2/lib.linux-i686-2.7/lxml/html
copying src/lxml/html/_setmixin.py -> build-2/lib.linux-i686-2.7/lxml/html
copying src/lxml/html/clean.py -> build-2/lib.linux-i686-2.7/lxml/html
copying src/lxml/html/soupparser.py -> build-2/lib.linux-i686-2.7/lxml/html
copying src/lxml/html/_html5builder.py -> build-2/lib.linux-i686-2.7/lxml/html
copying src/lxml/html/_diffcommand.py -> build-2/lib.linux-i686-2.7/lxml/html
copying src/lxml/html/formfill.py -> build-2/lib.linux-i686-2.7/lxml/html
copying src/lxml/html/defs.py -> build-2/lib.linux-i686-2.7/lxml/html
creating build-2/lib.linux-i686-2.7/lxml/isoschematron
copying src/lxml/isoschematron/__init__.py -> build-2/lib.linux-i686-2.7/lxml/isoschematron
copying src/lxml/etree.h -> build-2/lib.linux-i686-2.7/lxml
copying src/lxml/etree_api.h -> build-2/lib.linux-i686-2.7/lxml
copying src/lxml/lxml.etree.h -> build-2/lib.linux-i686-2.7/lxml
copying src/lxml/lxml.etree_api.h -> build-2/lib.linux-i686-2.7/lxml
copying src/lxml/includes/etreepublic.pxd -> build-2/lib.linux-i686-2.7/lxml/includes
copying src/lxml/includes/xinclude.pxd -> build-2/lib.linux-i686-2.7/lxml/includes
copying src/lxml/includes/xmlerror.pxd -> build-2/lib.linux-i686-2.7/lxml/includes
copying src/lxml/includes/htmlparser.pxd -> build-2/lib.linux-i686-2.7/lxml/includes
copying src/lxml/includes/config.pxd -> build-2/lib.linux-i686-2.7/lxml/includes
copying src/lxml/includes/__init__.pxd -> build-2/lib.linux-i686-2.7/lxml/includes
copying src/lxml/includes/xmlschema.pxd -> build-2/lib.linux-i686-2.7/lxml/includes
copying src/lxml/includes/uri.pxd -> build-2/lib.linux-i686-2.7/lxml/includes
copying src/lxml/includes/xslt.pxd -> build-2/lib.linux-i686-2.7/lxml/includes
copying src/lxml/includes/tree.pxd -> build-2/lib.linux-i686-2.7/lxml/includes
copying src/lxml/includes/xmlparser.pxd -> build-2/lib.linux-i686-2.7/lxml/includes
copying src/lxml/includes/dtdvalid.pxd -> build-2/lib.linux-i686-2.7/lxml/includes
copying src/lxml/includes/xpath.pxd -> build-2/lib.linux-i686-2.7/lxml/includes
copying src/lxml/includes/relaxng.pxd -> build-2/lib.linux-i686-2.7/lxml/includes
copying src/lxml/includes/c14n.pxd -> build-2/lib.linux-i686-2.7/lxml/includes
copying src/lxml/includes/schematron.pxd -> build-2/lib.linux-i686-2.7/lxml/includes
copying src/lxml/includes/etree_defs.h -> build-2/lib.linux-i686-2.7/lxml/includes
copying src/lxml/includes/lxml-version.h -> build-2/lib.linux-i686-2.7/lxml/includes
creating build-2/lib.linux-i686-2.7/lxml/isoschematron/resources
creating build-2/lib.linux-i686-2.7/lxml/isoschematron/resources/rng
copying src/lxml/isoschematron/resources/rng/iso-schematron.rng -> build-2/lib.linux-i686-2.7/lxml/isoschematron/resources/rng
creating build-2/lib.linux-i686-2.7/lxml/isoschematron/resources/xsl
copying src/lxml/isoschematron/resources/xsl/RNG2Schtrn.xsl -> build-2/lib.linux-i686-2.7/lxml/isoschematron/resources/xsl
copying src/lxml/isoschematron/resources/xsl/XSD2Schtrn.xsl -> build-2/lib.linux-i686-2.7/lxml/isoschematron/resources/xsl
creating build-2/lib.linux-i686-2.7/lxml/isoschematron/resources/xsl/iso-schematron-xslt1
copying src/lxml/isoschematron/resources/xsl/iso-schematron-xslt1/iso_dsdl_include.xsl -> build-2/lib.linux-i686-2.7/lxml/isoschematron/resources/xsl/iso-schematron-xslt1
copying src/lxml/isoschematron/resources/xsl/iso-schematron-xslt1/iso_abstract_expand.xsl -> build-2/lib.linux-i686-2.7/lxml/isoschematron/resources/xsl/iso-schematron-xslt1
copying src/lxml/isoschematron/resources/xsl/iso-schematron-xslt1/iso_schematron_skeleton_for_xslt1.xsl -> build-2/lib.linux-i686-2.7/lxml/isoschematron/resources/xsl/iso-schematron-xslt1
copying src/lxml/isoschematron/resources/xsl/iso-schematron-xslt1/iso_schematron_message.xsl -> build-2/lib.linux-i686-2.7/lxml/isoschematron/resources/xsl/iso-schematron-xslt1
copying src/lxml/isoschematron/resources/xsl/iso-schematron-xslt1/iso_svrl_for_xslt1.xsl -> build-2/lib.linux-i686-2.7/lxml/isoschematron/resources/xsl/iso-schematron-xslt1
copying src/lxml/isoschematron/resources/xsl/iso-schematron-xslt1/readme.txt -> build-2/lib.linux-i686-2.7/lxml/isoschematron/resources/xsl/iso-schematron-xslt1
running build_ext
building 'lxml.etree' extension
creating build-2/temp.linux-i686-2.7
creating build-2/temp.linux-i686-2.7/src
creating build-2/temp.linux-i686-2.7/src/lxml
i686-pld-linux-gcc -fno-strict-aliasing -O2 -fwrapv -pipe -Wformat -Werror=format-security -gdwarf-4 -fno-debug-types-section -fvar-tracking-assignments -g2 -Wp,-D_FORTIFY_SOURCE=2 -fstack-protector-strong --param=ssp-buffer-size=4 -Werror=trampolines -fomit-frame-pointer -march=i686 -fasynchronous-unwind-tables -mtune=pentium4 -gdwarf-4 -fno-debug-types-section -fvar-tracking-assignments -g2 -DNDEBUG -O2 -fwrapv -pipe -Wformat -Werror=format-security -gdwarf-4 -fno-debug-types-section -fvar-tracking-assignments -g2 -Wp,-D_FORTIFY_SOURCE=2 -fstack-protector-strong --param=ssp-buffer-size=4 -Werror=trampolines -fomit-frame-pointer -march=i686 -fasynchronous-unwind-tables -mtune=pentium4 -gdwarf-4 -fno-debug-types-section -fvar-tracking-assignments -g2 -O2 -fwrapv -pipe -Wformat -Werror=format-security -gdwarf-4 -fno-debug-types-section -fvar-tracking-assignments -g2 -Wp,-D_FORTIFY_SOURCE=2 -fstack-protector-strong --param=ssp-buffer-size=4 -Werror=trampolines -fomit-frame-pointer -march=i686 -fasynchronous-unwind-tables -mtune=pentium4 -gdwarf-4 -fno-debug-types-section -fvar-tracking-assignments -g2 -fPIC -DCYTHON_CLINE_IN_TRACEBACK=0 -I/usr/include/libxml2 -Isrc -Isrc/lxml/includes -I/usr/include/python2.7 -c src/lxml/etree.c -o build-2/temp.linux-i686-2.7/src/lxml/etree.o -w
i686-pld-linux-gcc -shared -Wl,--as-needed -Wl,--no-copy-dt-needed-entries -Wl,-z,relro -Wl,-z,combreloc -Wl,--as-needed -Wl,--no-copy-dt-needed-entries -Wl,-z,relro -Wl,-z,combreloc -O2 -fwrapv -pipe -Wformat -Werror=format-security -gdwarf-4 -fno-debug-types-section -fvar-tracking-assignments -g2 -Wp,-D_FORTIFY_SOURCE=2 -fstack-protector-strong --param=ssp-buffer-size=4 -Werror=trampolines -fomit-frame-pointer -march=i686 -fasynchronous-unwind-tables -mtune=pentium4 -gdwarf-4 -fno-debug-types-section -fvar-tracking-assignments -g2 build-2/temp.linux-i686-2.7/src/lxml/etree.o -L/usr/lib -lxslt -lexslt -lxml2 -lrt -lz -lm -lpython2.7 -o build-2/lib.linux-i686-2.7/lxml/etree.so
building 'lxml.objectify' extension
i686-pld-linux-gcc -fno-strict-aliasing -O2 -fwrapv -pipe -Wformat -Werror=format-security -gdwarf-4 -fno-debug-types-section -fvar-tracking-assignments -g2 -Wp,-D_FORTIFY_SOURCE=2 -fstack-protector-strong --param=ssp-buffer-size=4 -Werror=trampolines -fomit-frame-pointer -march=i686 -fasynchronous-unwind-tables -mtune=pentium4 -gdwarf-4 -fno-debug-types-section -fvar-tracking-assignments -g2 -DNDEBUG -O2 -fwrapv -pipe -Wformat -Werror=format-security -gdwarf-4 -fno-debug-types-section -fvar-tracking-assignments -g2 -Wp,-D_FORTIFY_SOURCE=2 -fstack-protector-strong --param=ssp-buffer-size=4 -Werror=trampolines -fomit-frame-pointer -march=i686 -fasynchronous-unwind-tables -mtune=pentium4 -gdwarf-4 -fno-debug-types-section -fvar-tracking-assignments -g2 -O2 -fwrapv -pipe -Wformat -Werror=format-security -gdwarf-4 -fno-debug-types-section -fvar-tracking-assignments -g2 -Wp,-D_FORTIFY_SOURCE=2 -fstack-protector-strong --param=ssp-buffer-size=4 -Werror=trampolines -fomit-frame-pointer -march=i686 -fasynchronous-unwind-tables -mtune=pentium4 -gdwarf-4 -fno-debug-types-section -fvar-tracking-assignments -g2 -fPIC -DCYTHON_CLINE_IN_TRACEBACK=0 -I/usr/include/libxml2 -Isrc -Isrc/lxml/includes -I/usr/include/python2.7 -c src/lxml/objectify.c -o build-2/temp.linux-i686-2.7/src/lxml/objectify.o -w
i686-pld-linux-gcc -shared -Wl,--as-needed -Wl,--no-copy-dt-needed-entries -Wl,-z,relro -Wl,-z,combreloc -Wl,--as-needed -Wl,--no-copy-dt-needed-entries -Wl,-z,relro -Wl,-z,combreloc -O2 -fwrapv -pipe -Wformat -Werror=format-security -gdwarf-4 -fno-debug-types-section -fvar-tracking-assignments -g2 -Wp,-D_FORTIFY_SOURCE=2 -fstack-protector-strong --param=ssp-buffer-size=4 -Werror=trampolines -fomit-frame-pointer -march=i686 -fasynchronous-unwind-tables -mtune=pentium4 -gdwarf-4 -fno-debug-types-section -fvar-tracking-assignments -g2 build-2/temp.linux-i686-2.7/src/lxml/objectify.o -L/usr/lib -lxslt -lexslt -lxml2 -lrt -lz -lm -lpython2.7 -o build-2/lib.linux-i686-2.7/lxml/objectify.so
building 'lxml.builder' extension
i686-pld-linux-gcc -fno-strict-aliasing -O2 -fwrapv -pipe -Wformat -Werror=format-security -gdwarf-4 -fno-debug-types-section -fvar-tracking-assignments -g2 -Wp,-D_FORTIFY_SOURCE=2 -fstack-protector-strong --param=ssp-buffer-size=4 -Werror=trampolines -fomit-frame-pointer -march=i686 -fasynchronous-unwind-tables -mtune=pentium4 -gdwarf-4 -fno-debug-types-section -fvar-tracking-assignments -g2 -DNDEBUG -O2 -fwrapv -pipe -Wformat -Werror=format-security -gdwarf-4 -fno-debug-types-section -fvar-tracking-assignments -g2 -Wp,-D_FORTIFY_SOURCE=2 -fstack-protector-strong --param=ssp-buffer-size=4 -Werror=trampolines -fomit-frame-pointer -march=i686 -fasynchronous-unwind-tables -mtune=pentium4 -gdwarf-4 -fno-debug-types-section -fvar-tracking-assignments -g2 -O2 -fwrapv -pipe -Wformat -Werror=format-security -gdwarf-4 -fno-debug-types-section -fvar-tracking-assignments -g2 -Wp,-D_FORTIFY_SOURCE=2 -fstack-protector-strong --param=ssp-buffer-size=4 -Werror=trampolines -fomit-frame-pointer -march=i686 -fasynchronous-unwind-tables -mtune=pentium4 -gdwarf-4 -fno-debug-types-section -fvar-tracking-assignments -g2 -fPIC -DCYTHON_CLINE_IN_TRACEBACK=0 -I/usr/include/libxml2 -Isrc -Isrc/lxml/includes -I/usr/include/python2.7 -c src/lxml/builder.c -o build-2/temp.linux-i686-2.7/src/lxml/builder.o -w
i686-pld-linux-gcc -shared -Wl,--as-needed -Wl,--no-copy-dt-needed-entries -Wl,-z,relro -Wl,-z,combreloc -Wl,--as-needed -Wl,--no-copy-dt-needed-entries -Wl,-z,relro -Wl,-z,combreloc -O2 -fwrapv -pipe -Wformat -Werror=format-security -gdwarf-4 -fno-debug-types-section -fvar-tracking-assignments -g2 -Wp,-D_FORTIFY_SOURCE=2 -fstack-protector-strong --param=ssp-buffer-size=4 -Werror=trampolines -fomit-frame-pointer -march=i686 -fasynchronous-unwind-tables -mtune=pentium4 -gdwarf-4 -fno-debug-types-section -fvar-tracking-assignments -g2 build-2/temp.linux-i686-2.7/src/lxml/builder.o -L/usr/lib -lpython2.7 -o build-2/lib.linux-i686-2.7/lxml/builder.so
building 'lxml._elementpath' extension
i686-pld-linux-gcc -fno-strict-aliasing -O2 -fwrapv -pipe -Wformat -Werror=format-security -gdwarf-4 -fno-debug-types-section -fvar-tracking-assignments -g2 -Wp,-D_FORTIFY_SOURCE=2 -fstack-protector-strong --param=ssp-buffer-size=4 -Werror=trampolines -fomit-frame-pointer -march=i686 -fasynchronous-unwind-tables -mtune=pentium4 -gdwarf-4 -fno-debug-types-section -fvar-tracking-assignments -g2 -DNDEBUG -O2 -fwrapv -pipe -Wformat -Werror=format-security -gdwarf-4 -fno-debug-types-section -fvar-tracking-assignments -g2 -Wp,-D_FORTIFY_SOURCE=2 -fstack-protector-strong --param=ssp-buffer-size=4 -Werror=trampolines -fomit-frame-pointer -march=i686 -fasynchronous-unwind-tables -mtune=pentium4 -gdwarf-4 -fno-debug-types-section -fvar-tracking-assignments -g2 -O2 -fwrapv -pipe -Wformat -Werror=format-security -gdwarf-4 -fno-debug-types-section -fvar-tracking-assignments -g2 -Wp,-D_FORTIFY_SOURCE=2 -fstack-protector-strong --param=ssp-buffer-size=4 -Werror=trampolines -fomit-frame-pointer -march=i686 -fasynchronous-unwind-tables -mtune=pentium4 -gdwarf-4 -fno-debug-types-section -fvar-tracking-assignments -g2 -fPIC -DCYTHON_CLINE_IN_TRACEBACK=0 -I/usr/include/libxml2 -Isrc -Isrc/lxml/includes -I/usr/include/python2.7 -c src/lxml/_elementpath.c -o build-2/temp.linux-i686-2.7/src/lxml/_elementpath.o -w
i686-pld-linux-gcc -shared -Wl,--as-needed -Wl,--no-copy-dt-needed-entries -Wl,-z,relro -Wl,-z,combreloc -Wl,--as-needed -Wl,--no-copy-dt-needed-entries -Wl,-z,relro -Wl,-z,combreloc -O2 -fwrapv -pipe -Wformat -Werror=format-security -gdwarf-4 -fno-debug-types-section -fvar-tracking-assignments -g2 -Wp,-D_FORTIFY_SOURCE=2 -fstack-protector-strong --param=ssp-buffer-size=4 -Werror=trampolines -fomit-frame-pointer -march=i686 -fasynchronous-unwind-tables -mtune=pentium4 -gdwarf-4 -fno-debug-types-section -fvar-tracking-assignments -g2 build-2/temp.linux-i686-2.7/src/lxml/_elementpath.o -L/usr/lib -lpython2.7 -o build-2/lib.linux-i686-2.7/lxml/_elementpath.so
building 'lxml.html.diff' extension
creating build-2/temp.linux-i686-2.7/src/lxml/html
i686-pld-linux-gcc -fno-strict-aliasing -O2 -fwrapv -pipe -Wformat -Werror=format-security -gdwarf-4 -fno-debug-types-section -fvar-tracking-assignments -g2 -Wp,-D_FORTIFY_SOURCE=2 -fstack-protector-strong --param=ssp-buffer-size=4 -Werror=trampolines -fomit-frame-pointer -march=i686 -fasynchronous-unwind-tables -mtune=pentium4 -gdwarf-4 -fno-debug-types-section -fvar-tracking-assignments -g2 -DNDEBUG -O2 -fwrapv -pipe -Wformat -Werror=format-security -gdwarf-4 -fno-debug-types-section -fvar-tracking-assignments -g2 -Wp,-D_FORTIFY_SOURCE=2 -fstack-protector-strong --param=ssp-buffer-size=4 -Werror=trampolines -fomit-frame-pointer -march=i686 -fasynchronous-unwind-tables -mtune=pentium4 -gdwarf-4 -fno-debug-types-section -fvar-tracking-assignments -g2 -O2 -fwrapv -pipe -Wformat -Werror=format-security -gdwarf-4 -fno-debug-types-section -fvar-tracking-assignments -g2 -Wp,-D_FORTIFY_SOURCE=2 -fstack-protector-strong --param=ssp-buffer-size=4 -Werror=trampolines -fomit-frame-pointer -march=i686 -fasynchronous-unwind-tables -mtune=pentium4 -gdwarf-4 -fno-debug-types-section -fvar-tracking-assignments -g2 -fPIC -DCYTHON_CLINE_IN_TRACEBACK=0 -I/usr/include/libxml2 -Isrc -Isrc/lxml/includes -I/usr/include/python2.7 -c src/lxml/html/diff.c -o build-2/temp.linux-i686-2.7/src/lxml/html/diff.o -w
i686-pld-linux-gcc -shared -Wl,--as-needed -Wl,--no-copy-dt-needed-entries -Wl,-z,relro -Wl,-z,combreloc -Wl,--as-needed -Wl,--no-copy-dt-needed-entries -Wl,-z,relro -Wl,-z,combreloc -O2 -fwrapv -pipe -Wformat -Werror=format-security -gdwarf-4 -fno-debug-types-section -fvar-tracking-assignments -g2 -Wp,-D_FORTIFY_SOURCE=2 -fstack-protector-strong --param=ssp-buffer-size=4 -Werror=trampolines -fomit-frame-pointer -march=i686 -fasynchronous-unwind-tables -mtune=pentium4 -gdwarf-4 -fno-debug-types-section -fvar-tracking-assignments -g2 build-2/temp.linux-i686-2.7/src/lxml/html/diff.o -L/usr/lib -lpython2.7 -o build-2/lib.linux-i686-2.7/lxml/html/diff.so
building 'lxml.html.clean' extension
i686-pld-linux-gcc -fno-strict-aliasing -O2 -fwrapv -pipe -Wformat -Werror=format-security -gdwarf-4 -fno-debug-types-section -fvar-tracking-assignments -g2 -Wp,-D_FORTIFY_SOURCE=2 -fstack-protector-strong --param=ssp-buffer-size=4 -Werror=trampolines -fomit-frame-pointer -march=i686 -fasynchronous-unwind-tables -mtune=pentium4 -gdwarf-4 -fno-debug-types-section -fvar-tracking-assignments -g2 -DNDEBUG -O2 -fwrapv -pipe -Wformat -Werror=format-security -gdwarf-4 -fno-debug-types-section -fvar-tracking-assignments -g2 -Wp,-D_FORTIFY_SOURCE=2 -fstack-protector-strong --param=ssp-buffer-size=4 -Werror=trampolines -fomit-frame-pointer -march=i686 -fasynchronous-unwind-tables -mtune=pentium4 -gdwarf-4 -fno-debug-types-section -fvar-tracking-assignments -g2 -O2 -fwrapv -pipe -Wformat -Werror=format-security -gdwarf-4 -fno-debug-types-section -fvar-tracking-assignments -g2 -Wp,-D_FORTIFY_SOURCE=2 -fstack-protector-strong --param=ssp-buffer-size=4 -Werror=trampolines -fomit-frame-pointer -march=i686 -fasynchronous-unwind-tables -mtune=pentium4 -gdwarf-4 -fno-debug-types-section -fvar-tracking-assignments -g2 -fPIC -DCYTHON_CLINE_IN_TRACEBACK=0 -I/usr/include/libxml2 -Isrc -Isrc/lxml/includes -I/usr/include/python2.7 -c src/lxml/html/clean.c -o build-2/temp.linux-i686-2.7/src/lxml/html/clean.o -w
i686-pld-linux-gcc -shared -Wl,--as-needed -Wl,--no-copy-dt-needed-entries -Wl,-z,relro -Wl,-z,combreloc -Wl,--as-needed -Wl,--no-copy-dt-needed-entries -Wl,-z,relro -Wl,-z,combreloc -O2 -fwrapv -pipe -Wformat -Werror=format-security -gdwarf-4 -fno-debug-types-section -fvar-tracking-assignments -g2 -Wp,-D_FORTIFY_SOURCE=2 -fstack-protector-strong --param=ssp-buffer-size=4 -Werror=trampolines -fomit-frame-pointer -march=i686 -fasynchronous-unwind-tables -mtune=pentium4 -gdwarf-4 -fno-debug-types-section -fvar-tracking-assignments -g2 build-2/temp.linux-i686-2.7/src/lxml/html/clean.o -L/usr/lib -lpython2.7 -o build-2/lib.linux-i686-2.7/lxml/html/clean.so
building 'lxml.sax' extension
i686-pld-linux-gcc -fno-strict-aliasing -O2 -fwrapv -pipe -Wformat -Werror=format-security -gdwarf-4 -fno-debug-types-section -fvar-tracking-assignments -g2 -Wp,-D_FORTIFY_SOURCE=2 -fstack-protector-strong --param=ssp-buffer-size=4 -Werror=trampolines -fomit-frame-pointer -march=i686 -fasynchronous-unwind-tables -mtune=pentium4 -gdwarf-4 -fno-debug-types-section -fvar-tracking-assignments -g2 -DNDEBUG -O2 -fwrapv -pipe -Wformat -Werror=format-security -gdwarf-4 -fno-debug-types-section -fvar-tracking-assignments -g2 -Wp,-D_FORTIFY_SOURCE=2 -fstack-protector-strong --param=ssp-buffer-size=4 -Werror=trampolines -fomit-frame-pointer -march=i686 -fasynchronous-unwind-tables -mtune=pentium4 -gdwarf-4 -fno-debug-types-section -fvar-tracking-assignments -g2 -O2 -fwrapv -pipe -Wformat -Werror=format-security -gdwarf-4 -fno-debug-types-section -fvar-tracking-assignments -g2 -Wp,-D_FORTIFY_SOURCE=2 -fstack-protector-strong --param=ssp-buffer-size=4 -Werror=trampolines -fomit-frame-pointer -march=i686 -fasynchronous-unwind-tables -mtune=pentium4 -gdwarf-4 -fno-debug-types-section -fvar-tracking-assignments -g2 -fPIC -DCYTHON_CLINE_IN_TRACEBACK=0 -I/usr/include/libxml2 -Isrc -Isrc/lxml/includes -I/usr/include/python2.7 -c src/lxml/sax.c -o build-2/temp.linux-i686-2.7/src/lxml/sax.o -w
i686-pld-linux-gcc -shared -Wl,--as-needed -Wl,--no-copy-dt-needed-entries -Wl,-z,relro -Wl,-z,combreloc -Wl,--as-needed -Wl,--no-copy-dt-needed-entries -Wl,-z,relro -Wl,-z,combreloc -O2 -fwrapv -pipe -Wformat -Werror=format-security -gdwarf-4 -fno-debug-types-section -fvar-tracking-assignments -g2 -Wp,-D_FORTIFY_SOURCE=2 -fstack-protector-strong --param=ssp-buffer-size=4 -Werror=trampolines -fomit-frame-pointer -march=i686 -fasynchronous-unwind-tables -mtune=pentium4 -gdwarf-4 -fno-debug-types-section -fvar-tracking-assignments -g2 build-2/temp.linux-i686-2.7/src/lxml/sax.o -L/usr/lib -lpython2.7 -o build-2/lib.linux-i686-2.7/lxml/sax.so
+ install -d testdir-2/src/lxml
+ cd testdir-2/src/lxml
+ ln -snf ../../../build-2/lib.linux-i686-2.7/lxml/ElementInclude.py ../../../build-2/lib.linux-i686-2.7/lxml/__init__.py ../../../build-2/lib.linux-i686-2.7/lxml/_elementpath.py ../../../build-2/lib.linux-i686-2.7/lxml/_elementpath.so ../../../build-2/lib.linux-i686-2.7/lxml/builder.py ../../../build-2/lib.linux-i686-2.7/lxml/builder.so ../../../build-2/lib.linux-i686-2.7/lxml/cssselect.py ../../../build-2/lib.linux-i686-2.7/lxml/doctestcompare.py ../../../build-2/lib.linux-i686-2.7/lxml/etree.h ../../../build-2/lib.linux-i686-2.7/lxml/etree.so ../../../build-2/lib.linux-i686-2.7/lxml/etree_api.h ../../../build-2/lib.linux-i686-2.7/lxml/html ../../../build-2/lib.linux-i686-2.7/lxml/includes ../../../build-2/lib.linux-i686-2.7/lxml/isoschematron ../../../build-2/lib.linux-i686-2.7/lxml/lxml.etree.h ../../../build-2/lib.linux-i686-2.7/lxml/lxml.etree_api.h ../../../build-2/lib.linux-i686-2.7/lxml/objectify.so ../../../build-2/lib.linux-i686-2.7/lxml/pyclasslookup.py ../../../build-2/lib.linux-i686-2.7/lxml/sax.py ../../../build-2/lib.linux-i686-2.7/lxml/sax.so ../../../build-2/lib.linux-i686-2.7/lxml/usedoctest.py ../../../src/lxml/tests .
+ cd ../..
+ ln -snf ../doc ../samples ../test.py .
+ LC_ALL=C.UTF-8 /usr/bin/python2 test.py -v
..............................................................................................................................................................................................................................................................................................................................................................................s...s...s...........................................................................................................s.............s..........................s.............................s.......s.........................................................................ss........................................................................................................................................................................................................................................................................................................................................................................................................................................................................................................................s.............s..................................................................................s...........................................................................................................................................................................................................................................................................................................................................................................................................................................................................................................................................................................
======================================================================
FAIL: test_html_prefix_nsmap (lxml.tests.test_etree.ETreeOnlyTestCase)
----------------------------------------------------------------------
Traceback (most recent call last):
  File "/usr/lib/python2.7/unittest/case.py", line 329, in run
    testMethod()
  File "/tmp/B.3yqn1p_z/BUILD/lxml-4.6.2/testdir-2/src/lxml/tests/test_etree.py", line 3039, in test_html_prefix_nsmap
    self.assertEqual({'hha': None}, el.nsmap)
  File "/usr/lib/python2.7/unittest/case.py", line 513, in assertEqual
    assertion_func(first, second, msg=msg)
  File "/usr/lib/python2.7/unittest/case.py", line 836, in assertDictEqual
    self.fail(self._formatMessage(msg, standardMsg))
  File "/usr/lib/python2.7/unittest/case.py", line 410, in fail
    raise self.failureException(msg)
AssertionError: {'hha': None} != {}
- {'hha': None}
+ {}

----------------------------------------------------------------------
Ran 1795 tests in 5.639s

FAILED (failures=1)
Comparing with ElementTree 1.3.0

TESTED VERSION: 4.6.2
    Python:           sys.version_info(major=2, minor=7, micro=18, releaselevel='final', serial=0)
    lxml.etree:       (4, 6, 2, 0)
    libxml used:      (2, 9, 12)
    libxml compiled:  (2, 9, 12)
    libxslt used:     (1, 1, 34)
    libxslt compiled: (1, 1, 34)
    FS encoding:      UTF-8
    Default encoding: ascii
    Max Unicode:      1114111

error: Bad exit status from /tmp/B.3yqn1p_z/BUILD/tmp/rpm-tmp.UgEg2o (%build)


RPM build errors:
    Macro expanded in comment on line 17: %{module}-%{version}.tgz

    Could not canonicalize hostname: nereid
    Bad exit status from /tmp/B.3yqn1p_z/BUILD/tmp/rpm-tmp.UgEg2o (%build)
ended at: Sun Nov 21 04:20:55 2021, done in 0:02:21.783959
error: No files produced.
+ chmod -R u+rwX /tmp/B.3yqn1p_z/BUILD
+ rm -rf /tmp/B.3yqn1p_z/tmp /tmp/B.3yqn1p_z/BUILD
+ rm -rf /tmp/B.3yqn1p_z
Begin-PLD-Builder-Info
Build-Time: user:142.19s sys:3.54s real:144.16s (faults io:1 non-io:713938)

End-PLD-Builder-Info
[Back to list of logs] [View rpm -qa of builder]