FailedOk

th/SRPMS[OK]
th/x32[OK]
th/i686[OK]
th/x86_64[OK]

ac/SRPMS[OK]
ac/i386[OK]
ac/i586[OK]
ac/i686[OK]
ac/alpha[OK]
ac/amd64[OK]
ac/athlon[OK]
ac/ppc[OK]
ac/sparc[OK]
ac/sparc64[OK]

Advanced Search
main()
Powered by PLD Linux
(c) 2002-2024 PLD Team
$Revision: 1.37 $
Powered by nasi tu byli.
Your IP: 35.174.62.162

python-positional ab7dbae0-4001-4e00-bda7-1b61fc6760ef

Status:Failed
Source URL:https://buildlogs.pld-linux.org/pld/th/i686/FAIL/python-positional,ab7dbae0-4001-4e00-bda7-1b61fc6760ef.bz2
text/plain URL:View!
full text:View!
rpm -qa of builder:View!
Date:2024/02/11 20:24:55
Runtime:0:00:06.459864

Toc:

  • error 1
  • Configuration error:
  • error 2
  • error: Bad exit status from /tmp/B.sqrpdx_h/BUILD/tmp/rpm-tmp.YfxYHK (%build)
  • error 3
  • RPM build errors:
  • error 4
  • error: No files produced.

Content:

TMPDIR=/tmp/B.sqrpdx_h/BUILD/tmp
+ umask 022
+ cd /tmp/B.sqrpdx_h/BUILD
+ cd positional-1.2.1
+ LDFLAGS='-Wl,--as-needed -Wl,--no-copy-dt-needed-entries -Wl,-z,relro -Wl,-z,combreloc ' 
+ export LDFLAGS
+ CFLAGS=' -O2 -fwrapv -pipe -Wformat -Werror=format-security -gdwarf-4 -fno-debug-types-section -fvar-tracking-assignments -g2 -Wp,-D_FORTIFY_SOURCE=2 -fstack-protector-strong --param=ssp-buffer-size=4 -Werror=trampolines -fomit-frame-pointer -march=i686 -fasynchronous-unwind-tables -mtune=pentium4 -gdwarf-4 -fno-debug-types-section -fvar-tracking-assignments -g2 ' 
+ export CFLAGS
+ CXXFLAGS=' -O2 -fwrapv -pipe -Wformat -Werror=format-security -gdwarf-4 -fno-debug-types-section -fvar-tracking-assignments -g2 -Wp,-D_FORTIFY_SOURCE=2 -fstack-protector-strong --param=ssp-buffer-size=4 -Werror=trampolines -fomit-frame-pointer -march=i686 -fasynchronous-unwind-tables -mtune=pentium4 -gdwarf-4 -fno-debug-types-section -fvar-tracking-assignments -g2 ' 
+ export CXXFLAGS
+ CC=i686-pld-linux-gcc 
+ export CC
+ CXX=i686-pld-linux-g++ 
+ export CXX
+ /usr/bin/python2 setup.py build '--build-base=build-2' test
running build
running build_py
creating build-2
creating build-2/lib
creating build-2/lib/positional
copying positional/__init__.py -> build-2/lib/positional
creating build-2/lib/positional/tests
copying positional/tests/__init__.py -> build-2/lib/positional/tests
copying positional/tests/test_positional.py -> build-2/lib/positional/tests
running egg_info
writing requirements to positional.egg-info/requires.txt
writing positional.egg-info/PKG-INFO
writing top-level names to positional.egg-info/top_level.txt
writing dependency_links to positional.egg-info/dependency_links.txt
[pbr] Reusing existing SOURCES.txt
running test
running=${PYTHON:-python} -m subunit.run discover -t ./  ${OS_TEST_PATH:-./positional/tests} --list 
running=${PYTHON:-python} -m subunit.run discover -t ./  ${OS_TEST_PATH:-./positional/tests}  --load-list /tmp/B.sqrpdx_h/BUILD/tmp/tmpTtxeK1
running=${PYTHON:-python} -m subunit.run discover -t ./  ${OS_TEST_PATH:-./positional/tests}  --load-list /tmp/B.sqrpdx_h/BUILD/tmp/tmpt04Scc
running=${PYTHON:-python} -m subunit.run discover -t ./  ${OS_TEST_PATH:-./positional/tests}  --load-list /tmp/B.sqrpdx_h/BUILD/tmp/tmpPi9U9u
running=${PYTHON:-python} -m subunit.run discover -t ./  ${OS_TEST_PATH:-./positional/tests}  --load-list /tmp/B.sqrpdx_h/BUILD/tmp/tmpXJv5WP
running=${PYTHON:-python} -m subunit.run discover -t ./  ${OS_TEST_PATH:-./positional/tests}  --load-list /tmp/B.sqrpdx_h/BUILD/tmp/tmpe7O395
running=${PYTHON:-python} -m subunit.run discover -t ./  ${OS_TEST_PATH:-./positional/tests}  --load-list /tmp/B.sqrpdx_h/BUILD/tmp/tmpcNz2b1
running=${PYTHON:-python} -m subunit.run discover -t ./  ${OS_TEST_PATH:-./positional/tests}  --load-list /tmp/B.sqrpdx_h/BUILD/tmp/tmplVzCMh
Ran 7 tests in 0.098s
PASSED (id=0)
+ rm -rf .testrepository
+ LDFLAGS='-Wl,--as-needed -Wl,--no-copy-dt-needed-entries -Wl,-z,relro -Wl,-z,combreloc ' 
+ export LDFLAGS
+ CFLAGS=' -O2 -fwrapv -pipe -Wformat -Werror=format-security -gdwarf-4 -fno-debug-types-section -fvar-tracking-assignments -g2 -Wp,-D_FORTIFY_SOURCE=2 -fstack-protector-strong --param=ssp-buffer-size=4 -Werror=trampolines -fomit-frame-pointer -march=i686 -fasynchronous-unwind-tables -mtune=pentium4 -gdwarf-4 -fno-debug-types-section -fvar-tracking-assignments -g2 ' 
+ export CFLAGS
+ CXXFLAGS=' -O2 -fwrapv -pipe -Wformat -Werror=format-security -gdwarf-4 -fno-debug-types-section -fvar-tracking-assignments -g2 -Wp,-D_FORTIFY_SOURCE=2 -fstack-protector-strong --param=ssp-buffer-size=4 -Werror=trampolines -fomit-frame-pointer -march=i686 -fasynchronous-unwind-tables -mtune=pentium4 -gdwarf-4 -fno-debug-types-section -fvar-tracking-assignments -g2 ' 
+ export CXXFLAGS
+ CC=i686-pld-linux-gcc 
+ export CC
+ CXX=i686-pld-linux-g++ 
+ export CXX
+ /usr/bin/python3 setup.py build '--build-base=build-3' test
/usr/share/python3.10/site-packages/setuptools/dist.py:771: UserWarning: Usage of dash-separated 'description-file' will not be supported in future versions. Please use the underscore name 'description_file' instead
  warnings.warn(
DefaultPluginManager load plugin flaky = flaky.flaky_nose_plugin:FlakyPlugin
DefaultPluginManager load plugin NOSETESTS_PLUGINS = rednose:RedNose
DefaultPluginManager load plugin randomly = nose_randomly:RandomlyPlugin
DefaultPluginManager load plugin nose_random = nose_random:NoseRandomPlugin
DefaultPluginManager load plugin xcover = nosexcover.nosexcover:XCoverage
DefaultPluginManager load plugin nose_exclude = nose_exclude:NoseExclude
/usr/share/python3.10/site-packages/setuptools/command/easy_install.py:144: EasyInstallDeprecationWarning: easy_install command is deprecated. Use build and pip and other standards-based tools.
  warnings.warn(
/usr/share/python3.10/site-packages/setuptools/command/install.py:34: SetuptoolsDeprecationWarning: setup.py install is deprecated. Use build and pip and other standards-based tools.
  warnings.warn(
/usr/share/python3.10/site-packages/setuptools/dist.py:771: UserWarning: Usage of dash-separated 'description-file' will not be supported in future versions. Please use the underscore name 'description_file' instead
  warnings.warn(
running build
running build_py
creating build-3
creating build-3/lib
creating build-3/lib/positional
creating build-3/lib/positional/tests
copying positional/tests/__init__.py -> build-3/lib/positional/tests
copying positional/tests/test_positional.py -> build-3/lib/positional/tests
copying positional/__init__.py -> build-3/lib/positional
running egg_info
writing positional.egg-info/PKG-INFO
writing dependency_links to positional.egg-info/dependency_links.txt
writing requirements to positional.egg-info/requires.txt
writing top-level names to positional.egg-info/top_level.txt
[pbr] Reusing existing SOURCES.txt
running test
running=${PYTHON:-python} -m subunit.run discover -t ./  ${OS_TEST_PATH:-./positional/tests} --list 
running=${PYTHON:-python} -m subunit.run discover -t ./  ${OS_TEST_PATH:-./positional/tests}  --load-list /tmp/B.sqrpdx_h/BUILD/tmp/tmpu7rxli3e
running=${PYTHON:-python} -m subunit.run discover -t ./  ${OS_TEST_PATH:-./positional/tests}  --load-list /tmp/B.sqrpdx_h/BUILD/tmp/tmp3r3iincn
running=${PYTHON:-python} -m subunit.run discover -t ./  ${OS_TEST_PATH:-./positional/tests}  --load-list /tmp/B.sqrpdx_h/BUILD/tmp/tmpjwl8vg1w
running=${PYTHON:-python} -m subunit.run discover -t ./  ${OS_TEST_PATH:-./positional/tests}  --load-list /tmp/B.sqrpdx_h/BUILD/tmp/tmpvyqtw7ks
running=${PYTHON:-python} -m subunit.run discover -t ./  ${OS_TEST_PATH:-./positional/tests}  --load-list /tmp/B.sqrpdx_h/BUILD/tmp/tmpswi28sxl
running=${PYTHON:-python} -m subunit.run discover -t ./  ${OS_TEST_PATH:-./positional/tests}  --load-list /tmp/B.sqrpdx_h/BUILD/tmp/tmpb5w4d4di
running=${PYTHON:-python} -m subunit.run discover -t ./  ${OS_TEST_PATH:-./positional/tests}  --load-list /tmp/B.sqrpdx_h/BUILD/tmp/tmp8ppvf2kv
Ran 7 tests in 0.033s
PASSED (id=0)
+ rm -rf .testrepository
+ /usr/bin/make -Otarget -j1 -C doc html 'SPHINXBUILD=sphinx-build-2'
make: Entering directory '/tmp/B.sqrpdx_h/BUILD/positional-1.2.1/doc'
sphinx-build-2 -b html -d build/doctrees   source build/html
Running Sphinx v1.8.5

Configuration error:
There is a programmable error in your configuration file:

Traceback (most recent call last):
  File "/usr/share/python2.7/site-packages/sphinx/config.py", line 368, in eval_config_file
  File "/usr/share/python2.7/site-packages/sphinx/util/pycompat.py", line 150, in execfile_
  File "/usr/share/python2.7/site-packages/six.py", line 735, in exec_
  File "<string>", line 1, in <module>
  File "/tmp/B.sqrpdx_h/BUILD/positional-1.2.1/doc/source/conf.py", line 72, in <module>
    version = version_info.version_string()
  File "/usr/share/python2.7/site-packages/pbr/version.py", line 467, in version_string
  File "/usr/share/python2.7/site-packages/pbr/version.py", line 462, in semantic_version
  File "/usr/share/python2.7/site-packages/pbr/version.py", line 449, in _get_version_from_pkg_resources
  File "/usr/share/python2.7/site-packages/pbr/packaging.py", line 878, in get_version
Exception: Versioning for this project requires either an sdist tarball, or access to an upstream git repository. It's also possible that there is a mismatch between the package name in setup.cfg and the argument given to pbr.version.VersionInfo. Project name positional was given, but was not able to be found.

make: *** [Makefile:57: html] Error 2
make: Leaving directory '/tmp/B.sqrpdx_h/BUILD/positional-1.2.1/doc'
error: Bad exit status from /tmp/B.sqrpdx_h/BUILD/tmp/rpm-tmp.YfxYHK (%build)

RPM build warnings:
    Could not canonicalize hostname: nereid

RPM build errors:
    Bad exit status from /tmp/B.sqrpdx_h/BUILD/tmp/rpm-tmp.YfxYHK (%build)
ended at: Sun Feb 11 20:24:55 2024, done in 0:00:06.459864
error: No files produced.
+ chmod -R u+rwX /tmp/B.sqrpdx_h/BUILD
+ rm -rf /tmp/B.sqrpdx_h/tmp /tmp/B.sqrpdx_h/BUILD
+ rm -rf /tmp/B.sqrpdx_h
Begin-PLD-Builder-Info
Build-Time: user:12.52s sys:3.13s real:9.25s (faults io:0 non-io:255486)

End-PLD-Builder-Info
[Back to list of logs] [View rpm -qa of builder]