FailedOk

th/SRPMS[OK]
th/x32[OK]
th/i686[OK]
th/x86_64[OK]

ac/SRPMS[OK]
ac/i386[OK]
ac/i586[OK]
ac/i686[OK]
ac/alpha[OK]
ac/amd64[OK]
ac/athlon[OK]
ac/ppc[OK]
ac/sparc[OK]
ac/sparc64[OK]

Advanced Search
main()
Powered by PLD Linux
(c) 2002-2024 PLD Team
$Revision: 1.37 $
Powered by Multics.
Your IP: 44.192.94.177

python-pyxmpp2 cf5971ad-839d-43b6-831b-35ab07f4f9b7

Status:Failed
Source URL:https://buildlogs.pld-linux.org/pld/th/i686/FAIL/python-pyxmpp2,cf5971ad-839d-43b6-831b-35ab07f4f9b7.bz2
text/plain URL:View!
full text:View!
rpm -qa of builder:View!
Date:2024/07/08 11:40:38
Runtime:0:00:09.919754

Toc:

  • error 1
  • ModuleNotFoundError: No module named 'epydoc'
  • error 2
  • NameError: name 'unicode' is not defined
  • error 3
  • make[1]: *** [Makefile:46: update-settings] Error 1
  • error 4
  • error: Bad exit status from /tmp/B.vg7ep11p/BUILD/tmp/rpm-tmp.EyBmif (%build)
  • error 5
  • RPM build errors:
  • error 6
  • error: No files produced.

Content:

copying pyxmpp2/xmppserializer.py -> build-3/lib/pyxmpp2
copying pyxmpp2/xmppstringprep.py -> build-3/lib/pyxmpp2
copying pyxmpp2/version.py -> build-3/lib/pyxmpp2
creating build-3/lib/pyxmpp2/mainloop
copying pyxmpp2/mainloop/__init__.py -> build-3/lib/pyxmpp2/mainloop
copying pyxmpp2/mainloop/base.py -> build-3/lib/pyxmpp2/mainloop
copying pyxmpp2/mainloop/events.py -> build-3/lib/pyxmpp2/mainloop
copying pyxmpp2/mainloop/glib.py -> build-3/lib/pyxmpp2/mainloop
copying pyxmpp2/mainloop/interfaces.py -> build-3/lib/pyxmpp2/mainloop
copying pyxmpp2/mainloop/poll.py -> build-3/lib/pyxmpp2/mainloop
copying pyxmpp2/mainloop/select.py -> build-3/lib/pyxmpp2/mainloop
copying pyxmpp2/mainloop/threads.py -> build-3/lib/pyxmpp2/mainloop
copying pyxmpp2/mainloop/tornado.py -> build-3/lib/pyxmpp2/mainloop
copying pyxmpp2/mainloop/wait.py -> build-3/lib/pyxmpp2/mainloop
creating build-3/lib/pyxmpp2/sasl
copying pyxmpp2/sasl/__init__.py -> build-3/lib/pyxmpp2/sasl
copying pyxmpp2/sasl/core.py -> build-3/lib/pyxmpp2/sasl
copying pyxmpp2/sasl/digest_md5.py -> build-3/lib/pyxmpp2/sasl
copying pyxmpp2/sasl/external.py -> build-3/lib/pyxmpp2/sasl
copying pyxmpp2/sasl/gssapi.py -> build-3/lib/pyxmpp2/sasl
copying pyxmpp2/sasl/plain.py -> build-3/lib/pyxmpp2/sasl
copying pyxmpp2/sasl/saslprep.py -> build-3/lib/pyxmpp2/sasl
copying pyxmpp2/sasl/scram.py -> build-3/lib/pyxmpp2/sasl
copying pyxmpp2/sasl/xfacebookplatform.py -> build-3/lib/pyxmpp2/sasl
creating build-3/lib/pyxmpp2/ext
copying pyxmpp2/ext/__init__.py -> build-3/lib/pyxmpp2/ext
copying pyxmpp2/ext/component.py -> build-3/lib/pyxmpp2/ext
copying pyxmpp2/ext/dataforms.py -> build-3/lib/pyxmpp2/ext
copying pyxmpp2/ext/delay.py -> build-3/lib/pyxmpp2/ext
copying pyxmpp2/ext/disco.py -> build-3/lib/pyxmpp2/ext
copying pyxmpp2/ext/legacyauth.py -> build-3/lib/pyxmpp2/ext
copying pyxmpp2/ext/register.py -> build-3/lib/pyxmpp2/ext
copying pyxmpp2/ext/vcard.py -> build-3/lib/pyxmpp2/ext
copying pyxmpp2/ext/version.py -> build-3/lib/pyxmpp2/ext
creating build-3/lib/pyxmpp2/server
copying pyxmpp2/server/__init__.py -> build-3/lib/pyxmpp2/server
copying pyxmpp2/server/listener.py -> build-3/lib/pyxmpp2/server
creating build-3/lib/pyxmpp2/test
copying pyxmpp2/test/__init__.py -> build-3/lib/pyxmpp2/test
copying pyxmpp2/test/__main__.py -> build-3/lib/pyxmpp2/test
copying pyxmpp2/test/server_listener.py -> build-3/lib/pyxmpp2/test
copying pyxmpp2/test/stream_reader.py -> build-3/lib/pyxmpp2/test
copying pyxmpp2/test/xmppserializer.py -> build-3/lib/pyxmpp2/test
copying pyxmpp2/test/_support.py -> build-3/lib/pyxmpp2/test
copying pyxmpp2/test/_util.py -> build-3/lib/pyxmpp2/test
copying pyxmpp2/test/binding.py -> build-3/lib/pyxmpp2/test
copying pyxmpp2/test/cert.py -> build-3/lib/pyxmpp2/test
copying pyxmpp2/test/ext_version.py -> build-3/lib/pyxmpp2/test
copying pyxmpp2/test/iq.py -> build-3/lib/pyxmpp2/test
copying pyxmpp2/test/jid.py -> build-3/lib/pyxmpp2/test
copying pyxmpp2/test/message.py -> build-3/lib/pyxmpp2/test
copying pyxmpp2/test/presence.py -> build-3/lib/pyxmpp2/test
copying pyxmpp2/test/resolver.py -> build-3/lib/pyxmpp2/test
copying pyxmpp2/test/roster.py -> build-3/lib/pyxmpp2/test
copying pyxmpp2/test/sasl__gsasl.py -> build-3/lib/pyxmpp2/test
copying pyxmpp2/test/sasl_saslprep.py -> build-3/lib/pyxmpp2/test
copying pyxmpp2/test/stanza.py -> build-3/lib/pyxmpp2/test
copying pyxmpp2/test/stanzaprocessor.py -> build-3/lib/pyxmpp2/test
copying pyxmpp2/test/streambase.py -> build-3/lib/pyxmpp2/test
copying pyxmpp2/test/streamsasl.py -> build-3/lib/pyxmpp2/test
copying pyxmpp2/test/streamtls.py -> build-3/lib/pyxmpp2/test
creating build-3/lib/pyxmpp2/test/data
copying pyxmpp2/test/data/ca-key.pem -> build-3/lib/pyxmpp2/test/data
copying pyxmpp2/test/data/ca.pem -> build-3/lib/pyxmpp2/test/data
copying pyxmpp2/test/data/client-key.pem -> build-3/lib/pyxmpp2/test/data
copying pyxmpp2/test/data/client-req.pem -> build-3/lib/pyxmpp2/test/data
copying pyxmpp2/test/data/client.pem -> build-3/lib/pyxmpp2/test/data
copying pyxmpp2/test/data/client1-key.pem -> build-3/lib/pyxmpp2/test/data
copying pyxmpp2/test/data/client1-req.pem -> build-3/lib/pyxmpp2/test/data
copying pyxmpp2/test/data/client1.pem -> build-3/lib/pyxmpp2/test/data
copying pyxmpp2/test/data/server-key.pem -> build-3/lib/pyxmpp2/test/data
copying pyxmpp2/test/data/server-req.pem -> build-3/lib/pyxmpp2/test/data
copying pyxmpp2/test/data/server.pem -> build-3/lib/pyxmpp2/test/data
copying pyxmpp2/test/data/server1-key.pem -> build-3/lib/pyxmpp2/test/data
copying pyxmpp2/test/data/server1-req.pem -> build-3/lib/pyxmpp2/test/data
copying pyxmpp2/test/data/server1.pem -> build-3/lib/pyxmpp2/test/data
copying pyxmpp2/test/data/disco_info_in.txt -> build-3/lib/pyxmpp2/test/data
copying pyxmpp2/test/data/disco_items_in.txt -> build-3/lib/pyxmpp2/test/data
copying pyxmpp2/test/data/stream_info.txt -> build-3/lib/pyxmpp2/test/data
copying pyxmpp2/test/data/vcard1.txt -> build-3/lib/pyxmpp2/test/data
copying pyxmpp2/test/data/vcard2.txt -> build-3/lib/pyxmpp2/test/data
copying pyxmpp2/test/data/vcard3.txt -> build-3/lib/pyxmpp2/test/data
copying pyxmpp2/test/data/vcard_without_fn.txt -> build-3/lib/pyxmpp2/test/data
copying pyxmpp2/test/data/vcard_without_n.txt -> build-3/lib/pyxmpp2/test/data
copying pyxmpp2/test/data/disco_info_in.xml -> build-3/lib/pyxmpp2/test/data
copying pyxmpp2/test/data/disco_items_in.xml -> build-3/lib/pyxmpp2/test/data
copying pyxmpp2/test/data/disco_items_out.xml -> build-3/lib/pyxmpp2/test/data
copying pyxmpp2/test/data/stream.xml -> build-3/lib/pyxmpp2/test/data
copying pyxmpp2/test/data/vcard1.xml -> build-3/lib/pyxmpp2/test/data
copying pyxmpp2/test/data/vcard_with_semicolon.xml -> build-3/lib/pyxmpp2/test/data
copying pyxmpp2/test/data/vcard_without_fn.xml -> build-3/lib/pyxmpp2/test/data
copying pyxmpp2/test/data/vcard_without_n.xml -> build-3/lib/pyxmpp2/test/data
+ cd ..
+ cd orgsrc/doc
+ /usr/bin/make -Otarget -j28
/usr/bin/make -C .. build
Traceback (most recent call last):
  File "/usr/bin/epydoc", line 12, in <module>
    from epydoc.cli import cli
ModuleNotFoundError: No module named 'epydoc'
*************************************************
You need Epydoc to generate PyXMPP documentation.
You can find it at http://epydoc.sourceforge.net/
*************************************************
make: *** [Makefile:26: check-epydoc] Error 1
make: *** Waiting for unfinished jobs....
make[1]: Entering directory '/tmp/B.vg7ep11p/BUILD/pyxmpp2-2.0.1/orgsrc'
python setup.py make_version
make[1]: Leaving directory '/tmp/B.vg7ep11p/BUILD/pyxmpp2-2.0.1/orgsrc'
make[1]: Entering directory '/tmp/B.vg7ep11p/BUILD/pyxmpp2-2.0.1/orgsrc'
umask 022 ; python setup.py build
running build
running build_py
creating build
creating build/lib
creating build/lib/pyxmpp2
copying pyxmpp2/__init__.py -> build/lib/pyxmpp2
copying pyxmpp2/binding.py -> build/lib/pyxmpp2
copying pyxmpp2/cache.py -> build/lib/pyxmpp2
copying pyxmpp2/cert.py -> build/lib/pyxmpp2
copying pyxmpp2/client.py -> build/lib/pyxmpp2
copying pyxmpp2/clientstream.py -> build/lib/pyxmpp2
copying pyxmpp2/constants.py -> build/lib/pyxmpp2
copying pyxmpp2/error.py -> build/lib/pyxmpp2
copying pyxmpp2/etree.py -> build/lib/pyxmpp2
copying pyxmpp2/exceptions.py -> build/lib/pyxmpp2
copying pyxmpp2/expdict.py -> build/lib/pyxmpp2
copying pyxmpp2/interfaces.py -> build/lib/pyxmpp2
copying pyxmpp2/iq.py -> build/lib/pyxmpp2
copying pyxmpp2/jid.py -> build/lib/pyxmpp2
copying pyxmpp2/message.py -> build/lib/pyxmpp2
copying pyxmpp2/presence.py -> build/lib/pyxmpp2
copying pyxmpp2/resolver.py -> build/lib/pyxmpp2
copying pyxmpp2/roster.py -> build/lib/pyxmpp2
copying pyxmpp2/session.py -> build/lib/pyxmpp2
copying pyxmpp2/settings.py -> build/lib/pyxmpp2
copying pyxmpp2/simple.py -> build/lib/pyxmpp2
copying pyxmpp2/stanza.py -> build/lib/pyxmpp2
copying pyxmpp2/stanzapayload.py -> build/lib/pyxmpp2
copying pyxmpp2/stanzaprocessor.py -> build/lib/pyxmpp2
copying pyxmpp2/streambase.py -> build/lib/pyxmpp2
copying pyxmpp2/streamevents.py -> build/lib/pyxmpp2
copying pyxmpp2/streamsasl.py -> build/lib/pyxmpp2
copying pyxmpp2/streamtls.py -> build/lib/pyxmpp2
copying pyxmpp2/transport.py -> build/lib/pyxmpp2
copying pyxmpp2/utils.py -> build/lib/pyxmpp2
copying pyxmpp2/xmppparser.py -> build/lib/pyxmpp2
copying pyxmpp2/xmppserializer.py -> build/lib/pyxmpp2
copying pyxmpp2/xmppstringprep.py -> build/lib/pyxmpp2
copying pyxmpp2/version.py -> build/lib/pyxmpp2
creating build/lib/pyxmpp2/mainloop
copying pyxmpp2/mainloop/__init__.py -> build/lib/pyxmpp2/mainloop
copying pyxmpp2/mainloop/base.py -> build/lib/pyxmpp2/mainloop
copying pyxmpp2/mainloop/events.py -> build/lib/pyxmpp2/mainloop
copying pyxmpp2/mainloop/glib.py -> build/lib/pyxmpp2/mainloop
copying pyxmpp2/mainloop/interfaces.py -> build/lib/pyxmpp2/mainloop
copying pyxmpp2/mainloop/poll.py -> build/lib/pyxmpp2/mainloop
copying pyxmpp2/mainloop/select.py -> build/lib/pyxmpp2/mainloop
copying pyxmpp2/mainloop/threads.py -> build/lib/pyxmpp2/mainloop
copying pyxmpp2/mainloop/tornado.py -> build/lib/pyxmpp2/mainloop
copying pyxmpp2/mainloop/wait.py -> build/lib/pyxmpp2/mainloop
creating build/lib/pyxmpp2/sasl
copying pyxmpp2/sasl/__init__.py -> build/lib/pyxmpp2/sasl
copying pyxmpp2/sasl/core.py -> build/lib/pyxmpp2/sasl
copying pyxmpp2/sasl/digest_md5.py -> build/lib/pyxmpp2/sasl
copying pyxmpp2/sasl/external.py -> build/lib/pyxmpp2/sasl
copying pyxmpp2/sasl/gssapi.py -> build/lib/pyxmpp2/sasl
copying pyxmpp2/sasl/plain.py -> build/lib/pyxmpp2/sasl
copying pyxmpp2/sasl/saslprep.py -> build/lib/pyxmpp2/sasl
copying pyxmpp2/sasl/scram.py -> build/lib/pyxmpp2/sasl
copying pyxmpp2/sasl/xfacebookplatform.py -> build/lib/pyxmpp2/sasl
creating build/lib/pyxmpp2/ext
copying pyxmpp2/ext/__init__.py -> build/lib/pyxmpp2/ext
copying pyxmpp2/ext/component.py -> build/lib/pyxmpp2/ext
copying pyxmpp2/ext/dataforms.py -> build/lib/pyxmpp2/ext
copying pyxmpp2/ext/delay.py -> build/lib/pyxmpp2/ext
copying pyxmpp2/ext/disco.py -> build/lib/pyxmpp2/ext
copying pyxmpp2/ext/legacyauth.py -> build/lib/pyxmpp2/ext
copying pyxmpp2/ext/register.py -> build/lib/pyxmpp2/ext
copying pyxmpp2/ext/vcard.py -> build/lib/pyxmpp2/ext
copying pyxmpp2/ext/version.py -> build/lib/pyxmpp2/ext
creating build/lib/pyxmpp2/server
copying pyxmpp2/server/__init__.py -> build/lib/pyxmpp2/server
copying pyxmpp2/server/listener.py -> build/lib/pyxmpp2/server
creating build/lib/pyxmpp2/test
copying pyxmpp2/test/__init__.py -> build/lib/pyxmpp2/test
copying pyxmpp2/test/__main__.py -> build/lib/pyxmpp2/test
copying pyxmpp2/test/_support.py -> build/lib/pyxmpp2/test
copying pyxmpp2/test/_util.py -> build/lib/pyxmpp2/test
copying pyxmpp2/test/binding.py -> build/lib/pyxmpp2/test
copying pyxmpp2/test/cert.py -> build/lib/pyxmpp2/test
copying pyxmpp2/test/ext_version.py -> build/lib/pyxmpp2/test
copying pyxmpp2/test/iq.py -> build/lib/pyxmpp2/test
copying pyxmpp2/test/jid.py -> build/lib/pyxmpp2/test
copying pyxmpp2/test/message.py -> build/lib/pyxmpp2/test
copying pyxmpp2/test/presence.py -> build/lib/pyxmpp2/test
copying pyxmpp2/test/resolver.py -> build/lib/pyxmpp2/test
copying pyxmpp2/test/roster.py -> build/lib/pyxmpp2/test
copying pyxmpp2/test/sasl__gsasl.py -> build/lib/pyxmpp2/test
copying pyxmpp2/test/sasl_saslprep.py -> build/lib/pyxmpp2/test
copying pyxmpp2/test/server_listener.py -> build/lib/pyxmpp2/test
copying pyxmpp2/test/stanza.py -> build/lib/pyxmpp2/test
copying pyxmpp2/test/stanzaprocessor.py -> build/lib/pyxmpp2/test
copying pyxmpp2/test/stream_reader.py -> build/lib/pyxmpp2/test
copying pyxmpp2/test/streambase.py -> build/lib/pyxmpp2/test
copying pyxmpp2/test/streamsasl.py -> build/lib/pyxmpp2/test
copying pyxmpp2/test/streamtls.py -> build/lib/pyxmpp2/test
copying pyxmpp2/test/xmppserializer.py -> build/lib/pyxmpp2/test
creating build/lib/pyxmpp2/test/data
copying pyxmpp2/test/data/ca-key.pem -> build/lib/pyxmpp2/test/data
copying pyxmpp2/test/data/ca.pem -> build/lib/pyxmpp2/test/data
copying pyxmpp2/test/data/client-key.pem -> build/lib/pyxmpp2/test/data
copying pyxmpp2/test/data/client-req.pem -> build/lib/pyxmpp2/test/data
copying pyxmpp2/test/data/client.pem -> build/lib/pyxmpp2/test/data
copying pyxmpp2/test/data/client1-key.pem -> build/lib/pyxmpp2/test/data
copying pyxmpp2/test/data/client1-req.pem -> build/lib/pyxmpp2/test/data
copying pyxmpp2/test/data/client1.pem -> build/lib/pyxmpp2/test/data
copying pyxmpp2/test/data/server-key.pem -> build/lib/pyxmpp2/test/data
copying pyxmpp2/test/data/server-req.pem -> build/lib/pyxmpp2/test/data
copying pyxmpp2/test/data/server.pem -> build/lib/pyxmpp2/test/data
copying pyxmpp2/test/data/server1-key.pem -> build/lib/pyxmpp2/test/data
copying pyxmpp2/test/data/server1-req.pem -> build/lib/pyxmpp2/test/data
copying pyxmpp2/test/data/server1.pem -> build/lib/pyxmpp2/test/data
copying pyxmpp2/test/data/disco_info_in.txt -> build/lib/pyxmpp2/test/data
copying pyxmpp2/test/data/disco_items_in.txt -> build/lib/pyxmpp2/test/data
copying pyxmpp2/test/data/stream_info.txt -> build/lib/pyxmpp2/test/data
copying pyxmpp2/test/data/vcard1.txt -> build/lib/pyxmpp2/test/data
copying pyxmpp2/test/data/vcard2.txt -> build/lib/pyxmpp2/test/data
copying pyxmpp2/test/data/vcard3.txt -> build/lib/pyxmpp2/test/data
copying pyxmpp2/test/data/vcard_without_fn.txt -> build/lib/pyxmpp2/test/data
copying pyxmpp2/test/data/vcard_without_n.txt -> build/lib/pyxmpp2/test/data
copying pyxmpp2/test/data/disco_info_in.xml -> build/lib/pyxmpp2/test/data
copying pyxmpp2/test/data/disco_items_in.xml -> build/lib/pyxmpp2/test/data
copying pyxmpp2/test/data/disco_items_out.xml -> build/lib/pyxmpp2/test/data
copying pyxmpp2/test/data/stream.xml -> build/lib/pyxmpp2/test/data
copying pyxmpp2/test/data/vcard1.xml -> build/lib/pyxmpp2/test/data
copying pyxmpp2/test/data/vcard_with_semicolon.xml -> build/lib/pyxmpp2/test/data
copying pyxmpp2/test/data/vcard_without_fn.xml -> build/lib/pyxmpp2/test/data
copying pyxmpp2/test/data/vcard_without_n.xml -> build/lib/pyxmpp2/test/data
cd examples && rm -f pyxmpp2 2>/dev/null && ln -s ../build/lib*/pyxmpp2 .
cd examples && chmod a+x *.py
make[1]: Leaving directory '/tmp/B.vg7ep11p/BUILD/pyxmpp2-2.0.1/orgsrc'
mkdir -p www/api
/usr/bin/make update-settings
make[1]: Entering directory '/tmp/B.vg7ep11p/BUILD/pyxmpp2-2.0.1/orgsrc/doc'
PYTHONPATH="../build/lib:$PYTHONPATH" python make_settings_doc.py
Traceback (most recent call last):
  File "/tmp/B.vg7ep11p/BUILD/pyxmpp2-2.0.1/orgsrc/doc/make_settings_doc.py", line 7, in <module>
    from pyxmpp2.settings import XMPPSettings
  File "/tmp/B.vg7ep11p/BUILD/pyxmpp2-2.0.1/orgsrc/build/lib/pyxmpp2/settings.py", line 50, in <module>
    class _SettingDefinition(object):
  File "/tmp/B.vg7ep11p/BUILD/pyxmpp2-2.0.1/orgsrc/build/lib/pyxmpp2/settings.py", line 53, in _SettingDefinition
    def __init__(self, name, type = unicode, default = None, factory = None,
NameError: name 'unicode' is not defined
make[1]: *** [Makefile:46: update-settings] Error 1
make[1]: Leaving directory '/tmp/B.vg7ep11p/BUILD/pyxmpp2-2.0.1/orgsrc/doc'
make: *** [Makefile:20: doc-tstamp] Error 2
error: Bad exit status from /tmp/B.vg7ep11p/BUILD/tmp/rpm-tmp.EyBmif (%build)

RPM build warnings:
    Could not canonicalize hostname: nereid

RPM build errors:
    Bad exit status from /tmp/B.vg7ep11p/BUILD/tmp/rpm-tmp.EyBmif (%build)
ended at: Mon Jul  8 11:40:37 2024, done in 0:00:09.919754
error: No files produced.
+ chmod -R u+rwX /tmp/B.vg7ep11p/BUILD
+ rm -rf /tmp/B.vg7ep11p/tmp /tmp/B.vg7ep11p/BUILD
+ rm -rf /tmp/B.vg7ep11p
Begin-PLD-Builder-Info
Build-Time: user:11.14s sys:1.67s real:12.89s (faults io:0 non-io:171497)

End-PLD-Builder-Info
[Back to list of logs] [View rpm -qa of builder]