FailedOk

th/SRPMS[OK]
th/x32[OK]
th/i686[OK]
th/x86_64[OK]

ac/SRPMS[OK]
ac/i386[OK]
ac/i586[OK]
ac/i686[OK]
ac/alpha[OK]
ac/amd64[OK]
ac/athlon[OK]
ac/ppc[OK]
ac/sparc[OK]
ac/sparc64[OK]

Advanced Search
main()
Powered by PLD Linux
(c) 2002-2021 PLD Team
$Revision: 1.37 $
Powered by Linus.
Your IP: 54.227.97.219

python-scikit-umfpack 45fb3fdd-cee9-4c6f-a324-d7f7acd63d09

Status:Failed
Source URL:https://buildlogs.pld-linux.org/pld/th/i686/FAIL/python-scikit-umfpack,45fb3fdd-cee9-4c6f-a324-d7f7acd63d09.bz2
text/plain URL:View!
full text:View!
rpm -qa of builder:View!
Date:2021/11/21 05:05:37
Runtime:0:00:21.260427

Toc:

  • error 1
  • /tmp/B.vljj4fuj/BUILD/tmp/tmp4lsvwoo_/source.c:6: undefined reference to `cblas_ddot'
  • error 2
  • collect2: error: ld returned 1 exit status
  • error 3
  • /tmp/B.vljj4fuj/BUILD/tmp/tmpj8zfx2xc/source.c:6: undefined reference to `cblas_ddot'
  • error 4
  • collect2: error: ld returned 1 exit status
  • error 5
  • ERROR: test_factorized_umfpack (test_umfpack.TestScipySolvers)
  • error 6
  • RuntimeError: <function umfpack_dl_symbolic at 0xf3efecd0> failed with UMFPACK_ERROR_invalid_matrix
  • error 7
  • ERROR: test_solve_complex_umfpack (test_umfpack.TestScipySolvers)
  • error 8
  • RuntimeError: <function umfpack_zl_symbolic at 0xf3efed60> failed with UMFPACK_ERROR_invalid_matrix
  • error 9
  • ERROR: test_solve_sparse_rhs (test_umfpack.TestScipySolvers)
  • error 10
  • RuntimeError: <function umfpack_dl_symbolic at 0xf3efecd0> failed with UMFPACK_ERROR_invalid_matrix
  • error 11
  • ERROR: test_solve_umfpack (test_umfpack.TestScipySolvers)
  • error 12
  • RuntimeError: <function umfpack_dl_symbolic at 0xf3efecd0> failed with UMFPACK_ERROR_invalid_matrix
  • error 13
  • error: Bad exit status from /tmp/B.vljj4fuj/BUILD/tmp/rpm-tmp.0xYDPx (%build)
  • error 14
  • RPM build errors:
  • error 15
  • error: No files produced.

Content:

      |                                                                           const long long int *
In file included from /usr/include/umfpack/umfpack.h:47,
                 from scikits/umfpack/_umfpack_wrap.c:2712:
/usr/include/umfpack/umfpack_numeric.h:46:28: note: expected 'const long int *' but argument is of type 'const long long int *'
   46 |     const SuiteSparse_long Ai [ ],
      |     ~~~~~~~~~~~~~~~~~~~~~~~^~~~~~
i686-pld-linux-gcc -shared -Wl,--as-needed -Wl,--no-copy-dt-needed-entries -Wl,-z,relro -Wl,-z,combreloc -Wl,--as-needed -Wl,--no-copy-dt-needed-entries -Wl,-z,relro -Wl,-z,combreloc -O2 -fwrapv -pipe -Wformat -Werror=format-security -gdwarf-4 -fno-debug-types-section -fvar-tracking-assignments -g2 -Wp,-D_FORTIFY_SOURCE=2 -fstack-protector-strong --param=ssp-buffer-size=4 -Werror=trampolines -fomit-frame-pointer -march=i686 -fasynchronous-unwind-tables -mtune=pentium4 -gdwarf-4 -fno-debug-types-section -fvar-tracking-assignments -g2 build/temp.linux-i686-2.7/scikits/umfpack/_umfpack_wrap.o -L/usr/lib -L/usr/lib -Wl,-R/usr/lib -lrt -lumfpack -lamd -lamd -lumfpack -lcblas -lblas -lpython2.7 -o scikits/umfpack/__umfpack.so
S.S....S.S.S.S..S.S..
----------------------------------------------------------------------
Ran 21 tests in 0.249s

OK (SKIP=8)
+ readlink -f build-2/lib.linux-i686-2.7
+ PYTHONPATH=/tmp/B.vljj4fuj/BUILD/scikit-umfpack-0.3.2/build-2/lib.linux-i686-2.7 nosetests-2.7 scikits
S.S....S.S.S.S..S.S..
----------------------------------------------------------------------
Ran 21 tests in 0.091s

OK (SKIP=8)
+ LDFLAGS='-Wl,--as-needed -Wl,--no-copy-dt-needed-entries -Wl,-z,relro -Wl,-z,combreloc ' 
+ export LDFLAGS
+ CFLAGS=' -O2 -fwrapv -pipe -Wformat -Werror=format-security -gdwarf-4 -fno-debug-types-section -fvar-tracking-assignments -g2 -Wp,-D_FORTIFY_SOURCE=2 -fstack-protector-strong --param=ssp-buffer-size=4 -Werror=trampolines -fomit-frame-pointer -march=i686 -fasynchronous-unwind-tables -mtune=pentium4 -gdwarf-4 -fno-debug-types-section -fvar-tracking-assignments -g2 ' 
+ export CFLAGS
+ CXXFLAGS=' -O2 -fwrapv -pipe -Wformat -Werror=format-security -gdwarf-4 -fno-debug-types-section -fvar-tracking-assignments -g2 -Wp,-D_FORTIFY_SOURCE=2 -fstack-protector-strong --param=ssp-buffer-size=4 -Werror=trampolines -fomit-frame-pointer -march=i686 -fasynchronous-unwind-tables -mtune=pentium4 -gdwarf-4 -fno-debug-types-section -fvar-tracking-assignments -g2 ' 
+ export CXXFLAGS
+ CC=i686-pld-linux-gcc 
+ export CC
+ CXX=i686-pld-linux-g++ 
+ export CXX
+ /usr/bin/python3 setup.py build '--build-base=build-3' test
/tmp/B.vljj4fuj/BUILD/scikit-umfpack-0.3.2/setup.py:56: DeprecationWarning: the imp module is deprecated in favour of importlib; see the module's documentation for alternative uses
  import imp
umfpack_info:
customize UnixCCompiler
amd_info:
  FOUND:
    libraries = ['amd', 'amd']
    library_dirs = ['/usr/lib']

  FOUND:
    libraries = ['umfpack', 'amd', 'amd', 'umfpack']
    library_dirs = ['/usr/lib']
    include_dirs = ['/usr/include/umfpack']
    define_macros = [('SCIPY_UMFPACK_H', None)]
    swig_opts = ['-I/usr/include/umfpack']
    runtime_library_dirs = ['/usr/lib']

blas_opt_info:
blas_mkl_info:
  libraries mkl_rt not found in ['/usr/local/lib', '/usr/lib', '/usr/lib/']
  NOT AVAILABLE

blis_info:
  libraries blis not found in ['/usr/local/lib', '/usr/lib', '/usr/lib/']
  NOT AVAILABLE

openblas_info:
  libraries openblas not found in ['/usr/local/lib', '/usr/lib', '/usr/lib/']
  NOT AVAILABLE

atlas_3_10_blas_threads_info:
Setting PTATLAS=ATLAS
  libraries tatlas not found in ['/usr/local/lib', '/usr/lib', '/usr/lib/']
  NOT AVAILABLE

atlas_3_10_blas_info:
  libraries satlas not found in ['/usr/local/lib', '/usr/lib', '/usr/lib/']
  NOT AVAILABLE

atlas_blas_threads_info:
Setting PTATLAS=ATLAS
  libraries ptf77blas,ptcblas,atlas not found in ['/usr/local/lib', '/usr/lib', '/usr/lib/']
  NOT AVAILABLE

atlas_blas_info:
  libraries f77blas,cblas,atlas not found in ['/usr/local/lib', '/usr/lib', '/usr/lib/']
  NOT AVAILABLE

accelerate_info:
  NOT AVAILABLE

/usr/lib/python3.9/site-packages/numpy/distutils/system_info.py:1914: UserWarning: 
    Optimized (vendor) Blas libraries are not found.
    Falls back to netlib Blas library which has worse performance.
    A better performance should be easily gained by switching
    Blas library.
  if self._calc_info(blas):
blas_info:
C compiler: i686-pld-linux-gcc -Wno-unused-result -Wsign-compare -DNDEBUG -O2 -fwrapv -pipe -Wformat -Werror=format-security -gdwarf-4 -fno-debug-types-section -fvar-tracking-assignments -g2 -Wp,-D_FORTIFY_SOURCE=2 -fstack-protector-strong --param=ssp-buffer-size=4 -Werror=trampolines -fomit-frame-pointer -march=i686 -fasynchronous-unwind-tables -mtune=pentium4 -gdwarf-4 -fno-debug-types-section -fvar-tracking-assignments -g2 -O2 -fwrapv -pipe -Wformat -Werror=format-security -gdwarf-4 -fno-debug-types-section -fvar-tracking-assignments -g2 -Wp,-D_FORTIFY_SOURCE=2 -fstack-protector-strong --param=ssp-buffer-size=4 -Werror=trampolines -fomit-frame-pointer -march=i686 -fasynchronous-unwind-tables -mtune=pentium4 -gdwarf-4 -fno-debug-types-section -fvar-tracking-assignments -g2 -O2 -fwrapv -pipe -Wformat -Werror=format-security -gdwarf-4 -fno-debug-types-section -fvar-tracking-assignments -g2 -Wp,-D_FORTIFY_SOURCE=2 -fstack-protector-strong --param=ssp-buffer-size=4 -Werror=trampolines -fomit-frame-pointer -march=i686 -fasynchronous-unwind-tables -mtune=pentium4 -gdwarf-4 -fno-debug-types-section -fvar-tracking-assignments -g2 -fPIC

creating /tmp/B.vljj4fuj/BUILD/tmp/tmp4lsvwoo_/tmp
creating /tmp/B.vljj4fuj/BUILD/tmp/tmp4lsvwoo_/tmp/B.vljj4fuj
creating /tmp/B.vljj4fuj/BUILD/tmp/tmp4lsvwoo_/tmp/B.vljj4fuj/BUILD
creating /tmp/B.vljj4fuj/BUILD/tmp/tmp4lsvwoo_/tmp/B.vljj4fuj/BUILD/tmp
creating /tmp/B.vljj4fuj/BUILD/tmp/tmp4lsvwoo_/tmp/B.vljj4fuj/BUILD/tmp/tmp4lsvwoo_
compile options: '-I/usr/lib -I/usr/local/include -I/usr/include -c'
i686-pld-linux-gcc: /tmp/B.vljj4fuj/BUILD/tmp/tmp4lsvwoo_/source.c
i686-pld-linux-gcc /tmp/B.vljj4fuj/BUILD/tmp/tmp4lsvwoo_/tmp/B.vljj4fuj/BUILD/tmp/tmp4lsvwoo_/source.o -L/usr/lib -lblas -o /tmp/B.vljj4fuj/BUILD/tmp/tmp4lsvwoo_/a.out
/usr/bin/ld: /tmp/B.vljj4fuj/BUILD/tmp/tmp4lsvwoo_/tmp/B.vljj4fuj/BUILD/tmp/tmp4lsvwoo_/source.o: in function `main':
/tmp/B.vljj4fuj/BUILD/tmp/tmp4lsvwoo_/source.c:6: undefined reference to `cblas_ddot'
collect2: error: ld returned 1 exit status
i686-pld-linux-gcc /tmp/B.vljj4fuj/BUILD/tmp/tmp4lsvwoo_/tmp/B.vljj4fuj/BUILD/tmp/tmp4lsvwoo_/source.o -L/usr/lib -lcblas -lblas -o /tmp/B.vljj4fuj/BUILD/tmp/tmp4lsvwoo_/a.out
  FOUND:
    libraries = ['cblas', 'blas', 'blas']
    library_dirs = ['/usr/lib']
    include_dirs = ['/usr/lib', '/usr/local/include', '/usr/include']
    language = c
    define_macros = [('HAVE_CBLAS', None)]
    runtime_library_dirs = ['/usr/lib']

  FOUND:
    define_macros = [('NO_ATLAS_INFO', 1), ('HAVE_CBLAS', None)]
    libraries = ['cblas', 'blas', 'blas']
    library_dirs = ['/usr/lib']
    include_dirs = ['/usr/lib', '/usr/local/include', '/usr/include']
    runtime_library_dirs = ['/usr/lib']
    language = c

running build
running config_cc
unifing config_cc, config, build_clib, build_ext, build commands --compiler options
running config_fc
unifing config_fc, config, build_clib, build_ext, build commands --fcompiler options
running build_src
build_src
building extension "scikits.umfpack.__umfpack" sources
creating build-3
creating build-3/src.linux-i686-3.9
creating build-3/src.linux-i686-3.9/scikits
creating build-3/src.linux-i686-3.9/scikits/umfpack
swig: scikits/umfpack/umfpack.i
swig -python -I/usr/include/umfpack -I/usr/include/umfpack -I/usr/lib -I/usr/local/include -I/usr/include -o build-3/src.linux-i686-3.9/scikits/umfpack/_umfpack_wrap.c -outdir build-3/src.linux-i686-3.9/scikits/umfpack scikits/umfpack/umfpack.i
building data_files sources
build_src: building npy-pkg config files
running build_py
creating build-3/lib.linux-i686-3.9
creating build-3/lib.linux-i686-3.9/scikits
creating build-3/lib.linux-i686-3.9/scikits/umfpack
copying scikits/umfpack/__init__.py -> build-3/lib.linux-i686-3.9/scikits/umfpack
copying scikits/umfpack/_umfpack.py -> build-3/lib.linux-i686-3.9/scikits/umfpack
copying scikits/umfpack/interface.py -> build-3/lib.linux-i686-3.9/scikits/umfpack
copying scikits/umfpack/setup.py -> build-3/lib.linux-i686-3.9/scikits/umfpack
copying scikits/umfpack/umfpack.py -> build-3/lib.linux-i686-3.9/scikits/umfpack
copying scikits/umfpack/version.py -> build-3/lib.linux-i686-3.9/scikits/umfpack
copying build-3/src.linux-i686-3.9/scikits/umfpack/_umfpack.py -> build-3/lib.linux-i686-3.9/scikits/umfpack
running build_ext
customize UnixCCompiler
customize UnixCCompiler using build_ext
building 'scikits.umfpack.__umfpack' extension
compiling C sources
C compiler: i686-pld-linux-gcc -Wno-unused-result -Wsign-compare -DNDEBUG -O2 -fwrapv -pipe -Wformat -Werror=format-security -gdwarf-4 -fno-debug-types-section -fvar-tracking-assignments -g2 -Wp,-D_FORTIFY_SOURCE=2 -fstack-protector-strong --param=ssp-buffer-size=4 -Werror=trampolines -fomit-frame-pointer -march=i686 -fasynchronous-unwind-tables -mtune=pentium4 -gdwarf-4 -fno-debug-types-section -fvar-tracking-assignments -g2 -O2 -fwrapv -pipe -Wformat -Werror=format-security -gdwarf-4 -fno-debug-types-section -fvar-tracking-assignments -g2 -Wp,-D_FORTIFY_SOURCE=2 -fstack-protector-strong --param=ssp-buffer-size=4 -Werror=trampolines -fomit-frame-pointer -march=i686 -fasynchronous-unwind-tables -mtune=pentium4 -gdwarf-4 -fno-debug-types-section -fvar-tracking-assignments -g2 -O2 -fwrapv -pipe -Wformat -Werror=format-security -gdwarf-4 -fno-debug-types-section -fvar-tracking-assignments -g2 -Wp,-D_FORTIFY_SOURCE=2 -fstack-protector-strong --param=ssp-buffer-size=4 -Werror=trampolines -fomit-frame-pointer -march=i686 -fasynchronous-unwind-tables -mtune=pentium4 -gdwarf-4 -fno-debug-types-section -fvar-tracking-assignments -g2 -fPIC

creating build-3/temp.linux-i686-3.9/build-3
creating build-3/temp.linux-i686-3.9/build-3/src.linux-i686-3.9
creating build-3/temp.linux-i686-3.9/build-3/src.linux-i686-3.9/scikits
creating build-3/temp.linux-i686-3.9/build-3/src.linux-i686-3.9/scikits/umfpack
compile options: '-DSCIPY_UMFPACK_H -DNO_ATLAS_INFO=1 -DHAVE_CBLAS -I/usr/include/umfpack -I/usr/lib -I/usr/local/include -I/usr/include -I/usr/lib/python3.9/site-packages/numpy/core/include -I/usr/include/python3.9 -c'
i686-pld-linux-gcc: build-3/src.linux-i686-3.9/scikits/umfpack/_umfpack_wrap.c
In file included from /usr/lib/python3.9/site-packages/numpy/core/include/numpy/ndarraytypes.h:1822,
                 from /usr/lib/python3.9/site-packages/numpy/core/include/numpy/ndarrayobject.h:12,
                 from /usr/lib/python3.9/site-packages/numpy/core/include/numpy/arrayobject.h:4,
                 from build-3/src.linux-i686-3.9/scikits/umfpack/_umfpack_wrap.c:2713:
/usr/lib/python3.9/site-packages/numpy/core/include/numpy/npy_1_7_deprecated_api.h:17:2: warning: #warning "Using deprecated NumPy API, disable it with " "#define NPY_NO_DEPRECATED_API NPY_1_7_API_VERSION" [-Wcpp]
   17 | #warning "Using deprecated NumPy API, disable it with " \
      |  ^~~~~~~
build-3/src.linux-i686-3.9/scikits/umfpack/_umfpack_wrap.c: In function '_wrap_umfpack_dl_solve':
build-3/src.linux-i686-3.9/scikits/umfpack/_umfpack_wrap.c:3150:52: warning: passing argument 2 of 'umfpack_dl_solve' from incompatible pointer type [-Wincompatible-pointer-types]
 3150 |   result = (SuiteSparse_long)umfpack_dl_solve(arg1,(long long const (*))arg2,(long long const (*))arg3,(double const (*))arg4,arg5,(double const (*))arg6,arg7,(double const (*))arg8,arg9);
      |                                                    ^~~~~~~~~~~~~~~~~~~~~~~~~
      |                                                    |
      |                                                    const long long int *
In file included from /usr/include/umfpack/umfpack.h:48,
                 from build-3/src.linux-i686-3.9/scikits/umfpack/_umfpack_wrap.c:2712:
/usr/include/umfpack/umfpack_solve.h:26:28: note: expected 'const long int *' but argument is of type 'const long long int *'
   26 |     const SuiteSparse_long Ap [ ],
      |     ~~~~~~~~~~~~~~~~~~~~~~~^~~~~~
build-3/src.linux-i686-3.9/scikits/umfpack/_umfpack_wrap.c:3150:78: warning: passing argument 3 of 'umfpack_dl_solve' from incompatible pointer type [-Wincompatible-pointer-types]
 3150 |   result = (SuiteSparse_long)umfpack_dl_solve(arg1,(long long const (*))arg2,(long long const (*))arg3,(double const (*))arg4,arg5,(double const (*))arg6,arg7,(double const (*))arg8,arg9);
      |                                                                              ^~~~~~~~~~~~~~~~~~~~~~~~~
      |                                                                              |
      |                                                                              const long long int *
In file included from /usr/include/umfpack/umfpack.h:48,
                 from build-3/src.linux-i686-3.9/scikits/umfpack/_umfpack_wrap.c:2712:
/usr/include/umfpack/umfpack_solve.h:27:28: note: expected 'const long int *' but argument is of type 'const long long int *'
   27 |     const SuiteSparse_long Ai [ ],
      |     ~~~~~~~~~~~~~~~~~~~~~~~^~~~~~
build-3/src.linux-i686-3.9/scikits/umfpack/_umfpack_wrap.c: In function '_wrap_umfpack_zl_solve':
build-3/src.linux-i686-3.9/scikits/umfpack/_umfpack_wrap.c:3292:52: warning: passing argument 2 of 'umfpack_zl_solve' from incompatible pointer type [-Wincompatible-pointer-types]
 3292 |   result = (SuiteSparse_long)umfpack_zl_solve(arg1,(long long const (*))arg2,(long long const (*))arg3,(double const (*))arg4,(double const (*))arg5,arg6,arg7,(double const (*))arg8,(double const (*))arg9,arg10,(double const (*))arg11,arg12);
      |                                                    ^~~~~~~~~~~~~~~~~~~~~~~~~
      |                                                    |
      |                                                    const long long int *
In file included from /usr/include/umfpack/umfpack.h:48,
                 from build-3/src.linux-i686-3.9/scikits/umfpack/_umfpack_wrap.c:2712:
/usr/include/umfpack/umfpack_solve.h:52:28: note: expected 'const long int *' but argument is of type 'const long long int *'
   52 |     const SuiteSparse_long Ap [ ],
      |     ~~~~~~~~~~~~~~~~~~~~~~~^~~~~~
build-3/src.linux-i686-3.9/scikits/umfpack/_umfpack_wrap.c:3292:78: warning: passing argument 3 of 'umfpack_zl_solve' from incompatible pointer type [-Wincompatible-pointer-types]
 3292 |   result = (SuiteSparse_long)umfpack_zl_solve(arg1,(long long const (*))arg2,(long long const (*))arg3,(double const (*))arg4,(double const (*))arg5,arg6,arg7,(double const (*))arg8,(double const (*))arg9,arg10,(double const (*))arg11,arg12);
      |                                                                              ^~~~~~~~~~~~~~~~~~~~~~~~~
      |                                                                              |
      |                                                                              const long long int *
In file included from /usr/include/umfpack/umfpack.h:48,
                 from build-3/src.linux-i686-3.9/scikits/umfpack/_umfpack_wrap.c:2712:
/usr/include/umfpack/umfpack_solve.h:53:28: note: expected 'const long int *' but argument is of type 'const long long int *'
   53 |     const SuiteSparse_long Ai [ ],
      |     ~~~~~~~~~~~~~~~~~~~~~~~^~~~~~
build-3/src.linux-i686-3.9/scikits/umfpack/_umfpack_wrap.c: In function '_wrap_umfpack_dl_triplet_to_col':
build-3/src.linux-i686-3.9/scikits/umfpack/_umfpack_wrap.c:3550:71: warning: passing argument 4 of 'umfpack_dl_triplet_to_col' from incompatible pointer type [-Wincompatible-pointer-types]
 3550 |   result = (SuiteSparse_long)umfpack_dl_triplet_to_col(arg1,arg2,arg3,(long long const (*))arg4,(long long const (*))arg5,(double const (*))arg6,arg7,arg8,arg9,arg10);
      |                                                                       ^~~~~~~~~~~~~~~~~~~~~~~~~
      |                                                                       |
      |                                                                       const long long int *
In file included from /usr/include/umfpack/umfpack.h:58,
                 from build-3/src.linux-i686-3.9/scikits/umfpack/_umfpack_wrap.c:2712:
/usr/include/umfpack/umfpack_triplet_to_col.h:29:28: note: expected 'const long int *' but argument is of type 'const long long int *'
   29 |     const SuiteSparse_long Ti [ ],
      |     ~~~~~~~~~~~~~~~~~~~~~~~^~~~~~
build-3/src.linux-i686-3.9/scikits/umfpack/_umfpack_wrap.c:3550:97: warning: passing argument 5 of 'umfpack_dl_triplet_to_col' from incompatible pointer type [-Wincompatible-pointer-types]
 3550 |   result = (SuiteSparse_long)umfpack_dl_triplet_to_col(arg1,arg2,arg3,(long long const (*))arg4,(long long const (*))arg5,(double const (*))arg6,arg7,arg8,arg9,arg10);
      |                                                                                                 ^~~~~~~~~~~~~~~~~~~~~~~~~
      |                                                                                                 |
      |                                                                                                 const long long int *
In file included from /usr/include/umfpack/umfpack.h:58,
                 from build-3/src.linux-i686-3.9/scikits/umfpack/_umfpack_wrap.c:2712:
/usr/include/umfpack/umfpack_triplet_to_col.h:30:28: note: expected 'const long int *' but argument is of type 'const long long int *'
   30 |     const SuiteSparse_long Tj [ ],
      |     ~~~~~~~~~~~~~~~~~~~~~~~^~~~~~
build-3/src.linux-i686-3.9/scikits/umfpack/_umfpack_wrap.c: In function '_wrap_umfpack_zl_triplet_to_col':
build-3/src.linux-i686-3.9/scikits/umfpack/_umfpack_wrap.c:3760:71: warning: passing argument 4 of 'umfpack_zl_triplet_to_col' from incompatible pointer type [-Wincompatible-pointer-types]
 3760 |   result = (SuiteSparse_long)umfpack_zl_triplet_to_col(arg1,arg2,arg3,(long long const (*))arg4,(long long const (*))arg5,(double const (*))arg6,(double const (*))arg7,arg8,arg9,arg10,arg11,arg12);
      |                                                                       ^~~~~~~~~~~~~~~~~~~~~~~~~
      |                                                                       |
      |                                                                       const long long int *
In file included from /usr/include/umfpack/umfpack.h:58,
                 from build-3/src.linux-i686-3.9/scikits/umfpack/_umfpack_wrap.c:2712:
/usr/include/umfpack/umfpack_triplet_to_col.h:57:28: note: expected 'const long int *' but argument is of type 'const long long int *'
   57 |     const SuiteSparse_long Ti [ ],
      |     ~~~~~~~~~~~~~~~~~~~~~~~^~~~~~
build-3/src.linux-i686-3.9/scikits/umfpack/_umfpack_wrap.c:3760:97: warning: passing argument 5 of 'umfpack_zl_triplet_to_col' from incompatible pointer type [-Wincompatible-pointer-types]
 3760 |   result = (SuiteSparse_long)umfpack_zl_triplet_to_col(arg1,arg2,arg3,(long long const (*))arg4,(long long const (*))arg5,(double const (*))arg6,(double const (*))arg7,arg8,arg9,arg10,arg11,arg12);
      |                                                                                                 ^~~~~~~~~~~~~~~~~~~~~~~~~
      |                                                                                                 |
      |                                                                                                 const long long int *
In file included from /usr/include/umfpack/umfpack.h:58,
                 from build-3/src.linux-i686-3.9/scikits/umfpack/_umfpack_wrap.c:2712:
/usr/include/umfpack/umfpack_triplet_to_col.h:58:28: note: expected 'const long int *' but argument is of type 'const long long int *'
   58 |     const SuiteSparse_long Tj [ ],
      |     ~~~~~~~~~~~~~~~~~~~~~~~^~~~~~
build-3/src.linux-i686-3.9/scikits/umfpack/_umfpack_wrap.c: In function '_wrap_umfpack_dl_col_to_triplet':
build-3/src.linux-i686-3.9/scikits/umfpack/_umfpack_wrap.c:3826:61: warning: passing argument 2 of 'umfpack_dl_col_to_triplet' from incompatible pointer type [-Wincompatible-pointer-types]
 3826 |   result = (SuiteSparse_long)umfpack_dl_col_to_triplet(arg1,(long long const (*))arg2,arg3);
      |                                                             ^~~~~~~~~~~~~~~~~~~~~~~~~
      |                                                             |
      |                                                             const long long int *
In file included from /usr/include/umfpack/umfpack.h:59,
                 from build-3/src.linux-i686-3.9/scikits/umfpack/_umfpack_wrap.c:2712:
/usr/include/umfpack/umfpack_col_to_triplet.h:20:28: note: expected 'const long int *' but argument is of type 'const long long int *'
   20 |     const SuiteSparse_long Ap [ ],
      |     ~~~~~~~~~~~~~~~~~~~~~~~^~~~~~
build-3/src.linux-i686-3.9/scikits/umfpack/_umfpack_wrap.c: In function '_wrap_umfpack_zl_col_to_triplet':
build-3/src.linux-i686-3.9/scikits/umfpack/_umfpack_wrap.c:3892:61: warning: passing argument 2 of 'umfpack_zl_col_to_triplet' from incompatible pointer type [-Wincompatible-pointer-types]
 3892 |   result = (SuiteSparse_long)umfpack_zl_col_to_triplet(arg1,(long long const (*))arg2,arg3);
      |                                                             ^~~~~~~~~~~~~~~~~~~~~~~~~
      |                                                             |
      |                                                             const long long int *
In file included from /usr/include/umfpack/umfpack.h:59,
                 from build-3/src.linux-i686-3.9/scikits/umfpack/_umfpack_wrap.c:2712:
/usr/include/umfpack/umfpack_col_to_triplet.h:34:28: note: expected 'const long int *' but argument is of type 'const long long int *'
   34 |     const SuiteSparse_long Ap [ ],
      |     ~~~~~~~~~~~~~~~~~~~~~~~^~~~~~
build-3/src.linux-i686-3.9/scikits/umfpack/_umfpack_wrap.c: In function '_wrap_umfpack_dl_transpose':
build-3/src.linux-i686-3.9/scikits/umfpack/_umfpack_wrap.c:4050:61: warning: passing argument 3 of 'umfpack_dl_transpose' from incompatible pointer type [-Wincompatible-pointer-types]
 4050 |   result = (SuiteSparse_long)umfpack_dl_transpose(arg1,arg2,(long long const (*))arg3,(long long const (*))arg4,(double const (*))arg5,(long long const (*))arg6,(long long const (*))arg7,arg8,arg9,arg10);
      |                                                             ^~~~~~~~~~~~~~~~~~~~~~~~~
      |                                                             |
      |                                                             const long long int *
In file included from /usr/include/umfpack/umfpack.h:60,
                 from build-3/src.linux-i686-3.9/scikits/umfpack/_umfpack_wrap.c:2712:
/usr/include/umfpack/umfpack_transpose.h:28:28: note: expected 'const long int *' but argument is of type 'const long long int *'
   28 |     const SuiteSparse_long Ap [ ],
      |     ~~~~~~~~~~~~~~~~~~~~~~~^~~~~~
build-3/src.linux-i686-3.9/scikits/umfpack/_umfpack_wrap.c:4050:87: warning: passing argument 4 of 'umfpack_dl_transpose' from incompatible pointer type [-Wincompatible-pointer-types]
 4050 |   result = (SuiteSparse_long)umfpack_dl_transpose(arg1,arg2,(long long const (*))arg3,(long long const (*))arg4,(double const (*))arg5,(long long const (*))arg6,(long long const (*))arg7,arg8,arg9,arg10);
      |                                                                                       ^~~~~~~~~~~~~~~~~~~~~~~~~
      |                                                                                       |
      |                                                                                       const long long int *
In file included from /usr/include/umfpack/umfpack.h:60,
                 from build-3/src.linux-i686-3.9/scikits/umfpack/_umfpack_wrap.c:2712:
/usr/include/umfpack/umfpack_transpose.h:29:28: note: expected 'const long int *' but argument is of type 'const long long int *'
   29 |     const SuiteSparse_long Ai [ ],
      |     ~~~~~~~~~~~~~~~~~~~~~~~^~~~~~
build-3/src.linux-i686-3.9/scikits/umfpack/_umfpack_wrap.c:4050:136: warning: passing argument 6 of 'umfpack_dl_transpose' from incompatible pointer type [-Wincompatible-pointer-types]
 4050 |   result = (SuiteSparse_long)umfpack_dl_transpose(arg1,arg2,(long long const (*))arg3,(long long const (*))arg4,(double const (*))arg5,(long long const (*))arg6,(long long const (*))arg7,arg8,arg9,arg10);
      |                                                                                                                                        ^~~~~~~~~~~~~~~~~~~~~~~~~
      |                                                                                                                                        |
      |                                                                                                                                        const long long int *
In file included from /usr/include/umfpack/umfpack.h:60,
                 from build-3/src.linux-i686-3.9/scikits/umfpack/_umfpack_wrap.c:2712:
/usr/include/umfpack/umfpack_transpose.h:31:28: note: expected 'const long int *' but argument is of type 'const long long int *'
   31 |     const SuiteSparse_long P [ ],
      |     ~~~~~~~~~~~~~~~~~~~~~~~^~~~~
build-3/src.linux-i686-3.9/scikits/umfpack/_umfpack_wrap.c:4050:162: warning: passing argument 7 of 'umfpack_dl_transpose' from incompatible pointer type [-Wincompatible-pointer-types]
 4050 |   result = (SuiteSparse_long)umfpack_dl_transpose(arg1,arg2,(long long const (*))arg3,(long long const (*))arg4,(double const (*))arg5,(long long const (*))arg6,(long long const (*))arg7,arg8,arg9,arg10);
      |                                                                                                                                                                  ^~~~~~~~~~~~~~~~~~~~~~~~~
      |                                                                                                                                                                  |
      |                                                                                                                                                                  const long long int *
In file included from /usr/include/umfpack/umfpack.h:60,
                 from build-3/src.linux-i686-3.9/scikits/umfpack/_umfpack_wrap.c:2712:
/usr/include/umfpack/umfpack_transpose.h:32:28: note: expected 'const long int *' but argument is of type 'const long long int *'
   32 |     const SuiteSparse_long Q [ ],
      |     ~~~~~~~~~~~~~~~~~~~~~~~^~~~~
build-3/src.linux-i686-3.9/scikits/umfpack/_umfpack_wrap.c: In function '_wrap_umfpack_zl_transpose':
build-3/src.linux-i686-3.9/scikits/umfpack/_umfpack_wrap.c:4244:61: warning: passing argument 3 of 'umfpack_zl_transpose' from incompatible pointer type [-Wincompatible-pointer-types]
 4244 |   result = (SuiteSparse_long)umfpack_zl_transpose(arg1,arg2,(long long const (*))arg3,(long long const (*))arg4,(double const (*))arg5,(double const (*))arg6,(long long const (*))arg7,(long long const (*))arg8,arg9,arg10,arg11,arg12,arg13);
      |                                                             ^~~~~~~~~~~~~~~~~~~~~~~~~
      |                                                             |
      |                                                             const long long int *
In file included from /usr/include/umfpack/umfpack.h:60,
                 from build-3/src.linux-i686-3.9/scikits/umfpack/_umfpack_wrap.c:2712:
/usr/include/umfpack/umfpack_transpose.h:57:28: note: expected 'const long int *' but argument is of type 'const long long int *'
   57 |     const SuiteSparse_long Ap [ ],
      |     ~~~~~~~~~~~~~~~~~~~~~~~^~~~~~
build-3/src.linux-i686-3.9/scikits/umfpack/_umfpack_wrap.c:4244:87: warning: passing argument 4 of 'umfpack_zl_transpose' from incompatible pointer type [-Wincompatible-pointer-types]
 4244 |   result = (SuiteSparse_long)umfpack_zl_transpose(arg1,arg2,(long long const (*))arg3,(long long const (*))arg4,(double const (*))arg5,(double const (*))arg6,(long long const (*))arg7,(long long const (*))arg8,arg9,arg10,arg11,arg12,arg13);
      |                                                                                       ^~~~~~~~~~~~~~~~~~~~~~~~~
      |                                                                                       |
      |                                                                                       const long long int *
In file included from /usr/include/umfpack/umfpack.h:60,
                 from build-3/src.linux-i686-3.9/scikits/umfpack/_umfpack_wrap.c:2712:
/usr/include/umfpack/umfpack_transpose.h:58:28: note: expected 'const long int *' but argument is of type 'const long long int *'
   58 |     const SuiteSparse_long Ai [ ],
      |     ~~~~~~~~~~~~~~~~~~~~~~~^~~~~~
build-3/src.linux-i686-3.9/scikits/umfpack/_umfpack_wrap.c:4244:159: warning: passing argument 7 of 'umfpack_zl_transpose' from incompatible pointer type [-Wincompatible-pointer-types]
 4244 |   result = (SuiteSparse_long)umfpack_zl_transpose(arg1,arg2,(long long const (*))arg3,(long long const (*))arg4,(double const (*))arg5,(double const (*))arg6,(long long const (*))arg7,(long long const (*))arg8,arg9,arg10,arg11,arg12,arg13);
      |                                                                                                                                                               ^~~~~~~~~~~~~~~~~~~~~~~~~
      |                                                                                                                                                               |
      |                                                                                                                                                               const long long int *
In file included from /usr/include/umfpack/umfpack.h:60,
                 from build-3/src.linux-i686-3.9/scikits/umfpack/_umfpack_wrap.c:2712:
/usr/include/umfpack/umfpack_transpose.h:60:28: note: expected 'const long int *' but argument is of type 'const long long int *'
   60 |     const SuiteSparse_long P [ ],
      |     ~~~~~~~~~~~~~~~~~~~~~~~^~~~~
build-3/src.linux-i686-3.9/scikits/umfpack/_umfpack_wrap.c:4244:185: warning: passing argument 8 of 'umfpack_zl_transpose' from incompatible pointer type [-Wincompatible-pointer-types]
 4244 |   result = (SuiteSparse_long)umfpack_zl_transpose(arg1,arg2,(long long const (*))arg3,(long long const (*))arg4,(double const (*))arg5,(double const (*))arg6,(long long const (*))arg7,(long long const (*))arg8,arg9,arg10,arg11,arg12,arg13);
      |                                                                                                                                                                                         ^~~~~~~~~~~~~~~~~~~~~~~~~
      |                                                                                                                                                                                         |
      |                                                                                                                                                                                         const long long int *
In file included from /usr/include/umfpack/umfpack.h:60,
                 from build-3/src.linux-i686-3.9/scikits/umfpack/_umfpack_wrap.c:2712:
/usr/include/umfpack/umfpack_transpose.h:61:28: note: expected 'const long int *' but argument is of type 'const long long int *'
   61 |     const SuiteSparse_long Q [ ],
      |     ~~~~~~~~~~~~~~~~~~~~~~~^~~~~
build-3/src.linux-i686-3.9/scikits/umfpack/_umfpack_wrap.c: In function '_wrap_umfpack_dl_symbolic':
build-3/src.linux-i686-3.9/scikits/umfpack/_umfpack_wrap.c:4887:60: warning: passing argument 3 of 'umfpack_dl_symbolic' from incompatible pointer type [-Wincompatible-pointer-types]
 4887 |   result = (SuiteSparse_long)umfpack_dl_symbolic(arg1,arg2,(long long const (*))arg3,(long long const (*))arg4,(double const (*))arg5,arg6,(double const (*))arg7,arg8);
      |                                                            ^~~~~~~~~~~~~~~~~~~~~~~~~
      |                                                            |
      |                                                            const long long int *
In file included from /usr/include/umfpack/umfpack.h:46,
                 from build-3/src.linux-i686-3.9/scikits/umfpack/_umfpack_wrap.c:2712:
/usr/include/umfpack/umfpack_symbolic.h:26:28: note: expected 'const long int *' but argument is of type 'const long long int *'
   26 |     const SuiteSparse_long Ap [ ],
      |     ~~~~~~~~~~~~~~~~~~~~~~~^~~~~~
build-3/src.linux-i686-3.9/scikits/umfpack/_umfpack_wrap.c:4887:86: warning: passing argument 4 of 'umfpack_dl_symbolic' from incompatible pointer type [-Wincompatible-pointer-types]
 4887 |   result = (SuiteSparse_long)umfpack_dl_symbolic(arg1,arg2,(long long const (*))arg3,(long long const (*))arg4,(double const (*))arg5,arg6,(double const (*))arg7,arg8);
      |                                                                                      ^~~~~~~~~~~~~~~~~~~~~~~~~
      |                                                                                      |
      |                                                                                      const long long int *
In file included from /usr/include/umfpack/umfpack.h:46,
                 from build-3/src.linux-i686-3.9/scikits/umfpack/_umfpack_wrap.c:2712:
/usr/include/umfpack/umfpack_symbolic.h:27:28: note: expected 'const long int *' but argument is of type 'const long long int *'
   27 |     const SuiteSparse_long Ai [ ],
      |     ~~~~~~~~~~~~~~~~~~~~~~~^~~~~~
build-3/src.linux-i686-3.9/scikits/umfpack/_umfpack_wrap.c: In function '_wrap_umfpack_zl_symbolic':
build-3/src.linux-i686-3.9/scikits/umfpack/_umfpack_wrap.c:5013:60: warning: passing argument 3 of 'umfpack_zl_symbolic' from incompatible pointer type [-Wincompatible-pointer-types]
 5013 |   result = (SuiteSparse_long)umfpack_zl_symbolic(arg1,arg2,(long long const (*))arg3,(long long const (*))arg4,(double const (*))arg5,(double const (*))arg6,arg7,(double const (*))arg8,arg9);
      |                                                            ^~~~~~~~~~~~~~~~~~~~~~~~~
      |                                                            |
      |                                                            const long long int *
In file included from /usr/include/umfpack/umfpack.h:46,
                 from build-3/src.linux-i686-3.9/scikits/umfpack/_umfpack_wrap.c:2712:
/usr/include/umfpack/umfpack_symbolic.h:50:28: note: expected 'const long int *' but argument is of type 'const long long int *'
   50 |     const SuiteSparse_long Ap [ ],
      |     ~~~~~~~~~~~~~~~~~~~~~~~^~~~~~
build-3/src.linux-i686-3.9/scikits/umfpack/_umfpack_wrap.c:5013:86: warning: passing argument 4 of 'umfpack_zl_symbolic' from incompatible pointer type [-Wincompatible-pointer-types]
 5013 |   result = (SuiteSparse_long)umfpack_zl_symbolic(arg1,arg2,(long long const (*))arg3,(long long const (*))arg4,(double const (*))arg5,(double const (*))arg6,arg7,(double const (*))arg8,arg9);
      |                                                                                      ^~~~~~~~~~~~~~~~~~~~~~~~~
      |                                                                                      |
      |                                                                                      const long long int *
In file included from /usr/include/umfpack/umfpack.h:46,
                 from build-3/src.linux-i686-3.9/scikits/umfpack/_umfpack_wrap.c:2712:
/usr/include/umfpack/umfpack_symbolic.h:51:28: note: expected 'const long int *' but argument is of type 'const long long int *'
   51 |     const SuiteSparse_long Ai [ ],
      |     ~~~~~~~~~~~~~~~~~~~~~~~^~~~~~
build-3/src.linux-i686-3.9/scikits/umfpack/_umfpack_wrap.c: In function '_wrap_umfpack_dl_numeric':
build-3/src.linux-i686-3.9/scikits/umfpack/_umfpack_wrap.c:5119:49: warning: passing argument 1 of 'umfpack_dl_numeric' from incompatible pointer type [-Wincompatible-pointer-types]
 5119 |   result = (SuiteSparse_long)umfpack_dl_numeric((long long const (*))arg1,(long long const (*))arg2,(double const (*))arg3,arg4,arg5,(double const (*))arg6,arg7);
      |                                                 ^~~~~~~~~~~~~~~~~~~~~~~~~
      |                                                 |
      |                                                 const long long int *
In file included from /usr/include/umfpack/umfpack.h:47,
                 from build-3/src.linux-i686-3.9/scikits/umfpack/_umfpack_wrap.c:2712:
/usr/include/umfpack/umfpack_numeric.h:23:28: note: expected 'const long int *' but argument is of type 'const long long int *'
   23 |     const SuiteSparse_long Ap [ ],
      |     ~~~~~~~~~~~~~~~~~~~~~~~^~~~~~
build-3/src.linux-i686-3.9/scikits/umfpack/_umfpack_wrap.c:5119:75: warning: passing argument 2 of 'umfpack_dl_numeric' from incompatible pointer type [-Wincompatible-pointer-types]
 5119 |   result = (SuiteSparse_long)umfpack_dl_numeric((long long const (*))arg1,(long long const (*))arg2,(double const (*))arg3,arg4,arg5,(double const (*))arg6,arg7);
      |                                                                           ^~~~~~~~~~~~~~~~~~~~~~~~~
      |                                                                           |
      |                                                                           const long long int *
In file included from /usr/include/umfpack/umfpack.h:47,
                 from build-3/src.linux-i686-3.9/scikits/umfpack/_umfpack_wrap.c:2712:
/usr/include/umfpack/umfpack_numeric.h:24:28: note: expected 'const long int *' but argument is of type 'const long long int *'
   24 |     const SuiteSparse_long Ai [ ],
      |     ~~~~~~~~~~~~~~~~~~~~~~~^~~~~~
build-3/src.linux-i686-3.9/scikits/umfpack/_umfpack_wrap.c: In function '_wrap_umfpack_zl_numeric':
build-3/src.linux-i686-3.9/scikits/umfpack/_umfpack_wrap.c:5233:49: warning: passing argument 1 of 'umfpack_zl_numeric' from incompatible pointer type [-Wincompatible-pointer-types]
 5233 |   result = (SuiteSparse_long)umfpack_zl_numeric((long long const (*))arg1,(long long const (*))arg2,(double const (*))arg3,(double const (*))arg4,arg5,arg6,(double const (*))arg7,arg8);
      |                                                 ^~~~~~~~~~~~~~~~~~~~~~~~~
      |                                                 |
      |                                                 const long long int *
In file included from /usr/include/umfpack/umfpack.h:47,
                 from build-3/src.linux-i686-3.9/scikits/umfpack/_umfpack_wrap.c:2712:
/usr/include/umfpack/umfpack_numeric.h:45:28: note: expected 'const long int *' but argument is of type 'const long long int *'
   45 |     const SuiteSparse_long Ap [ ],
      |     ~~~~~~~~~~~~~~~~~~~~~~~^~~~~~
build-3/src.linux-i686-3.9/scikits/umfpack/_umfpack_wrap.c:5233:75: warning: passing argument 2 of 'umfpack_zl_numeric' from incompatible pointer type [-Wincompatible-pointer-types]
 5233 |   result = (SuiteSparse_long)umfpack_zl_numeric((long long const (*))arg1,(long long const (*))arg2,(double const (*))arg3,(double const (*))arg4,arg5,arg6,(double const (*))arg7,arg8);
      |                                                                           ^~~~~~~~~~~~~~~~~~~~~~~~~
      |                                                                           |
      |                                                                           const long long int *
In file included from /usr/include/umfpack/umfpack.h:47,
                 from build-3/src.linux-i686-3.9/scikits/umfpack/_umfpack_wrap.c:2712:
/usr/include/umfpack/umfpack_numeric.h:46:28: note: expected 'const long int *' but argument is of type 'const long long int *'
   46 |     const SuiteSparse_long Ai [ ],
      |     ~~~~~~~~~~~~~~~~~~~~~~~^~~~~~
i686-pld-linux-gcc -shared -Wl,--as-needed -Wl,--no-copy-dt-needed-entries -Wl,-z,relro -Wl,-z,combreloc -Wl,--as-needed -Wl,--no-copy-dt-needed-entries -Wl,-z,relro -Wl,-z,combreloc -O2 -fwrapv -pipe -Wformat -Werror=format-security -gdwarf-4 -fno-debug-types-section -fvar-tracking-assignments -g2 -Wp,-D_FORTIFY_SOURCE=2 -fstack-protector-strong --param=ssp-buffer-size=4 -Werror=trampolines -fomit-frame-pointer -march=i686 -fasynchronous-unwind-tables -mtune=pentium4 -gdwarf-4 -fno-debug-types-section -fvar-tracking-assignments -g2 build-3/temp.linux-i686-3.9/build-3/src.linux-i686-3.9/scikits/umfpack/_umfpack_wrap.o -L/usr/lib -L/usr/lib -Wl,--enable-new-dtags,-R/usr/lib -lrt -lumfpack -lamd -lamd -lumfpack -lcblas -lblas -lblas -o build-3/lib.linux-i686-3.9/scikits/umfpack/__umfpack.cpython-39-i386-linux-gnu.so
running test
WARNING: Testing via this command is deprecated and will be removed in a future version. Users looking for a generic test entry point independent of test runner are encouraged to use tox.
running egg_info
writing scikit_umfpack.egg-info/PKG-INFO
writing dependency_links to scikit_umfpack.egg-info/dependency_links.txt
writing requirements to scikit_umfpack.egg-info/requires.txt
writing top-level names to scikit_umfpack.egg-info/top_level.txt
reading manifest file 'scikit_umfpack.egg-info/SOURCES.txt'
reading manifest template 'MANIFEST.in'
writing manifest file 'scikit_umfpack.egg-info/SOURCES.txt'
running build_ext
customize UnixCCompiler
customize UnixCCompiler using build_ext
building 'scikits.umfpack.__umfpack' extension
compiling C sources
C compiler: i686-pld-linux-gcc -Wno-unused-result -Wsign-compare -DNDEBUG -O2 -fwrapv -pipe -Wformat -Werror=format-security -gdwarf-4 -fno-debug-types-section -fvar-tracking-assignments -g2 -Wp,-D_FORTIFY_SOURCE=2 -fstack-protector-strong --param=ssp-buffer-size=4 -Werror=trampolines -fomit-frame-pointer -march=i686 -fasynchronous-unwind-tables -mtune=pentium4 -gdwarf-4 -fno-debug-types-section -fvar-tracking-assignments -g2 -O2 -fwrapv -pipe -Wformat -Werror=format-security -gdwarf-4 -fno-debug-types-section -fvar-tracking-assignments -g2 -Wp,-D_FORTIFY_SOURCE=2 -fstack-protector-strong --param=ssp-buffer-size=4 -Werror=trampolines -fomit-frame-pointer -march=i686 -fasynchronous-unwind-tables -mtune=pentium4 -gdwarf-4 -fno-debug-types-section -fvar-tracking-assignments -g2 -O2 -fwrapv -pipe -Wformat -Werror=format-security -gdwarf-4 -fno-debug-types-section -fvar-tracking-assignments -g2 -Wp,-D_FORTIFY_SOURCE=2 -fstack-protector-strong --param=ssp-buffer-size=4 -Werror=trampolines -fomit-frame-pointer -march=i686 -fasynchronous-unwind-tables -mtune=pentium4 -gdwarf-4 -fno-debug-types-section -fvar-tracking-assignments -g2 -fPIC

compile options: '-DSCIPY_UMFPACK_H -DNO_ATLAS_INFO=1 -DHAVE_CBLAS -I/usr/include/umfpack -I/usr/lib -I/usr/local/include -I/usr/include -I/usr/lib/python3.9/site-packages/numpy/core/include -I/usr/include/python3.9 -I/usr/include/python3.9 -c'
i686-pld-linux-gcc: build-3/src.linux-i686-3.9/scikits/umfpack/_umfpack_wrap.c
In file included from /usr/lib/python3.9/site-packages/numpy/core/include/numpy/ndarraytypes.h:1822,
                 from /usr/lib/python3.9/site-packages/numpy/core/include/numpy/ndarrayobject.h:12,
                 from /usr/lib/python3.9/site-packages/numpy/core/include/numpy/arrayobject.h:4,
                 from build-3/src.linux-i686-3.9/scikits/umfpack/_umfpack_wrap.c:2713:
/usr/lib/python3.9/site-packages/numpy/core/include/numpy/npy_1_7_deprecated_api.h:17:2: warning: #warning "Using deprecated NumPy API, disable it with " "#define NPY_NO_DEPRECATED_API NPY_1_7_API_VERSION" [-Wcpp]
   17 | #warning "Using deprecated NumPy API, disable it with " \
      |  ^~~~~~~
build-3/src.linux-i686-3.9/scikits/umfpack/_umfpack_wrap.c: In function '_wrap_umfpack_dl_solve':
build-3/src.linux-i686-3.9/scikits/umfpack/_umfpack_wrap.c:3150:52: warning: passing argument 2 of 'umfpack_dl_solve' from incompatible pointer type [-Wincompatible-pointer-types]
 3150 |   result = (SuiteSparse_long)umfpack_dl_solve(arg1,(long long const (*))arg2,(long long const (*))arg3,(double const (*))arg4,arg5,(double const (*))arg6,arg7,(double const (*))arg8,arg9);
      |                                                    ^~~~~~~~~~~~~~~~~~~~~~~~~
      |                                                    |
      |                                                    const long long int *
In file included from /usr/include/umfpack/umfpack.h:48,
                 from build-3/src.linux-i686-3.9/scikits/umfpack/_umfpack_wrap.c:2712:
/usr/include/umfpack/umfpack_solve.h:26:28: note: expected 'const long int *' but argument is of type 'const long long int *'
   26 |     const SuiteSparse_long Ap [ ],
      |     ~~~~~~~~~~~~~~~~~~~~~~~^~~~~~
build-3/src.linux-i686-3.9/scikits/umfpack/_umfpack_wrap.c:3150:78: warning: passing argument 3 of 'umfpack_dl_solve' from incompatible pointer type [-Wincompatible-pointer-types]
 3150 |   result = (SuiteSparse_long)umfpack_dl_solve(arg1,(long long const (*))arg2,(long long const (*))arg3,(double const (*))arg4,arg5,(double const (*))arg6,arg7,(double const (*))arg8,arg9);
      |                                                                              ^~~~~~~~~~~~~~~~~~~~~~~~~
      |                                                                              |
      |                                                                              const long long int *
In file included from /usr/include/umfpack/umfpack.h:48,
                 from build-3/src.linux-i686-3.9/scikits/umfpack/_umfpack_wrap.c:2712:
/usr/include/umfpack/umfpack_solve.h:27:28: note: expected 'const long int *' but argument is of type 'const long long int *'
   27 |     const SuiteSparse_long Ai [ ],
      |     ~~~~~~~~~~~~~~~~~~~~~~~^~~~~~
build-3/src.linux-i686-3.9/scikits/umfpack/_umfpack_wrap.c: In function '_wrap_umfpack_zl_solve':
build-3/src.linux-i686-3.9/scikits/umfpack/_umfpack_wrap.c:3292:52: warning: passing argument 2 of 'umfpack_zl_solve' from incompatible pointer type [-Wincompatible-pointer-types]
 3292 |   result = (SuiteSparse_long)umfpack_zl_solve(arg1,(long long const (*))arg2,(long long const (*))arg3,(double const (*))arg4,(double const (*))arg5,arg6,arg7,(double const (*))arg8,(double const (*))arg9,arg10,(double const (*))arg11,arg12);
      |                                                    ^~~~~~~~~~~~~~~~~~~~~~~~~
      |                                                    |
      |                                                    const long long int *
In file included from /usr/include/umfpack/umfpack.h:48,
                 from build-3/src.linux-i686-3.9/scikits/umfpack/_umfpack_wrap.c:2712:
/usr/include/umfpack/umfpack_solve.h:52:28: note: expected 'const long int *' but argument is of type 'const long long int *'
   52 |     const SuiteSparse_long Ap [ ],
      |     ~~~~~~~~~~~~~~~~~~~~~~~^~~~~~
build-3/src.linux-i686-3.9/scikits/umfpack/_umfpack_wrap.c:3292:78: warning: passing argument 3 of 'umfpack_zl_solve' from incompatible pointer type [-Wincompatible-pointer-types]
 3292 |   result = (SuiteSparse_long)umfpack_zl_solve(arg1,(long long const (*))arg2,(long long const (*))arg3,(double const (*))arg4,(double const (*))arg5,arg6,arg7,(double const (*))arg8,(double const (*))arg9,arg10,(double const (*))arg11,arg12);
      |                                                                              ^~~~~~~~~~~~~~~~~~~~~~~~~
      |                                                                              |
      |                                                                              const long long int *
In file included from /usr/include/umfpack/umfpack.h:48,
                 from build-3/src.linux-i686-3.9/scikits/umfpack/_umfpack_wrap.c:2712:
/usr/include/umfpack/umfpack_solve.h:53:28: note: expected 'const long int *' but argument is of type 'const long long int *'
   53 |     const SuiteSparse_long Ai [ ],
      |     ~~~~~~~~~~~~~~~~~~~~~~~^~~~~~
build-3/src.linux-i686-3.9/scikits/umfpack/_umfpack_wrap.c: In function '_wrap_umfpack_dl_triplet_to_col':
build-3/src.linux-i686-3.9/scikits/umfpack/_umfpack_wrap.c:3550:71: warning: passing argument 4 of 'umfpack_dl_triplet_to_col' from incompatible pointer type [-Wincompatible-pointer-types]
 3550 |   result = (SuiteSparse_long)umfpack_dl_triplet_to_col(arg1,arg2,arg3,(long long const (*))arg4,(long long const (*))arg5,(double const (*))arg6,arg7,arg8,arg9,arg10);
      |                                                                       ^~~~~~~~~~~~~~~~~~~~~~~~~
      |                                                                       |
      |                                                                       const long long int *
In file included from /usr/include/umfpack/umfpack.h:58,
                 from build-3/src.linux-i686-3.9/scikits/umfpack/_umfpack_wrap.c:2712:
/usr/include/umfpack/umfpack_triplet_to_col.h:29:28: note: expected 'const long int *' but argument is of type 'const long long int *'
   29 |     const SuiteSparse_long Ti [ ],
      |     ~~~~~~~~~~~~~~~~~~~~~~~^~~~~~
build-3/src.linux-i686-3.9/scikits/umfpack/_umfpack_wrap.c:3550:97: warning: passing argument 5 of 'umfpack_dl_triplet_to_col' from incompatible pointer type [-Wincompatible-pointer-types]
 3550 |   result = (SuiteSparse_long)umfpack_dl_triplet_to_col(arg1,arg2,arg3,(long long const (*))arg4,(long long const (*))arg5,(double const (*))arg6,arg7,arg8,arg9,arg10);
      |                                                                                                 ^~~~~~~~~~~~~~~~~~~~~~~~~
      |                                                                                                 |
      |                                                                                                 const long long int *
In file included from /usr/include/umfpack/umfpack.h:58,
                 from build-3/src.linux-i686-3.9/scikits/umfpack/_umfpack_wrap.c:2712:
/usr/include/umfpack/umfpack_triplet_to_col.h:30:28: note: expected 'const long int *' but argument is of type 'const long long int *'
   30 |     const SuiteSparse_long Tj [ ],
      |     ~~~~~~~~~~~~~~~~~~~~~~~^~~~~~
build-3/src.linux-i686-3.9/scikits/umfpack/_umfpack_wrap.c: In function '_wrap_umfpack_zl_triplet_to_col':
build-3/src.linux-i686-3.9/scikits/umfpack/_umfpack_wrap.c:3760:71: warning: passing argument 4 of 'umfpack_zl_triplet_to_col' from incompatible pointer type [-Wincompatible-pointer-types]
 3760 |   result = (SuiteSparse_long)umfpack_zl_triplet_to_col(arg1,arg2,arg3,(long long const (*))arg4,(long long const (*))arg5,(double const (*))arg6,(double const (*))arg7,arg8,arg9,arg10,arg11,arg12);
      |                                                                       ^~~~~~~~~~~~~~~~~~~~~~~~~
      |                                                                       |
      |                                                                       const long long int *
In file included from /usr/include/umfpack/umfpack.h:58,
                 from build-3/src.linux-i686-3.9/scikits/umfpack/_umfpack_wrap.c:2712:
/usr/include/umfpack/umfpack_triplet_to_col.h:57:28: note: expected 'const long int *' but argument is of type 'const long long int *'
   57 |     const SuiteSparse_long Ti [ ],
      |     ~~~~~~~~~~~~~~~~~~~~~~~^~~~~~
build-3/src.linux-i686-3.9/scikits/umfpack/_umfpack_wrap.c:3760:97: warning: passing argument 5 of 'umfpack_zl_triplet_to_col' from incompatible pointer type [-Wincompatible-pointer-types]
 3760 |   result = (SuiteSparse_long)umfpack_zl_triplet_to_col(arg1,arg2,arg3,(long long const (*))arg4,(long long const (*))arg5,(double const (*))arg6,(double const (*))arg7,arg8,arg9,arg10,arg11,arg12);
      |                                                                                                 ^~~~~~~~~~~~~~~~~~~~~~~~~
      |                                                                                                 |
      |                                                                                                 const long long int *
In file included from /usr/include/umfpack/umfpack.h:58,
                 from build-3/src.linux-i686-3.9/scikits/umfpack/_umfpack_wrap.c:2712:
/usr/include/umfpack/umfpack_triplet_to_col.h:58:28: note: expected 'const long int *' but argument is of type 'const long long int *'
   58 |     const SuiteSparse_long Tj [ ],
      |     ~~~~~~~~~~~~~~~~~~~~~~~^~~~~~
build-3/src.linux-i686-3.9/scikits/umfpack/_umfpack_wrap.c: In function '_wrap_umfpack_dl_col_to_triplet':
build-3/src.linux-i686-3.9/scikits/umfpack/_umfpack_wrap.c:3826:61: warning: passing argument 2 of 'umfpack_dl_col_to_triplet' from incompatible pointer type [-Wincompatible-pointer-types]
 3826 |   result = (SuiteSparse_long)umfpack_dl_col_to_triplet(arg1,(long long const (*))arg2,arg3);
      |                                                             ^~~~~~~~~~~~~~~~~~~~~~~~~
      |                                                             |
      |                                                             const long long int *
In file included from /usr/include/umfpack/umfpack.h:59,
                 from build-3/src.linux-i686-3.9/scikits/umfpack/_umfpack_wrap.c:2712:
/usr/include/umfpack/umfpack_col_to_triplet.h:20:28: note: expected 'const long int *' but argument is of type 'const long long int *'
   20 |     const SuiteSparse_long Ap [ ],
      |     ~~~~~~~~~~~~~~~~~~~~~~~^~~~~~
build-3/src.linux-i686-3.9/scikits/umfpack/_umfpack_wrap.c: In function '_wrap_umfpack_zl_col_to_triplet':
build-3/src.linux-i686-3.9/scikits/umfpack/_umfpack_wrap.c:3892:61: warning: passing argument 2 of 'umfpack_zl_col_to_triplet' from incompatible pointer type [-Wincompatible-pointer-types]
 3892 |   result = (SuiteSparse_long)umfpack_zl_col_to_triplet(arg1,(long long const (*))arg2,arg3);
      |                                                             ^~~~~~~~~~~~~~~~~~~~~~~~~
      |                                                             |
      |                                                             const long long int *
In file included from /usr/include/umfpack/umfpack.h:59,
                 from build-3/src.linux-i686-3.9/scikits/umfpack/_umfpack_wrap.c:2712:
/usr/include/umfpack/umfpack_col_to_triplet.h:34:28: note: expected 'const long int *' but argument is of type 'const long long int *'
   34 |     const SuiteSparse_long Ap [ ],
      |     ~~~~~~~~~~~~~~~~~~~~~~~^~~~~~
build-3/src.linux-i686-3.9/scikits/umfpack/_umfpack_wrap.c: In function '_wrap_umfpack_dl_transpose':
build-3/src.linux-i686-3.9/scikits/umfpack/_umfpack_wrap.c:4050:61: warning: passing argument 3 of 'umfpack_dl_transpose' from incompatible pointer type [-Wincompatible-pointer-types]
 4050 |   result = (SuiteSparse_long)umfpack_dl_transpose(arg1,arg2,(long long const (*))arg3,(long long const (*))arg4,(double const (*))arg5,(long long const (*))arg6,(long long const (*))arg7,arg8,arg9,arg10);
      |                                                             ^~~~~~~~~~~~~~~~~~~~~~~~~
      |                                                             |
      |                                                             const long long int *
In file included from /usr/include/umfpack/umfpack.h:60,
                 from build-3/src.linux-i686-3.9/scikits/umfpack/_umfpack_wrap.c:2712:
/usr/include/umfpack/umfpack_transpose.h:28:28: note: expected 'const long int *' but argument is of type 'const long long int *'
   28 |     const SuiteSparse_long Ap [ ],
      |     ~~~~~~~~~~~~~~~~~~~~~~~^~~~~~
build-3/src.linux-i686-3.9/scikits/umfpack/_umfpack_wrap.c:4050:87: warning: passing argument 4 of 'umfpack_dl_transpose' from incompatible pointer type [-Wincompatible-pointer-types]
 4050 |   result = (SuiteSparse_long)umfpack_dl_transpose(arg1,arg2,(long long const (*))arg3,(long long const (*))arg4,(double const (*))arg5,(long long const (*))arg6,(long long const (*))arg7,arg8,arg9,arg10);
      |                                                                                       ^~~~~~~~~~~~~~~~~~~~~~~~~
      |                                                                                       |
      |                                                                                       const long long int *
In file included from /usr/include/umfpack/umfpack.h:60,
                 from build-3/src.linux-i686-3.9/scikits/umfpack/_umfpack_wrap.c:2712:
/usr/include/umfpack/umfpack_transpose.h:29:28: note: expected 'const long int *' but argument is of type 'const long long int *'
   29 |     const SuiteSparse_long Ai [ ],
      |     ~~~~~~~~~~~~~~~~~~~~~~~^~~~~~
build-3/src.linux-i686-3.9/scikits/umfpack/_umfpack_wrap.c:4050:136: warning: passing argument 6 of 'umfpack_dl_transpose' from incompatible pointer type [-Wincompatible-pointer-types]
 4050 |   result = (SuiteSparse_long)umfpack_dl_transpose(arg1,arg2,(long long const (*))arg3,(long long const (*))arg4,(double const (*))arg5,(long long const (*))arg6,(long long const (*))arg7,arg8,arg9,arg10);
      |                                                                                                                                        ^~~~~~~~~~~~~~~~~~~~~~~~~
      |                                                                                                                                        |
      |                                                                                                                                        const long long int *
In file included from /usr/include/umfpack/umfpack.h:60,
                 from build-3/src.linux-i686-3.9/scikits/umfpack/_umfpack_wrap.c:2712:
/usr/include/umfpack/umfpack_transpose.h:31:28: note: expected 'const long int *' but argument is of type 'const long long int *'
   31 |     const SuiteSparse_long P [ ],
      |     ~~~~~~~~~~~~~~~~~~~~~~~^~~~~
build-3/src.linux-i686-3.9/scikits/umfpack/_umfpack_wrap.c:4050:162: warning: passing argument 7 of 'umfpack_dl_transpose' from incompatible pointer type [-Wincompatible-pointer-types]
 4050 |   result = (SuiteSparse_long)umfpack_dl_transpose(arg1,arg2,(long long const (*))arg3,(long long const (*))arg4,(double const (*))arg5,(long long const (*))arg6,(long long const (*))arg7,arg8,arg9,arg10);
      |                                                                                                                                                                  ^~~~~~~~~~~~~~~~~~~~~~~~~
      |                                                                                                                                                                  |
      |                                                                                                                                                                  const long long int *
In file included from /usr/include/umfpack/umfpack.h:60,
                 from build-3/src.linux-i686-3.9/scikits/umfpack/_umfpack_wrap.c:2712:
/usr/include/umfpack/umfpack_transpose.h:32:28: note: expected 'const long int *' but argument is of type 'const long long int *'
   32 |     const SuiteSparse_long Q [ ],
      |     ~~~~~~~~~~~~~~~~~~~~~~~^~~~~
build-3/src.linux-i686-3.9/scikits/umfpack/_umfpack_wrap.c: In function '_wrap_umfpack_zl_transpose':
build-3/src.linux-i686-3.9/scikits/umfpack/_umfpack_wrap.c:4244:61: warning: passing argument 3 of 'umfpack_zl_transpose' from incompatible pointer type [-Wincompatible-pointer-types]
 4244 |   result = (SuiteSparse_long)umfpack_zl_transpose(arg1,arg2,(long long const (*))arg3,(long long const (*))arg4,(double const (*))arg5,(double const (*))arg6,(long long const (*))arg7,(long long const (*))arg8,arg9,arg10,arg11,arg12,arg13);
      |                                                             ^~~~~~~~~~~~~~~~~~~~~~~~~
      |                                                             |
      |                                                             const long long int *
In file included from /usr/include/umfpack/umfpack.h:60,
                 from build-3/src.linux-i686-3.9/scikits/umfpack/_umfpack_wrap.c:2712:
/usr/include/umfpack/umfpack_transpose.h:57:28: note: expected 'const long int *' but argument is of type 'const long long int *'
   57 |     const SuiteSparse_long Ap [ ],
      |     ~~~~~~~~~~~~~~~~~~~~~~~^~~~~~
build-3/src.linux-i686-3.9/scikits/umfpack/_umfpack_wrap.c:4244:87: warning: passing argument 4 of 'umfpack_zl_transpose' from incompatible pointer type [-Wincompatible-pointer-types]
 4244 |   result = (SuiteSparse_long)umfpack_zl_transpose(arg1,arg2,(long long const (*))arg3,(long long const (*))arg4,(double const (*))arg5,(double const (*))arg6,(long long const (*))arg7,(long long const (*))arg8,arg9,arg10,arg11,arg12,arg13);
      |                                                                                       ^~~~~~~~~~~~~~~~~~~~~~~~~
      |                                                                                       |
      |                                                                                       const long long int *
In file included from /usr/include/umfpack/umfpack.h:60,
                 from build-3/src.linux-i686-3.9/scikits/umfpack/_umfpack_wrap.c:2712:
/usr/include/umfpack/umfpack_transpose.h:58:28: note: expected 'const long int *' but argument is of type 'const long long int *'
   58 |     const SuiteSparse_long Ai [ ],
      |     ~~~~~~~~~~~~~~~~~~~~~~~^~~~~~
build-3/src.linux-i686-3.9/scikits/umfpack/_umfpack_wrap.c:4244:159: warning: passing argument 7 of 'umfpack_zl_transpose' from incompatible pointer type [-Wincompatible-pointer-types]
 4244 |   result = (SuiteSparse_long)umfpack_zl_transpose(arg1,arg2,(long long const (*))arg3,(long long const (*))arg4,(double const (*))arg5,(double const (*))arg6,(long long const (*))arg7,(long long const (*))arg8,arg9,arg10,arg11,arg12,arg13);
      |                                                                                                                                                               ^~~~~~~~~~~~~~~~~~~~~~~~~
      |                                                                                                                                                               |
      |                                                                                                                                                               const long long int *
In file included from /usr/include/umfpack/umfpack.h:60,
                 from build-3/src.linux-i686-3.9/scikits/umfpack/_umfpack_wrap.c:2712:
/usr/include/umfpack/umfpack_transpose.h:60:28: note: expected 'const long int *' but argument is of type 'const long long int *'
   60 |     const SuiteSparse_long P [ ],
      |     ~~~~~~~~~~~~~~~~~~~~~~~^~~~~
build-3/src.linux-i686-3.9/scikits/umfpack/_umfpack_wrap.c:4244:185: warning: passing argument 8 of 'umfpack_zl_transpose' from incompatible pointer type [-Wincompatible-pointer-types]
 4244 |   result = (SuiteSparse_long)umfpack_zl_transpose(arg1,arg2,(long long const (*))arg3,(long long const (*))arg4,(double const (*))arg5,(double const (*))arg6,(long long const (*))arg7,(long long const (*))arg8,arg9,arg10,arg11,arg12,arg13);
      |                                                                                                                                                                                         ^~~~~~~~~~~~~~~~~~~~~~~~~
      |                                                                                                                                                                                         |
      |                                                                                                                                                                                         const long long int *
In file included from /usr/include/umfpack/umfpack.h:60,
                 from build-3/src.linux-i686-3.9/scikits/umfpack/_umfpack_wrap.c:2712:
/usr/include/umfpack/umfpack_transpose.h:61:28: note: expected 'const long int *' but argument is of type 'const long long int *'
   61 |     const SuiteSparse_long Q [ ],
      |     ~~~~~~~~~~~~~~~~~~~~~~~^~~~~
build-3/src.linux-i686-3.9/scikits/umfpack/_umfpack_wrap.c: In function '_wrap_umfpack_dl_symbolic':
build-3/src.linux-i686-3.9/scikits/umfpack/_umfpack_wrap.c:4887:60: warning: passing argument 3 of 'umfpack_dl_symbolic' from incompatible pointer type [-Wincompatible-pointer-types]
 4887 |   result = (SuiteSparse_long)umfpack_dl_symbolic(arg1,arg2,(long long const (*))arg3,(long long const (*))arg4,(double const (*))arg5,arg6,(double const (*))arg7,arg8);
      |                                                            ^~~~~~~~~~~~~~~~~~~~~~~~~
      |                                                            |
      |                                                            const long long int *
In file included from /usr/include/umfpack/umfpack.h:46,
                 from build-3/src.linux-i686-3.9/scikits/umfpack/_umfpack_wrap.c:2712:
/usr/include/umfpack/umfpack_symbolic.h:26:28: note: expected 'const long int *' but argument is of type 'const long long int *'
   26 |     const SuiteSparse_long Ap [ ],
      |     ~~~~~~~~~~~~~~~~~~~~~~~^~~~~~
build-3/src.linux-i686-3.9/scikits/umfpack/_umfpack_wrap.c:4887:86: warning: passing argument 4 of 'umfpack_dl_symbolic' from incompatible pointer type [-Wincompatible-pointer-types]
 4887 |   result = (SuiteSparse_long)umfpack_dl_symbolic(arg1,arg2,(long long const (*))arg3,(long long const (*))arg4,(double const (*))arg5,arg6,(double const (*))arg7,arg8);
      |                                                                                      ^~~~~~~~~~~~~~~~~~~~~~~~~
      |                                                                                      |
      |                                                                                      const long long int *
In file included from /usr/include/umfpack/umfpack.h:46,
                 from build-3/src.linux-i686-3.9/scikits/umfpack/_umfpack_wrap.c:2712:
/usr/include/umfpack/umfpack_symbolic.h:27:28: note: expected 'const long int *' but argument is of type 'const long long int *'
   27 |     const SuiteSparse_long Ai [ ],
      |     ~~~~~~~~~~~~~~~~~~~~~~~^~~~~~
build-3/src.linux-i686-3.9/scikits/umfpack/_umfpack_wrap.c: In function '_wrap_umfpack_zl_symbolic':
build-3/src.linux-i686-3.9/scikits/umfpack/_umfpack_wrap.c:5013:60: warning: passing argument 3 of 'umfpack_zl_symbolic' from incompatible pointer type [-Wincompatible-pointer-types]
 5013 |   result = (SuiteSparse_long)umfpack_zl_symbolic(arg1,arg2,(long long const (*))arg3,(long long const (*))arg4,(double const (*))arg5,(double const (*))arg6,arg7,(double const (*))arg8,arg9);
      |                                                            ^~~~~~~~~~~~~~~~~~~~~~~~~
      |                                                            |
      |                                                            const long long int *
In file included from /usr/include/umfpack/umfpack.h:46,
                 from build-3/src.linux-i686-3.9/scikits/umfpack/_umfpack_wrap.c:2712:
/usr/include/umfpack/umfpack_symbolic.h:50:28: note: expected 'const long int *' but argument is of type 'const long long int *'
   50 |     const SuiteSparse_long Ap [ ],
      |     ~~~~~~~~~~~~~~~~~~~~~~~^~~~~~
build-3/src.linux-i686-3.9/scikits/umfpack/_umfpack_wrap.c:5013:86: warning: passing argument 4 of 'umfpack_zl_symbolic' from incompatible pointer type [-Wincompatible-pointer-types]
 5013 |   result = (SuiteSparse_long)umfpack_zl_symbolic(arg1,arg2,(long long const (*))arg3,(long long const (*))arg4,(double const (*))arg5,(double const (*))arg6,arg7,(double const (*))arg8,arg9);
      |                                                                                      ^~~~~~~~~~~~~~~~~~~~~~~~~
      |                                                                                      |
      |                                                                                      const long long int *
In file included from /usr/include/umfpack/umfpack.h:46,
                 from build-3/src.linux-i686-3.9/scikits/umfpack/_umfpack_wrap.c:2712:
/usr/include/umfpack/umfpack_symbolic.h:51:28: note: expected 'const long int *' but argument is of type 'const long long int *'
   51 |     const SuiteSparse_long Ai [ ],
      |     ~~~~~~~~~~~~~~~~~~~~~~~^~~~~~
build-3/src.linux-i686-3.9/scikits/umfpack/_umfpack_wrap.c: In function '_wrap_umfpack_dl_numeric':
build-3/src.linux-i686-3.9/scikits/umfpack/_umfpack_wrap.c:5119:49: warning: passing argument 1 of 'umfpack_dl_numeric' from incompatible pointer type [-Wincompatible-pointer-types]
 5119 |   result = (SuiteSparse_long)umfpack_dl_numeric((long long const (*))arg1,(long long const (*))arg2,(double const (*))arg3,arg4,arg5,(double const (*))arg6,arg7);
      |                                                 ^~~~~~~~~~~~~~~~~~~~~~~~~
      |                                                 |
      |                                                 const long long int *
In file included from /usr/include/umfpack/umfpack.h:47,
                 from build-3/src.linux-i686-3.9/scikits/umfpack/_umfpack_wrap.c:2712:
/usr/include/umfpack/umfpack_numeric.h:23:28: note: expected 'const long int *' but argument is of type 'const long long int *'
   23 |     const SuiteSparse_long Ap [ ],
      |     ~~~~~~~~~~~~~~~~~~~~~~~^~~~~~
build-3/src.linux-i686-3.9/scikits/umfpack/_umfpack_wrap.c:5119:75: warning: passing argument 2 of 'umfpack_dl_numeric' from incompatible pointer type [-Wincompatible-pointer-types]
 5119 |   result = (SuiteSparse_long)umfpack_dl_numeric((long long const (*))arg1,(long long const (*))arg2,(double const (*))arg3,arg4,arg5,(double const (*))arg6,arg7);
      |                                                                           ^~~~~~~~~~~~~~~~~~~~~~~~~
      |                                                                           |
      |                                                                           const long long int *
In file included from /usr/include/umfpack/umfpack.h:47,
                 from build-3/src.linux-i686-3.9/scikits/umfpack/_umfpack_wrap.c:2712:
/usr/include/umfpack/umfpack_numeric.h:24:28: note: expected 'const long int *' but argument is of type 'const long long int *'
   24 |     const SuiteSparse_long Ai [ ],
      |     ~~~~~~~~~~~~~~~~~~~~~~~^~~~~~
build-3/src.linux-i686-3.9/scikits/umfpack/_umfpack_wrap.c: In function '_wrap_umfpack_zl_numeric':
build-3/src.linux-i686-3.9/scikits/umfpack/_umfpack_wrap.c:5233:49: warning: passing argument 1 of 'umfpack_zl_numeric' from incompatible pointer type [-Wincompatible-pointer-types]
 5233 |   result = (SuiteSparse_long)umfpack_zl_numeric((long long const (*))arg1,(long long const (*))arg2,(double const (*))arg3,(double const (*))arg4,arg5,arg6,(double const (*))arg7,arg8);
      |                                                 ^~~~~~~~~~~~~~~~~~~~~~~~~
      |                                                 |
      |                                                 const long long int *
In file included from /usr/include/umfpack/umfpack.h:47,
                 from build-3/src.linux-i686-3.9/scikits/umfpack/_umfpack_wrap.c:2712:
/usr/include/umfpack/umfpack_numeric.h:45:28: note: expected 'const long int *' but argument is of type 'const long long int *'
   45 |     const SuiteSparse_long Ap [ ],
      |     ~~~~~~~~~~~~~~~~~~~~~~~^~~~~~
build-3/src.linux-i686-3.9/scikits/umfpack/_umfpack_wrap.c:5233:75: warning: passing argument 2 of 'umfpack_zl_numeric' from incompatible pointer type [-Wincompatible-pointer-types]
 5233 |   result = (SuiteSparse_long)umfpack_zl_numeric((long long const (*))arg1,(long long const (*))arg2,(double const (*))arg3,(double const (*))arg4,arg5,arg6,(double const (*))arg7,arg8);
      |                                                                           ^~~~~~~~~~~~~~~~~~~~~~~~~
      |                                                                           |
      |                                                                           const long long int *
In file included from /usr/include/umfpack/umfpack.h:47,
                 from build-3/src.linux-i686-3.9/scikits/umfpack/_umfpack_wrap.c:2712:
/usr/include/umfpack/umfpack_numeric.h:46:28: note: expected 'const long int *' but argument is of type 'const long long int *'
   46 |     const SuiteSparse_long Ai [ ],
      |     ~~~~~~~~~~~~~~~~~~~~~~~^~~~~~
i686-pld-linux-gcc -shared -Wl,--as-needed -Wl,--no-copy-dt-needed-entries -Wl,-z,relro -Wl,-z,combreloc -Wl,--as-needed -Wl,--no-copy-dt-needed-entries -Wl,-z,relro -Wl,-z,combreloc -O2 -fwrapv -pipe -Wformat -Werror=format-security -gdwarf-4 -fno-debug-types-section -fvar-tracking-assignments -g2 -Wp,-D_FORTIFY_SOURCE=2 -fstack-protector-strong --param=ssp-buffer-size=4 -Werror=trampolines -fomit-frame-pointer -march=i686 -fasynchronous-unwind-tables -mtune=pentium4 -gdwarf-4 -fno-debug-types-section -fvar-tracking-assignments -g2 build-3/temp.linux-i686-3.9/build-3/src.linux-i686-3.9/scikits/umfpack/_umfpack_wrap.o -L/usr/lib -L/usr/lib -Wl,--enable-new-dtags,-R/usr/lib -lrt -lumfpack -lamd -lamd -lumfpack -lcblas -lblas -lblas -o scikits/umfpack/__umfpack.cpython-39-i386-linux-gnu.so
/tmp/B.vljj4fuj/BUILD/scikit-umfpack-0.3.2/setup.py:56: DeprecationWarning: the imp module is deprecated in favour of importlib; see the module's documentation for alternative uses
  import imp
umfpack_info:
customize UnixCCompiler
amd_info:
  FOUND:
    libraries = ['amd', 'amd']
    library_dirs = ['/usr/lib']

  FOUND:
    libraries = ['umfpack', 'amd', 'amd', 'umfpack']
    library_dirs = ['/usr/lib']
    include_dirs = ['/usr/include/umfpack']
    define_macros = [('SCIPY_UMFPACK_H', None)]
    swig_opts = ['-I/usr/include/umfpack']
    runtime_library_dirs = ['/usr/lib']

blas_opt_info:
blas_mkl_info:
  libraries mkl_rt not found in ['/usr/local/lib', '/usr/lib', '/usr/lib/']
  NOT AVAILABLE

blis_info:
  libraries blis not found in ['/usr/local/lib', '/usr/lib', '/usr/lib/']
  NOT AVAILABLE

openblas_info:
  libraries openblas not found in ['/usr/local/lib', '/usr/lib', '/usr/lib/']
  NOT AVAILABLE

atlas_3_10_blas_threads_info:
Setting PTATLAS=ATLAS
  libraries tatlas not found in ['/usr/local/lib', '/usr/lib', '/usr/lib/']
  NOT AVAILABLE

atlas_3_10_blas_info:
  libraries satlas not found in ['/usr/local/lib', '/usr/lib', '/usr/lib/']
  NOT AVAILABLE

atlas_blas_threads_info:
Setting PTATLAS=ATLAS
  libraries ptf77blas,ptcblas,atlas not found in ['/usr/local/lib', '/usr/lib', '/usr/lib/']
  NOT AVAILABLE

atlas_blas_info:
  libraries f77blas,cblas,atlas not found in ['/usr/local/lib', '/usr/lib', '/usr/lib/']
  NOT AVAILABLE

accelerate_info:
  NOT AVAILABLE

/usr/lib/python3.9/site-packages/numpy/distutils/system_info.py:1914: UserWarning: 
    Optimized (vendor) Blas libraries are not found.
    Falls back to netlib Blas library which has worse performance.
    A better performance should be easily gained by switching
    Blas library.
  if self._calc_info(blas):
blas_info:
C compiler: i686-pld-linux-gcc -Wno-unused-result -Wsign-compare -DNDEBUG -O2 -fwrapv -pipe -Wformat -Werror=format-security -gdwarf-4 -fno-debug-types-section -fvar-tracking-assignments -g2 -Wp,-D_FORTIFY_SOURCE=2 -fstack-protector-strong --param=ssp-buffer-size=4 -Werror=trampolines -fomit-frame-pointer -march=i686 -fasynchronous-unwind-tables -mtune=pentium4 -gdwarf-4 -fno-debug-types-section -fvar-tracking-assignments -g2 -O2 -fwrapv -pipe -Wformat -Werror=format-security -gdwarf-4 -fno-debug-types-section -fvar-tracking-assignments -g2 -Wp,-D_FORTIFY_SOURCE=2 -fstack-protector-strong --param=ssp-buffer-size=4 -Werror=trampolines -fomit-frame-pointer -march=i686 -fasynchronous-unwind-tables -mtune=pentium4 -gdwarf-4 -fno-debug-types-section -fvar-tracking-assignments -g2 -O2 -fwrapv -pipe -Wformat -Werror=format-security -gdwarf-4 -fno-debug-types-section -fvar-tracking-assignments -g2 -Wp,-D_FORTIFY_SOURCE=2 -fstack-protector-strong --param=ssp-buffer-size=4 -Werror=trampolines -fomit-frame-pointer -march=i686 -fasynchronous-unwind-tables -mtune=pentium4 -gdwarf-4 -fno-debug-types-section -fvar-tracking-assignments -g2 -fPIC

creating /tmp/B.vljj4fuj/BUILD/tmp/tmpj8zfx2xc/tmp
creating /tmp/B.vljj4fuj/BUILD/tmp/tmpj8zfx2xc/tmp/B.vljj4fuj
creating /tmp/B.vljj4fuj/BUILD/tmp/tmpj8zfx2xc/tmp/B.vljj4fuj/BUILD
creating /tmp/B.vljj4fuj/BUILD/tmp/tmpj8zfx2xc/tmp/B.vljj4fuj/BUILD/tmp
creating /tmp/B.vljj4fuj/BUILD/tmp/tmpj8zfx2xc/tmp/B.vljj4fuj/BUILD/tmp/tmpj8zfx2xc
compile options: '-I/usr/lib -I/usr/local/include -I/usr/include -c'
i686-pld-linux-gcc: /tmp/B.vljj4fuj/BUILD/tmp/tmpj8zfx2xc/source.c
i686-pld-linux-gcc /tmp/B.vljj4fuj/BUILD/tmp/tmpj8zfx2xc/tmp/B.vljj4fuj/BUILD/tmp/tmpj8zfx2xc/source.o -L/usr/lib -lblas -o /tmp/B.vljj4fuj/BUILD/tmp/tmpj8zfx2xc/a.out
/usr/bin/ld: /tmp/B.vljj4fuj/BUILD/tmp/tmpj8zfx2xc/tmp/B.vljj4fuj/BUILD/tmp/tmpj8zfx2xc/source.o: in function `main':
/tmp/B.vljj4fuj/BUILD/tmp/tmpj8zfx2xc/source.c:6: undefined reference to `cblas_ddot'
collect2: error: ld returned 1 exit status
i686-pld-linux-gcc /tmp/B.vljj4fuj/BUILD/tmp/tmpj8zfx2xc/tmp/B.vljj4fuj/BUILD/tmp/tmpj8zfx2xc/source.o -L/usr/lib -lcblas -lblas -o /tmp/B.vljj4fuj/BUILD/tmp/tmpj8zfx2xc/a.out
  FOUND:
    libraries = ['cblas', 'blas', 'blas']
    library_dirs = ['/usr/lib']
    include_dirs = ['/usr/lib', '/usr/local/include', '/usr/include']
    language = c
    define_macros = [('HAVE_CBLAS', None)]
    runtime_library_dirs = ['/usr/lib']

  FOUND:
    define_macros = [('NO_ATLAS_INFO', 1), ('HAVE_CBLAS', None)]
    libraries = ['cblas', 'blas', 'blas']
    library_dirs = ['/usr/lib']
    include_dirs = ['/usr/lib', '/usr/local/include', '/usr/include']
    runtime_library_dirs = ['/usr/lib']
    language = c

running build_ext
running build_src
build_src
building extension "scikits.umfpack.__umfpack" sources
building data_files sources
build_src: building npy-pkg config files
customize UnixCCompiler
customize UnixCCompiler using build_ext
S.S....S.S.S.SE.SESEE
======================================================================
ERROR: test_factorized_umfpack (test_umfpack.TestScipySolvers)
----------------------------------------------------------------------
Traceback (most recent call last):
  File "/tmp/B.vljj4fuj/BUILD/scikit-umfpack-0.3.2/scikits/umfpack/tests/test_umfpack.py", line 92, in test_factorized_umfpack
    solve = linsolve.factorized(a)
  File "/usr/lib/python3.9/site-packages/scipy/sparse/linalg/dsolve/linsolve.py", line 481, in factorized
    umf.numeric(A)
  File "/tmp/B.vljj4fuj/BUILD/scikit-umfpack-0.3.2/scikits/umfpack/umfpack.py", line 542, in numeric
    self.symbolic(mtx)
  File "/tmp/B.vljj4fuj/BUILD/scikit-umfpack-0.3.2/scikits/umfpack/umfpack.py", line 522, in symbolic
    raise RuntimeError('%s failed with %s' % (self.funs.symbolic,
RuntimeError: <function umfpack_dl_symbolic at 0xf3efecd0> failed with UMFPACK_ERROR_invalid_matrix

======================================================================
ERROR: test_solve_complex_umfpack (test_umfpack.TestScipySolvers)
----------------------------------------------------------------------
Traceback (most recent call last):
  File "/tmp/B.vljj4fuj/BUILD/scikit-umfpack-0.3.2/scikits/umfpack/tests/test_umfpack.py", line 51, in test_solve_complex_umfpack
    x = linsolve.spsolve(a, b)
  File "/usr/lib/python3.9/site-packages/scipy/sparse/linalg/dsolve/linsolve.py", line 189, in spsolve
    x = umf.linsolve(umfpack.UMFPACK_A, A, b_vec,
  File "/tmp/B.vljj4fuj/BUILD/scikit-umfpack-0.3.2/scikits/umfpack/umfpack.py", line 756, in linsolve
    self.numeric(mtx)
  File "/tmp/B.vljj4fuj/BUILD/scikit-umfpack-0.3.2/scikits/umfpack/umfpack.py", line 542, in numeric
    self.symbolic(mtx)
  File "/tmp/B.vljj4fuj/BUILD/scikit-umfpack-0.3.2/scikits/umfpack/umfpack.py", line 522, in symbolic
    raise RuntimeError('%s failed with %s' % (self.funs.symbolic,
RuntimeError: <function umfpack_zl_symbolic at 0xf3efed60> failed with UMFPACK_ERROR_invalid_matrix

======================================================================
ERROR: test_solve_sparse_rhs (test_umfpack.TestScipySolvers)
----------------------------------------------------------------------
Traceback (most recent call last):
  File "/tmp/B.vljj4fuj/BUILD/scikit-umfpack-0.3.2/scikits/umfpack/tests/test_umfpack.py", line 85, in test_solve_sparse_rhs
    x = linsolve.spsolve(a, b)
  File "/usr/lib/python3.9/site-packages/scipy/sparse/linalg/dsolve/linsolve.py", line 189, in spsolve
    x = umf.linsolve(umfpack.UMFPACK_A, A, b_vec,
  File "/tmp/B.vljj4fuj/BUILD/scikit-umfpack-0.3.2/scikits/umfpack/umfpack.py", line 756, in linsolve
    self.numeric(mtx)
  File "/tmp/B.vljj4fuj/BUILD/scikit-umfpack-0.3.2/scikits/umfpack/umfpack.py", line 542, in numeric
    self.symbolic(mtx)
  File "/tmp/B.vljj4fuj/BUILD/scikit-umfpack-0.3.2/scikits/umfpack/umfpack.py", line 522, in symbolic
    raise RuntimeError('%s failed with %s' % (self.funs.symbolic,
RuntimeError: <function umfpack_dl_symbolic at 0xf3efecd0> failed with UMFPACK_ERROR_invalid_matrix

======================================================================
ERROR: test_solve_umfpack (test_umfpack.TestScipySolvers)
----------------------------------------------------------------------
Traceback (most recent call last):
  File "/tmp/B.vljj4fuj/BUILD/scikit-umfpack-0.3.2/scikits/umfpack/tests/test_umfpack.py", line 68, in test_solve_umfpack
    x = linsolve.spsolve(a, b)
  File "/usr/lib/python3.9/site-packages/scipy/sparse/linalg/dsolve/linsolve.py", line 189, in spsolve
    x = umf.linsolve(umfpack.UMFPACK_A, A, b_vec,
  File "/tmp/B.vljj4fuj/BUILD/scikit-umfpack-0.3.2/scikits/umfpack/umfpack.py", line 756, in linsolve
    self.numeric(mtx)
  File "/tmp/B.vljj4fuj/BUILD/scikit-umfpack-0.3.2/scikits/umfpack/umfpack.py", line 542, in numeric
    self.symbolic(mtx)
  File "/tmp/B.vljj4fuj/BUILD/scikit-umfpack-0.3.2/scikits/umfpack/umfpack.py", line 522, in symbolic
    raise RuntimeError('%s failed with %s' % (self.funs.symbolic,
RuntimeError: <function umfpack_dl_symbolic at 0xf3efecd0> failed with UMFPACK_ERROR_invalid_matrix

----------------------------------------------------------------------
Ran 21 tests in 0.282s

FAILED (SKIP=8, errors=4)
error: Bad exit status from /tmp/B.vljj4fuj/BUILD/tmp/rpm-tmp.0xYDPx (%build)


RPM build errors:
    Could not canonicalize hostname: nereid
    Bad exit status from /tmp/B.vljj4fuj/BUILD/tmp/rpm-tmp.0xYDPx (%build)
ended at: Sun Nov 21 05:05:37 2021, done in 0:00:21.260427
error: No files produced.
+ chmod -R u+rwX /tmp/B.vljj4fuj/BUILD
+ rm -rf /tmp/B.vljj4fuj/tmp /tmp/B.vljj4fuj/BUILD
+ rm -rf /tmp/B.vljj4fuj
Begin-PLD-Builder-Info
Build-Time: user:21.05s sys:2.31s real:23.33s (faults io:224 non-io:361490)

End-PLD-Builder-Info
[Back to list of logs] [View rpm -qa of builder]