FailedOk

th/SRPMS[OK]
th/x32[OK]
th/i686[OK]
th/x86_64[OK]

ac/SRPMS[OK]
ac/i386[OK]
ac/i586[OK]
ac/i686[OK]
ac/alpha[OK]
ac/amd64[OK]
ac/athlon[OK]
ac/ppc[OK]
ac/sparc[OK]
ac/sparc64[OK]

Advanced Search
main()
Powered by PLD Linux
(c) 2002-2022 PLD Team
$Revision: 1.37 $
Powered by The Right Thing.
Your IP: 3.236.50.79

python-sympy a1e41f31-9251-421b-a6d1-e9445809bf89

Status:Failed
Source URL:https://buildlogs.pld-linux.org/pld/th/i686/FAIL/python-sympy,a1e41f31-9251-421b-a6d1-e9445809bf89.bz2
text/plain URL:View!
rpm -qa of builder:View!
Date:2022/05/01 12:32:48
Runtime:1:17:54.174333

Toc:

  • error 1
  • rpm: error: Failed build dependencies:
  • error 2
  • rpm: error: Failed build dependencies:
  • error 3
  • rpm: error: Failed build dependencies:
  • prep
  • Executing(%prep): /bin/sh -e /tmp/B.267c4rwc/BUILD/tmp/rpm-tmp.f3AWxQ
  • build
  • Executing(%build): /bin/sh -e /tmp/B.267c4rwc/BUILD/tmp/rpm-tmp.q5H4kV
  • error 4
  • AttributeError: 'NoneType' object has no attribute 'Window'
  • error 5
  • error: Bad exit status from /tmp/B.267c4rwc/BUILD/tmp/rpm-tmp.q5H4kV (%build)
  • error 6
  • RPM build errors:
  • error 7
  • error: No files produced.

Content:

request from: baggins
checking if we should skip the build
started at: Sun May  1 11:14:28 2022
killing old processes on a builder
sending signal 9 to pid -1
cleaning up /tmp
fetching https://srcbuilder.pld-linux.org/th//srpms/a1e41f31-9251-421b-a6d1-e9445809bf89/python-sympy-1.7.1-3.src.rpm
fetched 6472305 bytes, 8330.1 K/s
installing srpm: python-sympy-1.7.1-3.src.rpm
+ install -d /tmp/B.267c4rwc/BUILD /tmp/B.267c4rwc/RPMS
+ LC_ALL=en_US.UTF-8
+ rpm -qp --changelog python-sympy-1.7.1-3.src.rpm
* Sun May 01 2022 PLD Linux Team <feedback@pld-linux.org>
- For complete changelog see: http://git.pld-linux.org/?p=packages/python-sympy.git;a=log;h=master
* Wed Mar 30 2022 Jan Rękorajski <baggins@pld-linux.org> 14ff1df
- rebuild with tests and docs * Sat Mar 26 2022 Jan Rękorajski <baggins@pld-linux.org> 01a4da5
- rebuild with python 3.10 * Fri Mar 12 2021 Jan Rękorajski <baggins@pld-linux.org> 8ccea62
- disable werror for docs build * Thu Mar 11 2021 Jan Rękorajski <baggins@pld-linux.org> a7afb26
- up to 1.7.1, python 2 no longer supported * Sat Apr 11 2020 Jakub Bogusz <qboosh@pld-linux.org> a7715bb
- BR: texlive-fonts-other * Fri Apr 10 2020 Jakub Bogusz <qboosh@pld-linux.org> 2e3072f
- updated to 1.5.1 - updated nodisplay patch - removed Exception-changed-after-numpy-1.17,Fix-more-compatibility-issues-with-Python3.8,Modify-literal-comparisons-as-per-python3.8-guidelines,sympy-is patches * Tue Nov 05 2019 Jan Rękorajski <baggins@pld-linux.org> e8e4817
- release 3 (by relup.sh) * Mon Nov 04 2019 Jan Rękorajski <baggins@pld-linux.org> 1457cdc
- test suite fixes * Mon Oct 28 2019 Jan Rękorajski <baggins@pld-linux.org> ee8522b
- rebuild with python 3.8 - release 2 (by relup.sh) * Mon Sep 16 2019 Jakub Bogusz <qboosh@pld-linux.org> 225dae1
- doc BR: texlive-latex-ams * Sun Sep 15 2019 Jakub Bogusz <qboosh@pld-linux.org> 558a01d
- fixed doc build without sympy installed * Sat Sep 14 2019 Jakub Bogusz <qboosh@pld-linux.org> 13fba09
- doc requires matplotlib * Sat Sep 14 2019 Jakub Bogusz <qboosh@pld-linux.org> cd938da
- updated to 1.4 - removed obsolete docs-build patch - added nodisplay patch (blacklist tests requiring DISPLAY when it's missing) * Wed Jul 04 2018 Arkadiusz Miśkiewicz <arekm@maven.pl> afb29cf
- up to 1.1.1 * Tue Jul 03 2018 Arkadiusz Miśkiewicz <arekm@maven.pl> f270f8c
- release 4 (by relup.sh) * Thu Dec 29 2016 Arkadiusz Miśkiewicz <arekm@maven.pl> 89b5509
- python 3.6 - release 3 (by relup.sh) * Tue May 10 2016 Jan Rękorajski <baggins@pld-linux.org> 9f977fe
- pydoc3 is needed due to sphing using python 3 * Tue May 10 2016 Jan Rękorajski <baggins@pld-linux.org> a415e5d
- BR pydoc * Tue May 10 2016 Jan Rękorajski <baggins@pld-linux.org> 8a467d5
- updated BRs - rel 2 * Tue May 10 2016 Jan Rękorajski <baggins@pld-linux.org> e7d4bee
- updated to 1.0 + rpm -Uhv --nodeps --define '_topdir /tmp/B.267c4rwc' --define '_specdir %{_topdir}' --define '_sourcedir %{_specdir}' --define '_rpmdir %{_topdir}/RPMS' --define '_builddir %{_topdir}/BUILD' python-sympy-1.7.1-3.src.rpm Updating / installing... python-sympy-1.7.1-3 ######################################## + rm -f python-sympy-1.7.1-3.src.rpm + install -m 700 -d /tmp/B.267c4rwc/BUILD/tmp + TMPDIR=/tmp/B.267c4rwc/BUILD/tmp + exec nice -n 0 rpmbuild -bp --short-circuit --nodeps --define '_topdir /tmp/B.267c4rwc' --define '_specdir %{_topdir}' --define '_sourcedir %{_specdir}' --define '_rpmdir %{_topdir}/RPMS' --define '_builddir %{_topdir}/BUILD' --target i686-pld-linux --define 'prep exit 0' /tmp/B.267c4rwc/python-sympy.spec warning: Could not canonicalize hostname: nereid Building target platforms: i686-pld-linux Building for target i686-pld-linux checking BuildConflict-ing packages rpm: warning: Could not canonicalize hostname: nereid rpm: error: Failed build dependencies: rpm: texlive-latex-ams is needed by python-sympy-1.7.1-3.noarch rpm: texlive-latex-pgf is needed by python-sympy-1.7.1-3.noarch rpm: Building target platforms: i686-pld-linux rpm: Building for target i686-pld-linux no BuildConflicts found checking BR rpm: warning: Could not canonicalize hostname: nereid rpm: error: Failed build dependencies: rpm: texlive-latex-ams is needed by python-sympy-1.7.1-3.noarch rpm: texlive-latex-pgf is needed by python-sympy-1.7.1-3.noarch rpm: Building target platforms: i686-pld-linux rpm: Building for target i686-pld-linux updating poldek cache... ready is up to date th is up to date th is up to date th-ready is up to date th-ready is up to date th-test is up to date th-test is up to date checking conflicting packages in BRed packages poldek: Loading [pndir]ready... poldek: Loading [pndir]th-test... poldek: Loading [pndir]th-test... poldek: Loading [pndir]th-ready... poldek: Loading [pndir]th-ready... poldek: Loading [pndir]th... poldek: Loading [pndir]th... poldek: 31891 packages read poldek: Removed 2373 duplicate packages from available set poldek: Processing dependencies... poldek: texlive-latex-ams-20080816-39 marks texlive-fonts-ams-20080816-39 (cap texlive-fonts-ams = 1:20080816-39) poldek: texlive-fonts-ams-20080816-39 marks texlive-latex-bibtex-20080816-39 (cap texlive-latex-bibtex = 1:20080816-39) poldek: There are 4 packages to install (2 marked by dependencies): poldek: A texlive-fonts-ams-20080816-39 texlive-latex-ams-20080816-39 poldek: A texlive-latex-bibtex-20080816-39 texlive-latex-pgf-20080816-39 poldek: This operation will use 22.0MB of disk space. poldek: Need to get 9.5MB of archives (9.5MB to download). poldek: poldek: Retrieving [1/4] th::texlive-latex-bibtex-20080816-39.i686.rpm..............................done poldek: texlive-latex-bibtex-20080816-39.i686.rpm: digests OK poldek: Retrieving [2/4] th::texlive-fonts-ams-20080816-39.noarch.rpm..............................done poldek: Retrieving [3/4] th::texlive-latex-ams-20080816-39.noarch.rpm..............................done poldek: Retrieving [4/4] th::texlive-latex-pgf-20080816-39.noarch.rpm..............................done poldek: texlive-fonts-ams-20080816-39.noarch.rpm: digests OK poldek: texlive-latex-ams-20080816-39.noarch.rpm: digests OK poldek: texlive-latex-pgf-20080816-39.noarch.rpm: digests OK poldek: Executing pm-command.sh --upgrade -vh --test --root / --define _check_dirname_deps 0... poldek: warning: /root/.cache/poldek/ftp_ftp1.pld-linux.org.dists.th.PLD.i686.RPMS/texlive-latex-bibtex-20080816-39.i686.rpm: Header V4 DSA/SHA1 Signature, key ID e4f1bc2d: NOKEY poldek: Verifying... ######################################## poldek: Preparing... ######################################## no conflicts found checking BR rpm: warning: Could not canonicalize hostname: nereid rpm: error: Failed build dependencies: rpm: texlive-latex-ams is needed by python-sympy-1.7.1-3.noarch rpm: texlive-latex-pgf is needed by python-sympy-1.7.1-3.noarch rpm: Building target platforms: i686-pld-linux rpm: Building for target i686-pld-linux installing BR: texlive\-latex\-ams texlive\-latex\-pgf + poldek --noask --caplookup -Q -v '--ignore=hhvm-*' '--ignore=php4-*' '--ignore=php52-*' '--ignore=php54-*' '--ignore=php55-*' '--ignore=php56-*' '--ignore=php70-*' '--ignore=php71-*' '--ignore=php72-*' '--ignore=php73-*' '--ignore=php74-*' '--ignore=php80-*' '--ignore=php81-*' --upgrade texlive-latex-ams texlive-latex-pgf Loading [pndir]ready... Loading [pndir]th-test... Loading [pndir]th-test... Loading [pndir]th-ready... Loading [pndir]th-ready... Loading [pndir]th... Loading [pndir]th... 31891 packages read Removed 2373 duplicate packages from available set Processing dependencies... texlive-latex-ams-20080816-39 marks texlive-fonts-ams-20080816-39 (cap texlive-fonts-ams = 1:20080816-39) texlive-fonts-ams-20080816-39 marks texlive-latex-bibtex-20080816-39 (cap texlive-latex-bibtex = 1:20080816-39) There are 4 packages to install (2 marked by dependencies): A texlive-fonts-ams-20080816-39 texlive-latex-ams-20080816-39 A texlive-latex-bibtex-20080816-39 texlive-latex-pgf-20080816-39 This operation will use 22.0MB of disk space. texlive-latex-ams-20080816-39.noarch.rpm: digests OK texlive-latex-pgf-20080816-39.noarch.rpm: digests OK texlive-fonts-ams-20080816-39.noarch.rpm: digests OK texlive-latex-bibtex-20080816-39.i686.rpm: digests OK Need to get 9.5MB of archives. texlive-latex-bibtex-20080816-39.i686.rpm: digests OK texlive-fonts-ams-20080816-39.noarch.rpm: digests OK texlive-latex-ams-20080816-39.noarch.rpm: digests OK texlive-latex-pgf-20080816-39.noarch.rpm: digests OK Executing pm-command.sh --upgrade -vh --root / --define _check_dirname_deps 0... warning: /root/.cache/poldek/ftp_ftp1.pld-linux.org.dists.th.PLD.i686.RPMS/texlive-latex-bibtex-20080816-39.i686.rpm: Header V4 DSA/SHA1 Signature, key ID e4f1bc2d: NOKEY Verifying... ######################################## Preparing... ######################################## Updating / installing... texlive-latex-bibtex-1:20080816-39 ######################################## texlive-fonts-ams-1:20080816-39 ######################################## texlive-latex-ams-1:20080816-39 ######################################## texlive-latex-pgf-1:20080816-39 ######################################## building RPM using: set -ex; : build-id: a1e41f31-9251-421b-a6d1-e9445809bf89; TMPDIR=/tmp/B.267c4rwc/BUILD/tmp exec nice -n 0 rpmbuild -bb --define '__jobs 9' --define '_smp_mflags -j9' --define '_make_opts -Otarget' --define '_pld_builder 1' --define '_topdir /tmp/B.267c4rwc' --define '_specdir %{_topdir}' --define '_sourcedir %{_specdir}' --define '_rpmdir %{_topdir}/RPMS' --define '_builddir %{_topdir}/BUILD' --target i686-pld-linux /tmp/B.267c4rwc/python-sympy.spec + : build-id: a1e41f31-9251-421b-a6d1-e9445809bf89 + TMPDIR=/tmp/B.267c4rwc/BUILD/tmp + exec nice -n 0 rpmbuild -bb --define '__jobs 9' --define '_smp_mflags -j9' --define '_make_opts -Otarget' --define '_pld_builder 1' --define '_topdir /tmp/B.267c4rwc' --define '_specdir %{_topdir}' --define '_sourcedir %{_specdir}' --define '_rpmdir %{_topdir}/RPMS' --define '_builddir %{_topdir}/BUILD' --target i686-pld-linux /tmp/B.267c4rwc/python-sympy.spec warning: Could not canonicalize hostname: nereid Building target platforms: i686-pld-linux Building for target i686-pld-linux Executing(%prep): /bin/sh -e /tmp/B.267c4rwc/BUILD/tmp/rpm-tmp.f3AWxQ + umask 022 + cd /tmp/B.267c4rwc/BUILD + cd /tmp/B.267c4rwc/BUILD + rm -rf sympy-1.7.1 + /bin/gzip -dc /tmp/B.267c4rwc/sympy-1.7.1.tar.gz + /bin/tar -xof - + STATUS=0 + '[' 0 -ne 0 ']' + cd sympy-1.7.1 + /bin/chmod -Rf a+rX,u+w,g-w,o-w . + echo 'Patch #0 (docs-build.patch):' Patch #0 (docs-build.patch): + </tmp/B.267c4rwc/docs-build.patch + /usr/bin/patch -s -p1 '--fuzz=0' + RPM_EC=0 + jobs -p + exit 0 Executing(%build): /bin/sh -e /tmp/B.267c4rwc/BUILD/tmp/rpm-tmp.q5H4kV TMP=/home/users/builder/tmp HOME=/home/users/builder PATH=/home/users/builder/GNUstep/Tools:/bin:/usr/bin:/usr/local/bin:/home/users/builder/bin TMPDIR=/tmp/B.267c4rwc/BUILD/tmp + umask 022 + cd /tmp/B.267c4rwc/BUILD + cd sympy-1.7.1 + LDFLAGS='-Wl,--as-needed -Wl,--no-copy-dt-needed-entries -Wl,-z,relro -Wl,-z,combreloc ' + export LDFLAGS + CFLAGS=' -O2 -fwrapv -pipe -Wformat -Werror=format-security -gdwarf-4 -fno-debug-types-section -fvar-tracking-assignments -g2 -Wp,-D_FORTIFY_SOURCE=2 -fstack-protector-strong --param=ssp-buffer-size=4 -Werror=trampolines -fomit-frame-pointer -march=i686 -fasynchronous-unwind-tables -mtune=pentium4 -gdwarf-4 -fno-debug-types-section -fvar-tracking-assignments -g2 ' + export CFLAGS + CXXFLAGS=' -O2 -fwrapv -pipe -Wformat -Werror=format-security -gdwarf-4 -fno-debug-types-section -fvar-tracking-assignments -g2 -Wp,-D_FORTIFY_SOURCE=2 -fstack-protector-strong --param=ssp-buffer-size=4 -Werror=trampolines -fomit-frame-pointer -march=i686 -fasynchronous-unwind-tables -mtune=pentium4 -gdwarf-4 -fno-debug-types-section -fvar-tracking-assignments -g2 ' + export CXXFLAGS + CC=i686-pld-linux-gcc + export CC + CXX=i686-pld-linux-g++ + export CXX + /usr/bin/python3 setup.py build '--build-base=build-3' test running build running build_py creating build-3 creating build-3/lib copying isympy.py -> build-3/lib creating build-3/lib/sympy copying sympy/__init__.py -> build-3/lib/sympy copying sympy/abc.py -> build-3/lib/sympy copying sympy/conftest.py -> build-3/lib/sympy copying sympy/galgebra.py -> build-3/lib/sympy copying sympy/release.py -> build-3/lib/sympy copying sympy/this.py -> build-3/lib/sympy creating build-3/lib/sympy/algebras copying sympy/algebras/__init__.py -> build-3/lib/sympy/algebras copying sympy/algebras/quaternion.py -> build-3/lib/sympy/algebras creating build-3/lib/sympy/assumptions copying sympy/assumptions/__init__.py -> build-3/lib/sympy/assumptions copying sympy/assumptions/ask.py -> build-3/lib/sympy/assumptions copying sympy/assumptions/ask_generated.py -> build-3/lib/sympy/assumptions copying sympy/assumptions/assume.py -> build-3/lib/sympy/assumptions copying sympy/assumptions/cnf.py -> build-3/lib/sympy/assumptions copying sympy/assumptions/refine.py -> build-3/lib/sympy/assumptions copying sympy/assumptions/satask.py -> build-3/lib/sympy/assumptions copying sympy/assumptions/sathandlers.py -> build-3/lib/sympy/assumptions creating build-3/lib/sympy/assumptions/handlers copying sympy/assumptions/handlers/__init__.py -> build-3/lib/sympy/assumptions/handlers copying sympy/assumptions/handlers/calculus.py -> build-3/lib/sympy/assumptions/handlers copying sympy/assumptions/handlers/common.py -> build-3/lib/sympy/assumptions/handlers copying sympy/assumptions/handlers/matrices.py -> build-3/lib/sympy/assumptions/handlers copying sympy/assumptions/handlers/ntheory.py -> build-3/lib/sympy/assumptions/handlers copying sympy/assumptions/handlers/order.py -> build-3/lib/sympy/assumptions/handlers copying sympy/assumptions/handlers/sets.py -> build-3/lib/sympy/assumptions/handlers creating build-3/lib/sympy/benchmarks copying sympy/benchmarks/__init__.py -> build-3/lib/sympy/benchmarks copying sympy/benchmarks/bench_discrete_log.py -> build-3/lib/sympy/benchmarks copying sympy/benchmarks/bench_meijerint.py -> build-3/lib/sympy/benchmarks copying sympy/benchmarks/bench_symbench.py -> build-3/lib/sympy/benchmarks creating build-3/lib/sympy/calculus copying sympy/calculus/__init__.py -> build-3/lib/sympy/calculus copying sympy/calculus/euler.py -> build-3/lib/sympy/calculus copying sympy/calculus/finite_diff.py -> build-3/lib/sympy/calculus copying sympy/calculus/singularities.py -> build-3/lib/sympy/calculus copying sympy/calculus/util.py -> build-3/lib/sympy/calculus creating build-3/lib/sympy/categories copying sympy/categories/__init__.py -> build-3/lib/sympy/categories copying sympy/categories/baseclasses.py -> build-3/lib/sympy/categories copying sympy/categories/diagram_drawing.py -> build-3/lib/sympy/categories creating build-3/lib/sympy/codegen copying sympy/codegen/__init__.py -> build-3/lib/sympy/codegen copying sympy/codegen/algorithms.py -> build-3/lib/sympy/codegen copying sympy/codegen/approximations.py -> build-3/lib/sympy/codegen copying sympy/codegen/array_utils.py -> build-3/lib/sympy/codegen copying sympy/codegen/ast.py -> build-3/lib/sympy/codegen copying sympy/codegen/cfunctions.py -> build-3/lib/sympy/codegen copying sympy/codegen/cnodes.py -> build-3/lib/sympy/codegen copying sympy/codegen/cutils.py -> build-3/lib/sympy/codegen copying sympy/codegen/cxxnodes.py -> build-3/lib/sympy/codegen copying sympy/codegen/fnodes.py -> build-3/lib/sympy/codegen copying sympy/codegen/futils.py -> build-3/lib/sympy/codegen copying sympy/codegen/matrix_nodes.py -> build-3/lib/sympy/codegen copying sympy/codegen/numpy_nodes.py -> build-3/lib/sympy/codegen copying sympy/codegen/pyutils.py -> build-3/lib/sympy/codegen copying sympy/codegen/rewriting.py -> build-3/lib/sympy/codegen copying sympy/codegen/scipy_nodes.py -> build-3/lib/sympy/codegen creating build-3/lib/sympy/combinatorics copying sympy/combinatorics/__init__.py -> build-3/lib/sympy/combinatorics copying sympy/combinatorics/coset_table.py -> build-3/lib/sympy/combinatorics copying sympy/combinatorics/fp_groups.py -> build-3/lib/sympy/combinatorics copying sympy/combinatorics/free_groups.py -> build-3/lib/sympy/combinatorics copying sympy/combinatorics/generators.py -> build-3/lib/sympy/combinatorics copying sympy/combinatorics/graycode.py -> build-3/lib/sympy/combinatorics copying sympy/combinatorics/group_constructs.py -> build-3/lib/sympy/combinatorics copying sympy/combinatorics/homomorphisms.py -> build-3/lib/sympy/combinatorics copying sympy/combinatorics/named_groups.py -> build-3/lib/sympy/combinatorics copying sympy/combinatorics/partitions.py -> build-3/lib/sympy/combinatorics copying sympy/combinatorics/pc_groups.py -> build-3/lib/sympy/combinatorics copying sympy/combinatorics/perm_groups.py -> build-3/lib/sympy/combinatorics copying sympy/combinatorics/permutations.py -> build-3/lib/sympy/combinatorics copying sympy/combinatorics/polyhedron.py -> build-3/lib/sympy/combinatorics copying sympy/combinatorics/prufer.py -> build-3/lib/sympy/combinatorics copying sympy/combinatorics/rewritingsystem.py -> build-3/lib/sympy/combinatorics copying sympy/combinatorics/rewritingsystem_fsm.py -> build-3/lib/sympy/combinatorics copying sympy/combinatorics/schur_number.py -> build-3/lib/sympy/combinatorics copying sympy/combinatorics/subsets.py -> build-3/lib/sympy/combinatorics copying sympy/combinatorics/tensor_can.py -> build-3/lib/sympy/combinatorics copying sympy/combinatorics/testutil.py -> build-3/lib/sympy/combinatorics copying sympy/combinatorics/util.py -> build-3/lib/sympy/combinatorics creating build-3/lib/sympy/concrete copying sympy/concrete/__init__.py -> build-3/lib/sympy/concrete copying sympy/concrete/delta.py -> build-3/lib/sympy/concrete copying sympy/concrete/expr_with_intlimits.py -> build-3/lib/sympy/concrete copying sympy/concrete/expr_with_limits.py -> build-3/lib/sympy/concrete copying sympy/concrete/gosper.py -> build-3/lib/sympy/concrete copying sympy/concrete/guess.py -> build-3/lib/sympy/concrete copying sympy/concrete/products.py -> build-3/lib/sympy/concrete copying sympy/concrete/summations.py -> build-3/lib/sympy/concrete creating build-3/lib/sympy/core copying sympy/core/__init__.py -> build-3/lib/sympy/core copying sympy/core/_print_helpers.py -> build-3/lib/sympy/core copying sympy/core/add.py -> build-3/lib/sympy/core copying sympy/core/alphabets.py -> build-3/lib/sympy/core copying sympy/core/assumptions.py -> build-3/lib/sympy/core copying sympy/core/backend.py -> build-3/lib/sympy/core copying sympy/core/basic.py -> build-3/lib/sympy/core copying sympy/core/cache.py -> build-3/lib/sympy/core copying sympy/core/compatibility.py -> build-3/lib/sympy/core copying sympy/core/containers.py -> build-3/lib/sympy/core copying sympy/core/core.py -> build-3/lib/sympy/core copying sympy/core/coreerrors.py -> build-3/lib/sympy/core copying sympy/core/decorators.py -> build-3/lib/sympy/core copying sympy/core/evalf.py -> build-3/lib/sympy/core copying sympy/core/expr.py -> build-3/lib/sympy/core copying sympy/core/exprtools.py -> build-3/lib/sympy/core copying sympy/core/facts.py -> build-3/lib/sympy/core copying sympy/core/function.py -> build-3/lib/sympy/core copying sympy/core/logic.py -> build-3/lib/sympy/core copying sympy/core/mod.py -> build-3/lib/sympy/core copying sympy/core/mul.py -> build-3/lib/sympy/core copying sympy/core/multidimensional.py -> build-3/lib/sympy/core copying sympy/core/numbers.py -> build-3/lib/sympy/core copying sympy/core/operations.py -> build-3/lib/sympy/core copying sympy/core/parameters.py -> build-3/lib/sympy/core copying sympy/core/power.py -> build-3/lib/sympy/core copying sympy/core/relational.py -> build-3/lib/sympy/core copying sympy/core/rules.py -> build-3/lib/sympy/core copying sympy/core/singleton.py -> build-3/lib/sympy/core copying sympy/core/symbol.py -> build-3/lib/sympy/core copying sympy/core/sympify.py -> build-3/lib/sympy/core copying sympy/core/trace.py -> build-3/lib/sympy/core creating build-3/lib/sympy/core/benchmarks copying sympy/core/benchmarks/__init__.py -> build-3/lib/sympy/core/benchmarks copying sympy/core/benchmarks/bench_arit.py -> build-3/lib/sympy/core/benchmarks copying sympy/core/benchmarks/bench_assumptions.py -> build-3/lib/sympy/core/benchmarks copying sympy/core/benchmarks/bench_basic.py -> build-3/lib/sympy/core/benchmarks copying sympy/core/benchmarks/bench_expand.py -> build-3/lib/sympy/core/benchmarks copying sympy/core/benchmarks/bench_numbers.py -> build-3/lib/sympy/core/benchmarks copying sympy/core/benchmarks/bench_sympify.py -> build-3/lib/sympy/core/benchmarks creating build-3/lib/sympy/crypto copying sympy/crypto/__init__.py -> build-3/lib/sympy/crypto copying sympy/crypto/crypto.py -> build-3/lib/sympy/crypto creating build-3/lib/sympy/deprecated copying sympy/deprecated/__init__.py -> build-3/lib/sympy/deprecated copying sympy/deprecated/class_registry.py -> build-3/lib/sympy/deprecated creating build-3/lib/sympy/diffgeom copying sympy/diffgeom/__init__.py -> build-3/lib/sympy/diffgeom copying sympy/diffgeom/diffgeom.py -> build-3/lib/sympy/diffgeom copying sympy/diffgeom/rn.py -> build-3/lib/sympy/diffgeom creating build-3/lib/sympy/discrete copying sympy/discrete/__init__.py -> build-3/lib/sympy/discrete copying sympy/discrete/convolutions.py -> build-3/lib/sympy/discrete copying sympy/discrete/recurrences.py -> build-3/lib/sympy/discrete copying sympy/discrete/transforms.py -> build-3/lib/sympy/discrete creating build-3/lib/sympy/external copying sympy/external/__init__.py -> build-3/lib/sympy/external copying sympy/external/importtools.py -> build-3/lib/sympy/external creating build-3/lib/sympy/functions copying sympy/functions/__init__.py -> build-3/lib/sympy/functions creating build-3/lib/sympy/functions/combinatorial copying sympy/functions/combinatorial/__init__.py -> build-3/lib/sympy/functions/combinatorial copying sympy/functions/combinatorial/factorials.py -> build-3/lib/sympy/functions/combinatorial copying sympy/functions/combinatorial/numbers.py -> build-3/lib/sympy/functions/combinatorial creating build-3/lib/sympy/functions/elementary copying sympy/functions/elementary/__init__.py -> build-3/lib/sympy/functions/elementary copying sympy/functions/elementary/complexes.py -> build-3/lib/sympy/functions/elementary copying sympy/functions/elementary/exponential.py -> build-3/lib/sympy/functions/elementary copying sympy/functions/elementary/hyperbolic.py -> build-3/lib/sympy/functions/elementary copying sympy/functions/elementary/integers.py -> build-3/lib/sympy/functions/elementary copying sympy/functions/elementary/miscellaneous.py -> build-3/lib/sympy/functions/elementary copying sympy/functions/elementary/piecewise.py -> build-3/lib/sympy/functions/elementary copying sympy/functions/elementary/trigonometric.py -> build-3/lib/sympy/functions/elementary creating build-3/lib/sympy/functions/elementary/benchmarks copying sympy/functions/elementary/benchmarks/__init__.py -> build-3/lib/sympy/functions/elementary/benchmarks copying sympy/functions/elementary/benchmarks/bench_exp.py -> build-3/lib/sympy/functions/elementary/benchmarks creating build-3/lib/sympy/functions/special copying sympy/functions/special/__init__.py -> build-3/lib/sympy/functions/special copying sympy/functions/special/bessel.py -> build-3/lib/sympy/functions/special copying sympy/functions/special/beta_functions.py -> build-3/lib/sympy/functions/special copying sympy/functions/special/bsplines.py -> build-3/lib/sympy/functions/special copying sympy/functions/special/delta_functions.py -> build-3/lib/sympy/functions/special copying sympy/functions/special/elliptic_integrals.py -> build-3/lib/sympy/functions/special copying sympy/functions/special/error_functions.py -> build-3/lib/sympy/functions/special copying sympy/functions/special/gamma_functions.py -> build-3/lib/sympy/functions/special copying sympy/functions/special/hyper.py -> build-3/lib/sympy/functions/special copying sympy/functions/special/mathieu_functions.py -> build-3/lib/sympy/functions/special copying sympy/functions/special/polynomials.py -> build-3/lib/sympy/functions/special copying sympy/functions/special/singularity_functions.py -> build-3/lib/sympy/functions/special copying sympy/functions/special/spherical_harmonics.py -> build-3/lib/sympy/functions/special copying sympy/functions/special/tensor_functions.py -> build-3/lib/sympy/functions/special copying sympy/functions/special/zeta_functions.py -> build-3/lib/sympy/functions/special creating build-3/lib/sympy/functions/special/benchmarks copying sympy/functions/special/benchmarks/__init__.py -> build-3/lib/sympy/functions/special/benchmarks copying sympy/functions/special/benchmarks/bench_special.py -> build-3/lib/sympy/functions/special/benchmarks creating build-3/lib/sympy/geometry copying sympy/geometry/__init__.py -> build-3/lib/sympy/geometry copying sympy/geometry/curve.py -> build-3/lib/sympy/geometry copying sympy/geometry/ellipse.py -> build-3/lib/sympy/geometry copying sympy/geometry/entity.py -> build-3/lib/sympy/geometry copying sympy/geometry/exceptions.py -> build-3/lib/sympy/geometry copying sympy/geometry/line.py -> build-3/lib/sympy/geometry copying sympy/geometry/parabola.py -> build-3/lib/sympy/geometry copying sympy/geometry/plane.py -> build-3/lib/sympy/geometry copying sympy/geometry/point.py -> build-3/lib/sympy/geometry copying sympy/geometry/polygon.py -> build-3/lib/sympy/geometry copying sympy/geometry/util.py -> build-3/lib/sympy/geometry creating build-3/lib/sympy/holonomic copying sympy/holonomic/__init__.py -> build-3/lib/sympy/holonomic copying sympy/holonomic/holonomic.py -> build-3/lib/sympy/holonomic copying sympy/holonomic/holonomicerrors.py -> build-3/lib/sympy/holonomic copying sympy/holonomic/linearsolver.py -> build-3/lib/sympy/holonomic copying sympy/holonomic/numerical.py -> build-3/lib/sympy/holonomic copying sympy/holonomic/recurrence.py -> build-3/lib/sympy/holonomic creating build-3/lib/sympy/integrals copying sympy/integrals/__init__.py -> build-3/lib/sympy/integrals copying sympy/integrals/deltafunctions.py -> build-3/lib/sympy/integrals copying sympy/integrals/heurisch.py -> build-3/lib/sympy/integrals copying sympy/integrals/integrals.py -> build-3/lib/sympy/integrals copying sympy/integrals/intpoly.py -> build-3/lib/sympy/integrals copying sympy/integrals/manualintegrate.py -> build-3/lib/sympy/integrals copying sympy/integrals/meijerint.py -> build-3/lib/sympy/integrals copying sympy/integrals/meijerint_doc.py -> build-3/lib/sympy/integrals copying sympy/integrals/prde.py -> build-3/lib/sympy/integrals copying sympy/integrals/quadrature.py -> build-3/lib/sympy/integrals copying sympy/integrals/rationaltools.py -> build-3/lib/sympy/integrals copying sympy/integrals/rde.py -> build-3/lib/sympy/integrals copying sympy/integrals/risch.py -> build-3/lib/sympy/integrals copying sympy/integrals/singularityfunctions.py -> build-3/lib/sympy/integrals copying sympy/integrals/transforms.py -> build-3/lib/sympy/integrals copying sympy/integrals/trigonometry.py -> build-3/lib/sympy/integrals creating build-3/lib/sympy/integrals/benchmarks copying sympy/integrals/benchmarks/__init__.py -> build-3/lib/sympy/integrals/benchmarks copying sympy/integrals/benchmarks/bench_integrate.py -> build-3/lib/sympy/integrals/benchmarks copying sympy/integrals/benchmarks/bench_trigintegrate.py -> build-3/lib/sympy/integrals/benchmarks creating build-3/lib/sympy/integrals/rubi copying sympy/integrals/rubi/__init__.py -> build-3/lib/sympy/integrals/rubi copying sympy/integrals/rubi/constraints.py -> build-3/lib/sympy/integrals/rubi copying sympy/integrals/rubi/rubimain.py -> build-3/lib/sympy/integrals/rubi copying sympy/integrals/rubi/symbol.py -> build-3/lib/sympy/integrals/rubi copying sympy/integrals/rubi/utility_function.py -> build-3/lib/sympy/integrals/rubi creating build-3/lib/sympy/integrals/rubi/parsetools copying sympy/integrals/rubi/parsetools/__init__.py -> build-3/lib/sympy/integrals/rubi/parsetools copying sympy/integrals/rubi/parsetools/generate_rules.py -> build-3/lib/sympy/integrals/rubi/parsetools copying sympy/integrals/rubi/parsetools/generate_tests.py -> build-3/lib/sympy/integrals/rubi/parsetools copying sympy/integrals/rubi/parsetools/parse.py -> build-3/lib/sympy/integrals/rubi/parsetools creating build-3/lib/sympy/integrals/rubi/rubi_tests copying sympy/integrals/rubi/rubi_tests/__init__.py -> build-3/lib/sympy/integrals/rubi/rubi_tests creating build-3/lib/sympy/integrals/rubi/rules copying sympy/integrals/rubi/rules/__init__.py -> build-3/lib/sympy/integrals/rubi/rules copying sympy/integrals/rubi/rules/binomial_products.py -> build-3/lib/sympy/integrals/rubi/rules copying sympy/integrals/rubi/rules/exponential.py -> build-3/lib/sympy/integrals/rubi/rules copying sympy/integrals/rubi/rules/hyperbolic.py -> build-3/lib/sympy/integrals/rubi/rules copying sympy/integrals/rubi/rules/integrand_simplification.py -> build-3/lib/sympy/integrals/rubi/rules copying sympy/integrals/rubi/rules/inverse_hyperbolic.py -> build-3/lib/sympy/integrals/rubi/rules copying sympy/integrals/rubi/rules/inverse_trig.py -> build-3/lib/sympy/integrals/rubi/rules copying sympy/integrals/rubi/rules/linear_products.py -> build-3/lib/sympy/integrals/rubi/rules copying sympy/integrals/rubi/rules/logarithms.py -> build-3/lib/sympy/integrals/rubi/rules copying sympy/integrals/rubi/rules/miscellaneous_algebraic.py -> build-3/lib/sympy/integrals/rubi/rules copying sympy/integrals/rubi/rules/miscellaneous_integration.py -> build-3/lib/sympy/integrals/rubi/rules copying sympy/integrals/rubi/rules/miscellaneous_trig.py -> build-3/lib/sympy/integrals/rubi/rules copying sympy/integrals/rubi/rules/piecewise_linear.py -> build-3/lib/sympy/integrals/rubi/rules copying sympy/integrals/rubi/rules/quadratic_products.py -> build-3/lib/sympy/integrals/rubi/rules copying sympy/integrals/rubi/rules/secant.py -> build-3/lib/sympy/integrals/rubi/rules copying sympy/integrals/rubi/rules/sine.py -> build-3/lib/sympy/integrals/rubi/rules copying sympy/integrals/rubi/rules/special_functions.py -> build-3/lib/sympy/integrals/rubi/rules copying sympy/integrals/rubi/rules/tangent.py -> build-3/lib/sympy/integrals/rubi/rules copying sympy/integrals/rubi/rules/trinomial_products.py -> build-3/lib/sympy/integrals/rubi/rules creating build-3/lib/sympy/interactive copying sympy/interactive/__init__.py -> build-3/lib/sympy/interactive copying sympy/interactive/ipythonprinting.py -> build-3/lib/sympy/interactive copying sympy/interactive/printing.py -> build-3/lib/sympy/interactive copying sympy/interactive/session.py -> build-3/lib/sympy/interactive creating build-3/lib/sympy/liealgebras copying sympy/liealgebras/__init__.py -> build-3/lib/sympy/liealgebras copying sympy/liealgebras/cartan_matrix.py -> build-3/lib/sympy/liealgebras copying sympy/liealgebras/cartan_type.py -> build-3/lib/sympy/liealgebras copying sympy/liealgebras/dynkin_diagram.py -> build-3/lib/sympy/liealgebras copying sympy/liealgebras/root_system.py -> build-3/lib/sympy/liealgebras copying sympy/liealgebras/type_a.py -> build-3/lib/sympy/liealgebras copying sympy/liealgebras/type_b.py -> build-3/lib/sympy/liealgebras copying sympy/liealgebras/type_c.py -> build-3/lib/sympy/liealgebras copying sympy/liealgebras/type_d.py -> build-3/lib/sympy/liealgebras copying sympy/liealgebras/type_e.py -> build-3/lib/sympy/liealgebras copying sympy/liealgebras/type_f.py -> build-3/lib/sympy/liealgebras copying sympy/liealgebras/type_g.py -> build-3/lib/sympy/liealgebras copying sympy/liealgebras/weyl_group.py -> build-3/lib/sympy/liealgebras creating build-3/lib/sympy/logic copying sympy/logic/__init__.py -> build-3/lib/sympy/logic copying sympy/logic/boolalg.py -> build-3/lib/sympy/logic copying sympy/logic/inference.py -> build-3/lib/sympy/logic creating build-3/lib/sympy/logic/algorithms copying sympy/logic/algorithms/__init__.py -> build-3/lib/sympy/logic/algorithms copying sympy/logic/algorithms/dpll.py -> build-3/lib/sympy/logic/algorithms copying sympy/logic/algorithms/dpll2.py -> build-3/lib/sympy/logic/algorithms copying sympy/logic/algorithms/pycosat_wrapper.py -> build-3/lib/sympy/logic/algorithms creating build-3/lib/sympy/logic/utilities copying sympy/logic/utilities/__init__.py -> build-3/lib/sympy/logic/utilities copying sympy/logic/utilities/dimacs.py -> build-3/lib/sympy/logic/utilities creating build-3/lib/sympy/matrices copying sympy/matrices/__init__.py -> build-3/lib/sympy/matrices copying sympy/matrices/common.py -> build-3/lib/sympy/matrices copying sympy/matrices/decompositions.py -> build-3/lib/sympy/matrices copying sympy/matrices/dense.py -> build-3/lib/sympy/matrices copying sympy/matrices/densearith.py -> build-3/lib/sympy/matrices copying sympy/matrices/densesolve.py -> build-3/lib/sympy/matrices copying sympy/matrices/densetools.py -> build-3/lib/sympy/matrices copying sympy/matrices/determinant.py -> build-3/lib/sympy/matrices copying sympy/matrices/eigen.py -> build-3/lib/sympy/matrices copying sympy/matrices/graph.py -> build-3/lib/sympy/matrices copying sympy/matrices/immutable.py -> build-3/lib/sympy/matrices copying sympy/matrices/inverse.py -> build-3/lib/sympy/matrices copying sympy/matrices/matrices.py -> build-3/lib/sympy/matrices copying sympy/matrices/normalforms.py -> build-3/lib/sympy/matrices copying sympy/matrices/reductions.py -> build-3/lib/sympy/matrices copying sympy/matrices/solvers.py -> build-3/lib/sympy/matrices copying sympy/matrices/sparse.py -> build-3/lib/sympy/matrices copying sympy/matrices/sparsetools.py -> build-3/lib/sympy/matrices copying sympy/matrices/subspaces.py -> build-3/lib/sympy/matrices copying sympy/matrices/utilities.py -> build-3/lib/sympy/matrices creating build-3/lib/sympy/matrices/benchmarks copying sympy/matrices/benchmarks/__init__.py -> build-3/lib/sympy/matrices/benchmarks copying sympy/matrices/benchmarks/bench_matrix.py -> build-3/lib/sympy/matrices/benchmarks creating build-3/lib/sympy/matrices/expressions copying sympy/matrices/expressions/__init__.py -> build-3/lib/sympy/matrices/expressions copying sympy/matrices/expressions/adjoint.py -> build-3/lib/sympy/matrices/expressions copying sympy/matrices/expressions/applyfunc.py -> build-3/lib/sympy/matrices/expressions copying sympy/matrices/expressions/blockmatrix.py -> build-3/lib/sympy/matrices/expressions copying sympy/matrices/expressions/companion.py -> build-3/lib/sympy/matrices/expressions copying sympy/matrices/expressions/determinant.py -> build-3/lib/sympy/matrices/expressions copying sympy/matrices/expressions/diagonal.py -> build-3/lib/sympy/matrices/expressions copying sympy/matrices/expressions/dotproduct.py -> build-3/lib/sympy/matrices/expressions copying sympy/matrices/expressions/factorizations.py -> build-3/lib/sympy/matrices/expressions copying sympy/matrices/expressions/fourier.py -> build-3/lib/sympy/matrices/expressions copying sympy/matrices/expressions/funcmatrix.py -> build-3/lib/sympy/matrices/expressions copying sympy/matrices/expressions/hadamard.py -> build-3/lib/sympy/matrices/expressions copying sympy/matrices/expressions/inverse.py -> build-3/lib/sympy/matrices/expressions copying sympy/matrices/expressions/kronecker.py -> build-3/lib/sympy/matrices/expressions copying sympy/matrices/expressions/matadd.py -> build-3/lib/sympy/matrices/expressions copying sympy/matrices/expressions/matexpr.py -> build-3/lib/sympy/matrices/expressions copying sympy/matrices/expressions/matmul.py -> build-3/lib/sympy/matrices/expressions copying sympy/matrices/expressions/matpow.py -> build-3/lib/sympy/matrices/expressions copying sympy/matrices/expressions/permutation.py -> build-3/lib/sympy/matrices/expressions copying sympy/matrices/expressions/sets.py -> build-3/lib/sympy/matrices/expressions copying sympy/matrices/expressions/slice.py -> build-3/lib/sympy/matrices/expressions copying sympy/matrices/expressions/special.py -> build-3/lib/sympy/matrices/expressions copying sympy/matrices/expressions/trace.py -> build-3/lib/sympy/matrices/expressions copying sympy/matrices/expressions/transpose.py -> build-3/lib/sympy/matrices/expressions creating build-3/lib/sympy/multipledispatch copying sympy/multipledispatch/__init__.py -> build-3/lib/sympy/multipledispatch copying sympy/multipledispatch/conflict.py -> build-3/lib/sympy/multipledispatch copying sympy/multipledispatch/core.py -> build-3/lib/sympy/multipledispatch copying sympy/multipledispatch/dispatcher.py -> build-3/lib/sympy/multipledispatch copying sympy/multipledispatch/utils.py -> build-3/lib/sympy/multipledispatch creating build-3/lib/sympy/ntheory copying sympy/ntheory/__init__.py -> build-3/lib/sympy/ntheory copying sympy/ntheory/bbp_pi.py -> build-3/lib/sympy/ntheory copying sympy/ntheory/continued_fraction.py -> build-3/lib/sympy/ntheory copying sympy/ntheory/digits.py -> build-3/lib/sympy/ntheory copying sympy/ntheory/ecm.py -> build-3/lib/sympy/ntheory copying sympy/ntheory/egyptian_fraction.py -> build-3/lib/sympy/ntheory copying sympy/ntheory/elliptic_curve.py -> build-3/lib/sympy/ntheory copying sympy/ntheory/factor_.py -> build-3/lib/sympy/ntheory copying sympy/ntheory/generate.py -> build-3/lib/sympy/ntheory copying sympy/ntheory/modular.py -> build-3/lib/sympy/ntheory copying sympy/ntheory/multinomial.py -> build-3/lib/sympy/ntheory copying sympy/ntheory/partitions_.py -> build-3/lib/sympy/ntheory copying sympy/ntheory/primetest.py -> build-3/lib/sympy/ntheory copying sympy/ntheory/qs.py -> build-3/lib/sympy/ntheory copying sympy/ntheory/residue_ntheory.py -> build-3/lib/sympy/ntheory creating build-3/lib/sympy/parsing copying sympy/parsing/__init__.py -> build-3/lib/sympy/parsing copying sympy/parsing/ast_parser.py -> build-3/lib/sympy/parsing copying sympy/parsing/mathematica.py -> build-3/lib/sympy/parsing copying sympy/parsing/maxima.py -> build-3/lib/sympy/parsing copying sympy/parsing/sym_expr.py -> build-3/lib/sympy/parsing copying sympy/parsing/sympy_parser.py -> build-3/lib/sympy/parsing creating build-3/lib/sympy/parsing/autolev copying sympy/parsing/autolev/__init__.py -> build-3/lib/sympy/parsing/autolev copying sympy/parsing/autolev/_listener_autolev_antlr.py -> build-3/lib/sympy/parsing/autolev copying sympy/parsing/autolev/_parse_autolev_antlr.py -> build-3/lib/sympy/parsing/autolev creating build-3/lib/sympy/parsing/autolev/_antlr copying sympy/parsing/autolev/_antlr/__init__.py -> build-3/lib/sympy/parsing/autolev/_antlr copying sympy/parsing/autolev/_antlr/autolevlexer.py -> build-3/lib/sympy/parsing/autolev/_antlr copying sympy/parsing/autolev/_antlr/autolevlistener.py -> build-3/lib/sympy/parsing/autolev/_antlr copying sympy/parsing/autolev/_antlr/autolevparser.py -> build-3/lib/sympy/parsing/autolev/_antlr creating build-3/lib/sympy/parsing/c copying sympy/parsing/c/__init__.py -> build-3/lib/sympy/parsing/c copying sympy/parsing/c/c_parser.py -> build-3/lib/sympy/parsing/c creating build-3/lib/sympy/parsing/fortran copying sympy/parsing/fortran/__init__.py -> build-3/lib/sympy/parsing/fortran copying sympy/parsing/fortran/fortran_parser.py -> build-3/lib/sympy/parsing/fortran creating build-3/lib/sympy/parsing/latex copying sympy/parsing/latex/__init__.py -> build-3/lib/sympy/parsing/latex copying sympy/parsing/latex/_build_latex_antlr.py -> build-3/lib/sympy/parsing/latex copying sympy/parsing/latex/_parse_latex_antlr.py -> build-3/lib/sympy/parsing/latex copying sympy/parsing/latex/errors.py -> build-3/lib/sympy/parsing/latex creating build-3/lib/sympy/parsing/latex/_antlr copying sympy/parsing/latex/_antlr/__init__.py -> build-3/lib/sympy/parsing/latex/_antlr copying sympy/parsing/latex/_antlr/latexlexer.py -> build-3/lib/sympy/parsing/latex/_antlr copying sympy/parsing/latex/_antlr/latexparser.py -> build-3/lib/sympy/parsing/latex/_antlr creating build-3/lib/sympy/physics copying sympy/physics/__init__.py -> build-3/lib/sympy/physics copying sympy/physics/gaussopt.py -> build-3/lib/sympy/physics copying sympy/physics/hydrogen.py -> build-3/lib/sympy/physics copying sympy/physics/matrices.py -> build-3/lib/sympy/physics copying sympy/physics/paulialgebra.py -> build-3/lib/sympy/physics copying sympy/physics/pring.py -> build-3/lib/sympy/physics copying sympy/physics/qho_1d.py -> build-3/lib/sympy/physics copying sympy/physics/secondquant.py -> build-3/lib/sympy/physics copying sympy/physics/sho.py -> build-3/lib/sympy/physics copying sympy/physics/wigner.py -> build-3/lib/sympy/physics creating build-3/lib/sympy/physics/continuum_mechanics copying sympy/physics/continuum_mechanics/__init__.py -> build-3/lib/sympy/physics/continuum_mechanics copying sympy/physics/continuum_mechanics/beam.py -> build-3/lib/sympy/physics/continuum_mechanics creating build-3/lib/sympy/physics/control copying sympy/physics/control/__init__.py -> build-3/lib/sympy/physics/control copying sympy/physics/control/lti.py -> build-3/lib/sympy/physics/control creating build-3/lib/sympy/physics/hep copying sympy/physics/hep/__init__.py -> build-3/lib/sympy/physics/hep copying sympy/physics/hep/gamma_matrices.py -> build-3/lib/sympy/physics/hep creating build-3/lib/sympy/physics/mechanics copying sympy/physics/mechanics/__init__.py -> build-3/lib/sympy/physics/mechanics copying sympy/physics/mechanics/body.py -> build-3/lib/sympy/physics/mechanics copying sympy/physics/mechanics/functions.py -> build-3/lib/sympy/physics/mechanics copying sympy/physics/mechanics/kane.py -> build-3/lib/sympy/physics/mechanics copying sympy/physics/mechanics/lagrange.py -> build-3/lib/sympy/physics/mechanics copying sympy/physics/mechanics/linearize.py -> build-3/lib/sympy/physics/mechanics copying sympy/physics/mechanics/models.py -> build-3/lib/sympy/physics/mechanics copying sympy/physics/mechanics/particle.py -> build-3/lib/sympy/physics/mechanics copying sympy/physics/mechanics/rigidbody.py -> build-3/lib/sympy/physics/mechanics copying sympy/physics/mechanics/system.py -> build-3/lib/sympy/physics/mechanics creating build-3/lib/sympy/physics/optics copying sympy/physics/optics/__init__.py -> build-3/lib/sympy/physics/optics copying sympy/physics/optics/gaussopt.py -> build-3/lib/sympy/physics/optics copying sympy/physics/optics/medium.py -> build-3/lib/sympy/physics/optics copying sympy/physics/optics/polarization.py -> build-3/lib/sympy/physics/optics copying sympy/physics/optics/utils.py -> build-3/lib/sympy/physics/optics copying sympy/physics/optics/waves.py -> build-3/lib/sympy/physics/optics creating build-3/lib/sympy/physics/quantum copying sympy/physics/quantum/__init__.py -> build-3/lib/sympy/physics/quantum copying sympy/physics/quantum/anticommutator.py -> build-3/lib/sympy/physics/quantum copying sympy/physics/quantum/boson.py -> build-3/lib/sympy/physics/quantum copying sympy/physics/quantum/cartesian.py -> build-3/lib/sympy/physics/quantum copying sympy/physics/quantum/cg.py -> build-3/lib/sympy/physics/quantum copying sympy/physics/quantum/circuitplot.py -> build-3/lib/sympy/physics/quantum copying sympy/physics/quantum/circuitutils.py -> build-3/lib/sympy/physics/quantum copying sympy/physics/quantum/commutator.py -> build-3/lib/sympy/physics/quantum copying sympy/physics/quantum/constants.py -> build-3/lib/sympy/physics/quantum copying sympy/physics/quantum/dagger.py -> build-3/lib/sympy/physics/quantum copying sympy/physics/quantum/density.py -> build-3/lib/sympy/physics/quantum copying sympy/physics/quantum/fermion.py -> build-3/lib/sympy/physics/quantum copying sympy/physics/quantum/gate.py -> build-3/lib/sympy/physics/quantum copying sympy/physics/quantum/grover.py -> build-3/lib/sympy/physics/quantum copying sympy/physics/quantum/hilbert.py -> build-3/lib/sympy/physics/quantum copying sympy/physics/quantum/identitysearch.py -> build-3/lib/sympy/physics/quantum copying sympy/physics/quantum/innerproduct.py -> build-3/lib/sympy/physics/quantum copying sympy/physics/quantum/matrixcache.py -> build-3/lib/sympy/physics/quantum copying sympy/physics/quantum/matrixutils.py -> build-3/lib/sympy/physics/quantum copying sympy/physics/quantum/operator.py -> build-3/lib/sympy/physics/quantum copying sympy/physics/quantum/operatorordering.py -> build-3/lib/sympy/physics/quantum copying sympy/physics/quantum/operatorset.py -> build-3/lib/sympy/physics/quantum copying sympy/physics/quantum/pauli.py -> build-3/lib/sympy/physics/quantum copying sympy/physics/quantum/piab.py -> build-3/lib/sympy/physics/quantum copying sympy/physics/quantum/qapply.py -> build-3/lib/sympy/physics/quantum copying sympy/physics/quantum/qasm.py -> build-3/lib/sympy/physics/quantum copying sympy/physics/quantum/qexpr.py -> build-3/lib/sympy/physics/quantum copying sympy/physics/quantum/qft.py -> build-3/lib/sympy/physics/quantum copying sympy/physics/quantum/qubit.py -> build-3/lib/sympy/physics/quantum copying sympy/physics/quantum/represent.py -> build-3/lib/sympy/physics/quantum copying sympy/physics/quantum/sho1d.py -> build-3/lib/sympy/physics/quantum copying sympy/physics/quantum/shor.py -> build-3/lib/sympy/physics/quantum copying sympy/physics/quantum/spin.py -> build-3/lib/sympy/physics/quantum copying sympy/physics/quantum/state.py -> build-3/lib/sympy/physics/quantum copying sympy/physics/quantum/tensorproduct.py -> build-3/lib/sympy/physics/quantum creating build-3/lib/sympy/physics/units copying sympy/physics/units/__init__.py -> build-3/lib/sympy/physics/units copying sympy/physics/units/dimensions.py -> build-3/lib/sympy/physics/units copying sympy/physics/units/prefixes.py -> build-3/lib/sympy/physics/units copying sympy/physics/units/quantities.py -> build-3/lib/sympy/physics/units copying sympy/physics/units/unitsystem.py -> build-3/lib/sympy/physics/units copying sympy/physics/units/util.py -> build-3/lib/sympy/physics/units creating build-3/lib/sympy/physics/units/definitions copying sympy/physics/units/definitions/__init__.py -> build-3/lib/sympy/physics/units/definitions copying sympy/physics/units/definitions/dimension_definitions.py -> build-3/lib/sympy/physics/units/definitions copying sympy/physics/units/definitions/unit_definitions.py -> build-3/lib/sympy/physics/units/definitions creating build-3/lib/sympy/physics/units/systems copying sympy/physics/units/systems/__init__.py -> build-3/lib/sympy/physics/units/systems copying sympy/physics/units/systems/cgs.py -> build-3/lib/sympy/physics/units/systems copying sympy/physics/units/systems/length_weight_time.py -> build-3/lib/sympy/physics/units/systems copying sympy/physics/units/systems/mks.py -> build-3/lib/sympy/physics/units/systems copying sympy/physics/units/systems/mksa.py -> build-3/lib/sympy/physics/units/systems copying sympy/physics/units/systems/natural.py -> build-3/lib/sympy/physics/units/systems copying sympy/physics/units/systems/si.py -> build-3/lib/sympy/physics/units/systems creating build-3/lib/sympy/physics/vector copying sympy/physics/vector/__init__.py -> build-3/lib/sympy/physics/vector copying sympy/physics/vector/dyadic.py -> build-3/lib/sympy/physics/vector copying sympy/physics/vector/fieldfunctions.py -> build-3/lib/sympy/physics/vector copying sympy/physics/vector/frame.py -> build-3/lib/sympy/physics/vector copying sympy/physics/vector/functions.py -> build-3/lib/sympy/physics/vector copying sympy/physics/vector/point.py -> build-3/lib/sympy/physics/vector copying sympy/physics/vector/printing.py -> build-3/lib/sympy/physics/vector copying sympy/physics/vector/vector.py -> build-3/lib/sympy/physics/vector creating build-3/lib/sympy/plotting copying sympy/plotting/__init__.py -> build-3/lib/sympy/plotting copying sympy/plotting/experimental_lambdify.py -> build-3/lib/sympy/plotting copying sympy/plotting/plot.py -> build-3/lib/sympy/plotting copying sympy/plotting/plot_implicit.py -> build-3/lib/sympy/plotting copying sympy/plotting/textplot.py -> build-3/lib/sympy/plotting creating build-3/lib/sympy/plotting/intervalmath copying sympy/plotting/intervalmath/__init__.py -> build-3/lib/sympy/plotting/intervalmath copying sympy/plotting/intervalmath/interval_arithmetic.py -> build-3/lib/sympy/plotting/intervalmath copying sympy/plotting/intervalmath/interval_membership.py -> build-3/lib/sympy/plotting/intervalmath copying sympy/plotting/intervalmath/lib_interval.py -> build-3/lib/sympy/plotting/intervalmath creating build-3/lib/sympy/plotting/pygletplot copying sympy/plotting/pygletplot/__init__.py -> build-3/lib/sympy/plotting/pygletplot copying sympy/plotting/pygletplot/color_scheme.py -> build-3/lib/sympy/plotting/pygletplot copying sympy/plotting/pygletplot/managed_window.py -> build-3/lib/sympy/plotting/pygletplot copying sympy/plotting/pygletplot/plot.py -> build-3/lib/sympy/plotting/pygletplot copying sympy/plotting/pygletplot/plot_axes.py -> build-3/lib/sympy/plotting/pygletplot copying sympy/plotting/pygletplot/plot_camera.py -> build-3/lib/sympy/plotting/pygletplot copying sympy/plotting/pygletplot/plot_controller.py -> build-3/lib/sympy/plotting/pygletplot copying sympy/plotting/pygletplot/plot_curve.py -> build-3/lib/sympy/plotting/pygletplot copying sympy/plotting/pygletplot/plot_interval.py -> build-3/lib/sympy/plotting/pygletplot copying sympy/plotting/pygletplot/plot_mode.py -> build-3/lib/sympy/plotting/pygletplot copying sympy/plotting/pygletplot/plot_mode_base.py -> build-3/lib/sympy/plotting/pygletplot copying sympy/plotting/pygletplot/plot_modes.py -> build-3/lib/sympy/plotting/pygletplot copying sympy/plotting/pygletplot/plot_object.py -> build-3/lib/sympy/plotting/pygletplot copying sympy/plotting/pygletplot/plot_rotation.py -> build-3/lib/sympy/plotting/pygletplot copying sympy/plotting/pygletplot/plot_surface.py -> build-3/lib/sympy/plotting/pygletplot copying sympy/plotting/pygletplot/plot_window.py -> build-3/lib/sympy/plotting/pygletplot copying sympy/plotting/pygletplot/util.py -> build-3/lib/sympy/plotting/pygletplot creating build-3/lib/sympy/polys copying sympy/polys/__init__.py -> build-3/lib/sympy/polys copying sympy/polys/compatibility.py -> build-3/lib/sympy/polys copying sympy/polys/constructor.py -> build-3/lib/sympy/polys copying sympy/polys/densearith.py -> build-3/lib/sympy/polys copying sympy/polys/densebasic.py -> build-3/lib/sympy/polys copying sympy/polys/densetools.py -> build-3/lib/sympy/polys copying sympy/polys/dispersion.py -> build-3/lib/sympy/polys copying sympy/polys/distributedmodules.py -> build-3/lib/sympy/polys copying sympy/polys/domainmatrix.py -> build-3/lib/sympy/polys copying sympy/polys/euclidtools.py -> build-3/lib/sympy/polys copying sympy/polys/factortools.py -> build-3/lib/sympy/polys copying sympy/polys/fglmtools.py -> build-3/lib/sympy/polys copying sympy/polys/fields.py -> build-3/lib/sympy/polys copying sympy/polys/galoistools.py -> build-3/lib/sympy/polys copying sympy/polys/groebnertools.py -> build-3/lib/sympy/polys copying sympy/polys/heuristicgcd.py -> build-3/lib/sympy/polys copying sympy/polys/modulargcd.py -> build-3/lib/sympy/polys copying sympy/polys/monomials.py -> build-3/lib/sympy/polys copying sympy/polys/multivariate_resultants.py -> build-3/lib/sympy/polys copying sympy/polys/numberfields.py -> build-3/lib/sympy/polys copying sympy/polys/orderings.py -> build-3/lib/sympy/polys copying sympy/polys/orthopolys.py -> build-3/lib/sympy/polys copying sympy/polys/partfrac.py -> build-3/lib/sympy/polys copying sympy/polys/polyclasses.py -> build-3/lib/sympy/polys copying sympy/polys/polyconfig.py -> build-3/lib/sympy/polys copying sympy/polys/polyerrors.py -> build-3/lib/sympy/polys copying sympy/polys/polyfuncs.py -> build-3/lib/sympy/polys copying sympy/polys/polymatrix.py -> build-3/lib/sympy/polys copying sympy/polys/polyoptions.py -> build-3/lib/sympy/polys copying sympy/polys/polyquinticconst.py -> build-3/lib/sympy/polys copying sympy/polys/polyroots.py -> build-3/lib/sympy/polys copying sympy/polys/polytools.py -> build-3/lib/sympy/polys copying sympy/polys/polyutils.py -> build-3/lib/sympy/polys copying sympy/polys/rationaltools.py -> build-3/lib/sympy/polys copying sympy/polys/ring_series.py -> build-3/lib/sympy/polys copying sympy/polys/rings.py -> build-3/lib/sympy/polys copying sympy/polys/rootisolation.py -> build-3/lib/sympy/polys copying sympy/polys/rootoftools.py -> build-3/lib/sympy/polys copying sympy/polys/solvers.py -> build-3/lib/sympy/polys copying sympy/polys/specialpolys.py -> build-3/lib/sympy/polys copying sympy/polys/sqfreetools.py -> build-3/lib/sympy/polys copying sympy/polys/subresultants_qq_zz.py -> build-3/lib/sympy/polys creating build-3/lib/sympy/polys/agca copying sympy/polys/agca/__init__.py -> build-3/lib/sympy/polys/agca copying sympy/polys/agca/extensions.py -> build-3/lib/sympy/polys/agca copying sympy/polys/agca/homomorphisms.py -> build-3/lib/sympy/polys/agca copying sympy/polys/agca/ideals.py -> build-3/lib/sympy/polys/agca copying sympy/polys/agca/modules.py -> build-3/lib/sympy/polys/agca creating build-3/lib/sympy/polys/benchmarks copying sympy/polys/benchmarks/__init__.py -> build-3/lib/sympy/polys/benchmarks copying sympy/polys/benchmarks/bench_galoispolys.py -> build-3/lib/sympy/polys/benchmarks copying sympy/polys/benchmarks/bench_groebnertools.py -> build-3/lib/sympy/polys/benchmarks copying sympy/polys/benchmarks/bench_solvers.py -> build-3/lib/sympy/polys/benchmarks creating build-3/lib/sympy/polys/domains copying sympy/polys/domains/__init__.py -> build-3/lib/sympy/polys/domains copying sympy/polys/domains/algebraicfield.py -> build-3/lib/sympy/polys/domains copying sympy/polys/domains/characteristiczero.py -> build-3/lib/sympy/polys/domains copying sympy/polys/domains/complexfield.py -> build-3/lib/sympy/polys/domains copying sympy/polys/domains/compositedomain.py -> build-3/lib/sympy/polys/domains copying sympy/polys/domains/domain.py -> build-3/lib/sympy/polys/domains copying sympy/polys/domains/domainelement.py -> build-3/lib/sympy/polys/domains copying sympy/polys/domains/expressiondomain.py -> build-3/lib/sympy/polys/domains copying sympy/polys/domains/field.py -> build-3/lib/sympy/polys/domains copying sympy/polys/domains/finitefield.py -> build-3/lib/sympy/polys/domains copying sympy/polys/domains/fractionfield.py -> build-3/lib/sympy/polys/domains copying sympy/polys/domains/gaussiandomains.py -> build-3/lib/sympy/polys/domains copying sympy/polys/domains/gmpyfinitefield.py -> build-3/lib/sympy/polys/domains copying sympy/polys/domains/gmpyintegerring.py -> build-3/lib/sympy/polys/domains copying sympy/polys/domains/gmpyrationalfield.py -> build-3/lib/sympy/polys/domains copying sympy/polys/domains/groundtypes.py -> build-3/lib/sympy/polys/domains copying sympy/polys/domains/integerring.py -> build-3/lib/sympy/polys/domains copying sympy/polys/domains/modularinteger.py -> build-3/lib/sympy/polys/domains copying sympy/polys/domains/mpelements.py -> build-3/lib/sympy/polys/domains copying sympy/polys/domains/old_fractionfield.py -> build-3/lib/sympy/polys/domains copying sympy/polys/domains/old_polynomialring.py -> build-3/lib/sympy/polys/domains copying sympy/polys/domains/polynomialring.py -> build-3/lib/sympy/polys/domains copying sympy/polys/domains/pythonfinitefield.py -> build-3/lib/sympy/polys/domains copying sympy/polys/domains/pythonintegerring.py -> build-3/lib/sympy/polys/domains copying sympy/polys/domains/pythonrational.py -> build-3/lib/sympy/polys/domains copying sympy/polys/domains/pythonrationalfield.py -> build-3/lib/sympy/polys/domains copying sympy/polys/domains/quotientring.py -> build-3/lib/sympy/polys/domains copying sympy/polys/domains/rationalfield.py -> build-3/lib/sympy/polys/domains copying sympy/polys/domains/realfield.py -> build-3/lib/sympy/polys/domains copying sympy/polys/domains/ring.py -> build-3/lib/sympy/polys/domains copying sympy/polys/domains/simpledomain.py -> build-3/lib/sympy/polys/domains creating build-3/lib/sympy/printing copying sympy/printing/__init__.py -> build-3/lib/sympy/printing copying sympy/printing/c.py -> build-3/lib/sympy/printing copying sympy/printing/ccode.py -> build-3/lib/sympy/printing copying sympy/printing/codeprinter.py -> build-3/lib/sympy/printing copying sympy/printing/conventions.py -> build-3/lib/sympy/printing copying sympy/printing/cxx.py -> build-3/lib/sympy/printing copying sympy/printing/cxxcode.py -> build-3/lib/sympy/printing copying sympy/printing/defaults.py -> build-3/lib/sympy/printing copying sympy/printing/dot.py -> build-3/lib/sympy/printing copying sympy/printing/fcode.py -> build-3/lib/sympy/printing copying sympy/printing/fortran.py -> build-3/lib/sympy/printing copying sympy/printing/glsl.py -> build-3/lib/sympy/printing copying sympy/printing/gtk.py -> build-3/lib/sympy/printing copying sympy/printing/jscode.py -> build-3/lib/sympy/printing copying sympy/printing/julia.py -> build-3/lib/sympy/printing copying sympy/printing/lambdarepr.py -> build-3/lib/sympy/printing copying sympy/printing/latex.py -> build-3/lib/sympy/printing copying sympy/printing/llvmjitcode.py -> build-3/lib/sympy/printing copying sympy/printing/maple.py -> build-3/lib/sympy/printing copying sympy/printing/mathematica.py -> build-3/lib/sympy/printing copying sympy/printing/mathml.py -> build-3/lib/sympy/printing copying sympy/printing/octave.py -> build-3/lib/sympy/printing copying sympy/printing/precedence.py -> build-3/lib/sympy/printing copying sympy/printing/preview.py -> build-3/lib/sympy/printing copying sympy/printing/printer.py -> build-3/lib/sympy/printing copying sympy/printing/pycode.py -> build-3/lib/sympy/printing copying sympy/printing/python.py -> build-3/lib/sympy/printing copying sympy/printing/rcode.py -> build-3/lib/sympy/printing copying sympy/printing/repr.py -> build-3/lib/sympy/printing copying sympy/printing/rust.py -> build-3/lib/sympy/printing copying sympy/printing/str.py -> build-3/lib/sympy/printing copying sympy/printing/tableform.py -> build-3/lib/sympy/printing copying sympy/printing/tensorflow.py -> build-3/lib/sympy/printing copying sympy/printing/theanocode.py -> build-3/lib/sympy/printing copying sympy/printing/tree.py -> build-3/lib/sympy/printing creating build-3/lib/sympy/printing/pretty copying sympy/printing/pretty/__init__.py -> build-3/lib/sympy/printing/pretty copying sympy/printing/pretty/pretty.py -> build-3/lib/sympy/printing/pretty copying sympy/printing/pretty/pretty_symbology.py -> build-3/lib/sympy/printing/pretty copying sympy/printing/pretty/stringpict.py -> build-3/lib/sympy/printing/pretty creating build-3/lib/sympy/sandbox copying sympy/sandbox/__init__.py -> build-3/lib/sympy/sandbox copying sympy/sandbox/indexed_integrals.py -> build-3/lib/sympy/sandbox creating build-3/lib/sympy/series copying sympy/series/__init__.py -> build-3/lib/sympy/series copying sympy/series/acceleration.py -> build-3/lib/sympy/series copying sympy/series/approximants.py -> build-3/lib/sympy/series copying sympy/series/aseries.py -> build-3/lib/sympy/series copying sympy/series/formal.py -> build-3/lib/sympy/series copying sympy/series/fourier.py -> build-3/lib/sympy/series copying sympy/series/gruntz.py -> build-3/lib/sympy/series copying sympy/series/kauers.py -> build-3/lib/sympy/series copying sympy/series/limits.py -> build-3/lib/sympy/series copying sympy/series/limitseq.py -> build-3/lib/sympy/series copying sympy/series/order.py -> build-3/lib/sympy/series copying sympy/series/residues.py -> build-3/lib/sympy/series copying sympy/series/sequences.py -> build-3/lib/sympy/series copying sympy/series/series.py -> build-3/lib/sympy/series copying sympy/series/series_class.py -> build-3/lib/sympy/series creating build-3/lib/sympy/series/benchmarks copying sympy/series/benchmarks/__init__.py -> build-3/lib/sympy/series/benchmarks copying sympy/series/benchmarks/bench_limit.py -> build-3/lib/sympy/series/benchmarks copying sympy/series/benchmarks/bench_order.py -> build-3/lib/sympy/series/benchmarks creating build-3/lib/sympy/sets copying sympy/sets/__init__.py -> build-3/lib/sympy/sets copying sympy/sets/conditionset.py -> build-3/lib/sympy/sets copying sympy/sets/contains.py -> build-3/lib/sympy/sets copying sympy/sets/fancysets.py -> build-3/lib/sympy/sets copying sympy/sets/ordinals.py -> build-3/lib/sympy/sets copying sympy/sets/powerset.py -> build-3/lib/sympy/sets copying sympy/sets/setexpr.py -> build-3/lib/sympy/sets copying sympy/sets/sets.py -> build-3/lib/sympy/sets creating build-3/lib/sympy/sets/handlers copying sympy/sets/handlers/__init__.py -> build-3/lib/sympy/sets/handlers copying sympy/sets/handlers/add.py -> build-3/lib/sympy/sets/handlers copying sympy/sets/handlers/comparison.py -> build-3/lib/sympy/sets/handlers copying sympy/sets/handlers/functions.py -> build-3/lib/sympy/sets/handlers copying sympy/sets/handlers/intersection.py -> build-3/lib/sympy/sets/handlers copying sympy/sets/handlers/issubset.py -> build-3/lib/sympy/sets/handlers copying sympy/sets/handlers/mul.py -> build-3/lib/sympy/sets/handlers copying sympy/sets/handlers/power.py -> build-3/lib/sympy/sets/handlers copying sympy/sets/handlers/union.py -> build-3/lib/sympy/sets/handlers creating build-3/lib/sympy/simplify copying sympy/simplify/__init__.py -> build-3/lib/sympy/simplify copying sympy/simplify/combsimp.py -> build-3/lib/sympy/simplify copying sympy/simplify/cse_main.py -> build-3/lib/sympy/simplify copying sympy/simplify/cse_opts.py -> build-3/lib/sympy/simplify copying sympy/simplify/epathtools.py -> build-3/lib/sympy/simplify copying sympy/simplify/fu.py -> build-3/lib/sympy/simplify copying sympy/simplify/gammasimp.py -> build-3/lib/sympy/simplify copying sympy/simplify/hyperexpand.py -> build-3/lib/sympy/simplify copying sympy/simplify/hyperexpand_doc.py -> build-3/lib/sympy/simplify copying sympy/simplify/powsimp.py -> build-3/lib/sympy/simplify copying sympy/simplify/radsimp.py -> build-3/lib/sympy/simplify copying sympy/simplify/ratsimp.py -> build-3/lib/sympy/simplify copying sympy/simplify/simplify.py -> build-3/lib/sympy/simplify copying sympy/simplify/sqrtdenest.py -> build-3/lib/sympy/simplify copying sympy/simplify/traversaltools.py -> build-3/lib/sympy/simplify copying sympy/simplify/trigsimp.py -> build-3/lib/sympy/simplify creating build-3/lib/sympy/solvers copying sympy/solvers/__init__.py -> build-3/lib/sympy/solvers copying sympy/solvers/bivariate.py -> build-3/lib/sympy/solvers copying sympy/solvers/decompogen.py -> build-3/lib/sympy/solvers copying sympy/solvers/deutils.py -> build-3/lib/sympy/solvers copying sympy/solvers/inequalities.py -> build-3/lib/sympy/solvers copying sympy/solvers/pde.py -> build-3/lib/sympy/solvers copying sympy/solvers/polysys.py -> build-3/lib/sympy/solvers copying sympy/solvers/recurr.py -> build-3/lib/sympy/solvers copying sympy/solvers/solvers.py -> build-3/lib/sympy/solvers copying sympy/solvers/solveset.py -> build-3/lib/sympy/solvers creating build-3/lib/sympy/solvers/benchmarks copying sympy/solvers/benchmarks/__init__.py -> build-3/lib/sympy/solvers/benchmarks copying sympy/solvers/benchmarks/bench_solvers.py -> build-3/lib/sympy/solvers/benchmarks creating build-3/lib/sympy/solvers/diophantine copying sympy/solvers/diophantine/__init__.py -> build-3/lib/sympy/solvers/diophantine copying sympy/solvers/diophantine/diophantine.py -> build-3/lib/sympy/solvers/diophantine creating build-3/lib/sympy/solvers/ode copying sympy/solvers/ode/__init__.py -> build-3/lib/sympy/solvers/ode copying sympy/solvers/ode/ode.py -> build-3/lib/sympy/solvers/ode copying sympy/solvers/ode/single.py -> build-3/lib/sympy/solvers/ode copying sympy/solvers/ode/subscheck.py -> build-3/lib/sympy/solvers/ode copying sympy/solvers/ode/systems.py -> build-3/lib/sympy/solvers/ode creating build-3/lib/sympy/stats copying sympy/stats/__init__.py -> build-3/lib/sympy/stats copying sympy/stats/compound_rv.py -> build-3/lib/sympy/stats copying sympy/stats/crv.py -> build-3/lib/sympy/stats copying sympy/stats/crv_types.py -> build-3/lib/sympy/stats copying sympy/stats/drv.py -> build-3/lib/sympy/stats copying sympy/stats/drv_types.py -> build-3/lib/sympy/stats copying sympy/stats/error_prop.py -> build-3/lib/sympy/stats copying sympy/stats/frv.py -> build-3/lib/sympy/stats copying sympy/stats/frv_types.py -> build-3/lib/sympy/stats copying sympy/stats/joint_rv.py -> build-3/lib/sympy/stats copying sympy/stats/joint_rv_types.py -> build-3/lib/sympy/stats copying sympy/stats/matrix_distributions.py -> build-3/lib/sympy/stats copying sympy/stats/random_matrix.py -> build-3/lib/sympy/stats copying sympy/stats/random_matrix_models.py -> build-3/lib/sympy/stats copying sympy/stats/rv.py -> build-3/lib/sympy/stats copying sympy/stats/rv_interface.py -> build-3/lib/sympy/stats copying sympy/stats/stochastic_process.py -> build-3/lib/sympy/stats copying sympy/stats/stochastic_process_types.py -> build-3/lib/sympy/stats copying sympy/stats/symbolic_multivariate_probability.py -> build-3/lib/sympy/stats copying sympy/stats/symbolic_probability.py -> build-3/lib/sympy/stats creating build-3/lib/sympy/strategies copying sympy/strategies/__init__.py -> build-3/lib/sympy/strategies copying sympy/strategies/core.py -> build-3/lib/sympy/strategies copying sympy/strategies/rl.py -> build-3/lib/sympy/strategies copying sympy/strategies/tools.py -> build-3/lib/sympy/strategies copying sympy/strategies/traverse.py -> build-3/lib/sympy/strategies copying sympy/strategies/tree.py -> build-3/lib/sympy/strategies copying sympy/strategies/util.py -> build-3/lib/sympy/strategies creating build-3/lib/sympy/strategies/branch copying sympy/strategies/branch/__init__.py -> build-3/lib/sympy/strategies/branch copying sympy/strategies/branch/core.py -> build-3/lib/sympy/strategies/branch copying sympy/strategies/branch/tools.py -> build-3/lib/sympy/strategies/branch copying sympy/strategies/branch/traverse.py -> build-3/lib/sympy/strategies/branch creating build-3/lib/sympy/tensor copying sympy/tensor/__init__.py -> build-3/lib/sympy/tensor copying sympy/tensor/functions.py -> build-3/lib/sympy/tensor copying sympy/tensor/index_methods.py -> build-3/lib/sympy/tensor copying sympy/tensor/indexed.py -> build-3/lib/sympy/tensor copying sympy/tensor/tensor.py -> build-3/lib/sympy/tensor copying sympy/tensor/toperators.py -> build-3/lib/sympy/tensor creating build-3/lib/sympy/tensor/array copying sympy/tensor/array/__init__.py -> build-3/lib/sympy/tensor/array copying sympy/tensor/array/array_comprehension.py -> build-3/lib/sympy/tensor/array copying sympy/tensor/array/array_derivatives.py -> build-3/lib/sympy/tensor/array copying sympy/tensor/array/arrayop.py -> build-3/lib/sympy/tensor/array copying sympy/tensor/array/dense_ndim_array.py -> build-3/lib/sympy/tensor/array copying sympy/tensor/array/mutable_ndim_array.py -> build-3/lib/sympy/tensor/array copying sympy/tensor/array/ndim_array.py -> build-3/lib/sympy/tensor/array copying sympy/tensor/array/sparse_ndim_array.py -> build-3/lib/sympy/tensor/array creating build-3/lib/sympy/testing copying sympy/testing/__init__.py -> build-3/lib/sympy/testing copying sympy/testing/benchmarking.py -> build-3/lib/sympy/testing copying sympy/testing/matrices.py -> build-3/lib/sympy/testing copying sympy/testing/pytest.py -> build-3/lib/sympy/testing copying sympy/testing/quality_unicode.py -> build-3/lib/sympy/testing copying sympy/testing/randtest.py -> build-3/lib/sympy/testing copying sympy/testing/runtests.py -> build-3/lib/sympy/testing copying sympy/testing/tmpfiles.py -> build-3/lib/sympy/testing creating build-3/lib/sympy/unify copying sympy/unify/__init__.py -> build-3/lib/sympy/unify copying sympy/unify/core.py -> build-3/lib/sympy/unify copying sympy/unify/rewrite.py -> build-3/lib/sympy/unify copying sympy/unify/usympy.py -> build-3/lib/sympy/unify creating build-3/lib/sympy/utilities copying sympy/utilities/__init__.py -> build-3/lib/sympy/utilities copying sympy/utilities/autowrap.py -> build-3/lib/sympy/utilities copying sympy/utilities/benchmarking.py -> build-3/lib/sympy/utilities copying sympy/utilities/codegen.py -> build-3/lib/sympy/utilities copying sympy/utilities/decorator.py -> build-3/lib/sympy/utilities copying sympy/utilities/enumerative.py -> build-3/lib/sympy/utilities copying sympy/utilities/exceptions.py -> build-3/lib/sympy/utilities copying sympy/utilities/iterables.py -> build-3/lib/sympy/utilities copying sympy/utilities/lambdify.py -> build-3/lib/sympy/utilities copying sympy/utilities/magic.py -> build-3/lib/sympy/utilities copying sympy/utilities/matchpy_connector.py -> build-3/lib/sympy/utilities copying sympy/utilities/memoization.py -> build-3/lib/sympy/utilities copying sympy/utilities/misc.py -> build-3/lib/sympy/utilities copying sympy/utilities/pkgdata.py -> build-3/lib/sympy/utilities copying sympy/utilities/pytest.py -> build-3/lib/sympy/utilities copying sympy/utilities/quality_unicode.py -> build-3/lib/sympy/utilities copying sympy/utilities/randtest.py -> build-3/lib/sympy/utilities copying sympy/utilities/runtests.py -> build-3/lib/sympy/utilities copying sympy/utilities/source.py -> build-3/lib/sympy/utilities copying sympy/utilities/timeutils.py -> build-3/lib/sympy/utilities copying sympy/utilities/tmpfiles.py -> build-3/lib/sympy/utilities creating build-3/lib/sympy/utilities/_compilation copying sympy/utilities/_compilation/__init__.py -> build-3/lib/sympy/utilities/_compilation copying sympy/utilities/_compilation/availability.py -> build-3/lib/sympy/utilities/_compilation copying sympy/utilities/_compilation/compilation.py -> build-3/lib/sympy/utilities/_compilation copying sympy/utilities/_compilation/runners.py -> build-3/lib/sympy/utilities/_compilation copying sympy/utilities/_compilation/util.py -> build-3/lib/sympy/utilities/_compilation creating build-3/lib/sympy/utilities/mathml copying sympy/utilities/mathml/__init__.py -> build-3/lib/sympy/utilities/mathml creating build-3/lib/sympy/vector copying sympy/vector/__init__.py -> build-3/lib/sympy/vector copying sympy/vector/basisdependent.py -> build-3/lib/sympy/vector copying sympy/vector/coordsysrect.py -> build-3/lib/sympy/vector copying sympy/vector/deloperator.py -> build-3/lib/sympy/vector copying sympy/vector/dyadic.py -> build-3/lib/sympy/vector copying sympy/vector/functions.py -> build-3/lib/sympy/vector copying sympy/vector/implicitregion.py -> build-3/lib/sympy/vector copying sympy/vector/integrals.py -> build-3/lib/sympy/vector copying sympy/vector/operators.py -> build-3/lib/sympy/vector copying sympy/vector/orienters.py -> build-3/lib/sympy/vector copying sympy/vector/parametricregion.py -> build-3/lib/sympy/vector copying sympy/vector/point.py -> build-3/lib/sympy/vector copying sympy/vector/scalar.py -> build-3/lib/sympy/vector copying sympy/vector/vector.py -> build-3/lib/sympy/vector creating build-3/lib/sympy/algebras/tests copying sympy/algebras/tests/__init__.py -> build-3/lib/sympy/algebras/tests copying sympy/algebras/tests/test_quaternion.py -> build-3/lib/sympy/algebras/tests creating build-3/lib/sympy/assumptions/tests copying sympy/assumptions/tests/__init__.py -> build-3/lib/sympy/assumptions/tests copying sympy/assumptions/tests/test_assumptions_2.py -> build-3/lib/sympy/assumptions/tests copying sympy/assumptions/tests/test_context.py -> build-3/lib/sympy/assumptions/tests copying sympy/assumptions/tests/test_matrices.py -> build-3/lib/sympy/assumptions/tests copying sympy/assumptions/tests/test_query.py -> build-3/lib/sympy/assumptions/tests copying sympy/assumptions/tests/test_refine.py -> build-3/lib/sympy/assumptions/tests copying sympy/assumptions/tests/test_satask.py -> build-3/lib/sympy/assumptions/tests copying sympy/assumptions/tests/test_sathandlers.py -> build-3/lib/sympy/assumptions/tests creating build-3/lib/sympy/calculus/tests copying sympy/calculus/tests/__init__.py -> build-3/lib/sympy/calculus/tests copying sympy/calculus/tests/test_euler.py -> build-3/lib/sympy/calculus/tests copying sympy/calculus/tests/test_finite_diff.py -> build-3/lib/sympy/calculus/tests copying sympy/calculus/tests/test_singularities.py -> build-3/lib/sympy/calculus/tests copying sympy/calculus/tests/test_util.py -> build-3/lib/sympy/calculus/tests creating build-3/lib/sympy/categories/tests copying sympy/categories/tests/__init__.py -> build-3/lib/sympy/categories/tests copying sympy/categories/tests/test_baseclasses.py -> build-3/lib/sympy/categories/tests copying sympy/categories/tests/test_drawing.py -> build-3/lib/sympy/categories/tests creating build-3/lib/sympy/codegen/tests copying sympy/codegen/tests/__init__.py -> build-3/lib/sympy/codegen/tests copying sympy/codegen/tests/test_algorithms.py -> build-3/lib/sympy/codegen/tests copying sympy/codegen/tests/test_applications.py -> build-3/lib/sympy/codegen/tests copying sympy/codegen/tests/test_approximations.py -> build-3/lib/sympy/codegen/tests copying sympy/codegen/tests/test_array_utils.py -> build-3/lib/sympy/codegen/tests copying sympy/codegen/tests/test_ast.py -> build-3/lib/sympy/codegen/tests copying sympy/codegen/tests/test_cfunctions.py -> build-3/lib/sympy/codegen/tests copying sympy/codegen/tests/test_cnodes.py -> build-3/lib/sympy/codegen/tests copying sympy/codegen/tests/test_cxxnodes.py -> build-3/lib/sympy/codegen/tests copying sympy/codegen/tests/test_fnodes.py -> build-3/lib/sympy/codegen/tests copying sympy/codegen/tests/test_numpy_nodes.py -> build-3/lib/sympy/codegen/tests copying sympy/codegen/tests/test_pyutils.py -> build-3/lib/sympy/codegen/tests copying sympy/codegen/tests/test_rewriting.py -> build-3/lib/sympy/codegen/tests copying sympy/codegen/tests/test_scipy_nodes.py -> build-3/lib/sympy/codegen/tests creating build-3/lib/sympy/combinatorics/tests copying sympy/combinatorics/tests/__init__.py -> build-3/lib/sympy/combinatorics/tests copying sympy/combinatorics/tests/test_coset_table.py -> build-3/lib/sympy/combinatorics/tests copying sympy/combinatorics/tests/test_fp_groups.py -> build-3/lib/sympy/combinatorics/tests copying sympy/combinatorics/tests/test_free_groups.py -> build-3/lib/sympy/combinatorics/tests copying sympy/combinatorics/tests/test_generators.py -> build-3/lib/sympy/combinatorics/tests copying sympy/combinatorics/tests/test_graycode.py -> build-3/lib/sympy/combinatorics/tests copying sympy/combinatorics/tests/test_group_constructs.py -> build-3/lib/sympy/combinatorics/tests copying sympy/combinatorics/tests/test_homomorphisms.py -> build-3/lib/sympy/combinatorics/tests copying sympy/combinatorics/tests/test_named_groups.py -> build-3/lib/sympy/combinatorics/tests copying sympy/combinatorics/tests/test_partitions.py -> build-3/lib/sympy/combinatorics/tests copying sympy/combinatorics/tests/test_pc_groups.py -> build-3/lib/sympy/combinatorics/tests copying sympy/combinatorics/tests/test_perm_groups.py -> build-3/lib/sympy/combinatorics/tests copying sympy/combinatorics/tests/test_permutations.py -> build-3/lib/sympy/combinatorics/tests copying sympy/combinatorics/tests/test_polyhedron.py -> build-3/lib/sympy/combinatorics/tests copying sympy/combinatorics/tests/test_prufer.py -> build-3/lib/sympy/combinatorics/tests copying sympy/combinatorics/tests/test_rewriting.py -> build-3/lib/sympy/combinatorics/tests copying sympy/combinatorics/tests/test_schur_number.py -> build-3/lib/sympy/combinatorics/tests copying sympy/combinatorics/tests/test_subsets.py -> build-3/lib/sympy/combinatorics/tests copying sympy/combinatorics/tests/test_tensor_can.py -> build-3/lib/sympy/combinatorics/tests copying sympy/combinatorics/tests/test_testutil.py -> build-3/lib/sympy/combinatorics/tests copying sympy/combinatorics/tests/test_util.py -> build-3/lib/sympy/combinatorics/tests creating build-3/lib/sympy/concrete/tests copying sympy/concrete/tests/__init__.py -> build-3/lib/sympy/concrete/tests copying sympy/concrete/tests/test_delta.py -> build-3/lib/sympy/concrete/tests copying sympy/concrete/tests/test_gosper.py -> build-3/lib/sympy/concrete/tests copying sympy/concrete/tests/test_guess.py -> build-3/lib/sympy/concrete/tests copying sympy/concrete/tests/test_products.py -> build-3/lib/sympy/concrete/tests copying sympy/concrete/tests/test_sums_products.py -> build-3/lib/sympy/concrete/tests creating build-3/lib/sympy/core/tests copying sympy/core/tests/__init__.py -> build-3/lib/sympy/core/tests copying sympy/core/tests/test_args.py -> build-3/lib/sympy/core/tests copying sympy/core/tests/test_arit.py -> build-3/lib/sympy/core/tests copying sympy/core/tests/test_assumptions.py -> build-3/lib/sympy/core/tests copying sympy/core/tests/test_basic.py -> build-3/lib/sympy/core/tests copying sympy/core/tests/test_cache.py -> build-3/lib/sympy/core/tests copying sympy/core/tests/test_compatibility.py -> build-3/lib/sympy/core/tests copying sympy/core/tests/test_complex.py -> build-3/lib/sympy/core/tests copying sympy/core/tests/test_constructor_postprocessor.py -> build-3/lib/sympy/core/tests copying sympy/core/tests/test_containers.py -> build-3/lib/sympy/core/tests copying sympy/core/tests/test_count_ops.py -> build-3/lib/sympy/core/tests copying sympy/core/tests/test_diff.py -> build-3/lib/sympy/core/tests copying sympy/core/tests/test_equal.py -> build-3/lib/sympy/core/tests copying sympy/core/tests/test_eval.py -> build-3/lib/sympy/core/tests copying sympy/core/tests/test_evalf.py -> build-3/lib/sympy/core/tests copying sympy/core/tests/test_expand.py -> build-3/lib/sympy/core/tests copying sympy/core/tests/test_expr.py -> build-3/lib/sympy/core/tests copying sympy/core/tests/test_exprtools.py -> build-3/lib/sympy/core/tests copying sympy/core/tests/test_facts.py -> build-3/lib/sympy/core/tests copying sympy/core/tests/test_function.py -> build-3/lib/sympy/core/tests copying sympy/core/tests/test_logic.py -> build-3/lib/sympy/core/tests copying sympy/core/tests/test_match.py -> build-3/lib/sympy/core/tests copying sympy/core/tests/test_multidimensional.py -> build-3/lib/sympy/core/tests copying sympy/core/tests/test_noncommutative.py -> build-3/lib/sympy/core/tests copying sympy/core/tests/test_numbers.py -> build-3/lib/sympy/core/tests copying sympy/core/tests/test_operations.py -> build-3/lib/sympy/core/tests copying sympy/core/tests/test_parameters.py -> build-3/lib/sympy/core/tests copying sympy/core/tests/test_power.py -> build-3/lib/sympy/core/tests copying sympy/core/tests/test_priority.py -> build-3/lib/sympy/core/tests copying sympy/core/tests/test_relational.py -> build-3/lib/sympy/core/tests copying sympy/core/tests/test_rules.py -> build-3/lib/sympy/core/tests copying sympy/core/tests/test_singleton.py -> build-3/lib/sympy/core/tests copying sympy/core/tests/test_subs.py -> build-3/lib/sympy/core/tests copying sympy/core/tests/test_symbol.py -> build-3/lib/sympy/core/tests copying sympy/core/tests/test_sympify.py -> build-3/lib/sympy/core/tests copying sympy/core/tests/test_trace.py -> build-3/lib/sympy/core/tests copying sympy/core/tests/test_truediv.py -> build-3/lib/sympy/core/tests copying sympy/core/tests/test_var.py -> build-3/lib/sympy/core/tests creating build-3/lib/sympy/crypto/tests copying sympy/crypto/tests/__init__.py -> build-3/lib/sympy/crypto/tests copying sympy/crypto/tests/test_crypto.py -> build-3/lib/sympy/crypto/tests creating build-3/lib/sympy/deprecated/tests copying sympy/deprecated/tests/__init__.py -> build-3/lib/sympy/deprecated/tests copying sympy/deprecated/tests/test_class_registry.py -> build-3/lib/sympy/deprecated/tests creating build-3/lib/sympy/diffgeom/tests copying sympy/diffgeom/tests/__init__.py -> build-3/lib/sympy/diffgeom/tests copying sympy/diffgeom/tests/test_class_structure.py -> build-3/lib/sympy/diffgeom/tests copying sympy/diffgeom/tests/test_diffgeom.py -> build-3/lib/sympy/diffgeom/tests copying sympy/diffgeom/tests/test_function_diffgeom_book.py -> build-3/lib/sympy/diffgeom/tests copying sympy/diffgeom/tests/test_hyperbolic_space.py -> build-3/lib/sympy/diffgeom/tests creating build-3/lib/sympy/discrete/tests copying sympy/discrete/tests/__init__.py -> build-3/lib/sympy/discrete/tests copying sympy/discrete/tests/test_convolutions.py -> build-3/lib/sympy/discrete/tests copying sympy/discrete/tests/test_recurrences.py -> build-3/lib/sympy/discrete/tests copying sympy/discrete/tests/test_transforms.py -> build-3/lib/sympy/discrete/tests creating build-3/lib/sympy/external/tests copying sympy/external/tests/__init__.py -> build-3/lib/sympy/external/tests copying sympy/external/tests/test_autowrap.py -> build-3/lib/sympy/external/tests copying sympy/external/tests/test_codegen.py -> build-3/lib/sympy/external/tests copying sympy/external/tests/test_importtools.py -> build-3/lib/sympy/external/tests copying sympy/external/tests/test_numpy.py -> build-3/lib/sympy/external/tests copying sympy/external/tests/test_sage.py -> build-3/lib/sympy/external/tests copying sympy/external/tests/test_scipy.py -> build-3/lib/sympy/external/tests creating build-3/lib/sympy/functions/combinatorial/tests copying sympy/functions/combinatorial/tests/__init__.py -> build-3/lib/sympy/functions/combinatorial/tests copying sympy/functions/combinatorial/tests/test_comb_factorials.py -> build-3/lib/sympy/functions/combinatorial/tests copying sympy/functions/combinatorial/tests/test_comb_numbers.py -> build-3/lib/sympy/functions/combinatorial/tests creating build-3/lib/sympy/functions/elementary/tests copying sympy/functions/elementary/tests/__init__.py -> build-3/lib/sympy/functions/elementary/tests copying sympy/functions/elementary/tests/test_complexes.py -> build-3/lib/sympy/functions/elementary/tests copying sympy/functions/elementary/tests/test_exponential.py -> build-3/lib/sympy/functions/elementary/tests copying sympy/functions/elementary/tests/test_hyperbolic.py -> build-3/lib/sympy/functions/elementary/tests copying sympy/functions/elementary/tests/test_integers.py -> build-3/lib/sympy/functions/elementary/tests copying sympy/functions/elementary/tests/test_interface.py -> build-3/lib/sympy/functions/elementary/tests copying sympy/functions/elementary/tests/test_miscellaneous.py -> build-3/lib/sympy/functions/elementary/tests copying sympy/functions/elementary/tests/test_piecewise.py -> build-3/lib/sympy/functions/elementary/tests copying sympy/functions/elementary/tests/test_trigonometric.py -> build-3/lib/sympy/functions/elementary/tests creating build-3/lib/sympy/functions/special/tests copying sympy/functions/special/tests/__init__.py -> build-3/lib/sympy/functions/special/tests copying sympy/functions/special/tests/test_bessel.py -> build-3/lib/sympy/functions/special/tests copying sympy/functions/special/tests/test_beta_functions.py -> build-3/lib/sympy/functions/special/tests copying sympy/functions/special/tests/test_bsplines.py -> build-3/lib/sympy/functions/special/tests copying sympy/functions/special/tests/test_delta_functions.py -> build-3/lib/sympy/functions/special/tests copying sympy/functions/special/tests/test_elliptic_integrals.py -> build-3/lib/sympy/functions/special/tests copying sympy/functions/special/tests/test_error_functions.py -> build-3/lib/sympy/functions/special/tests copying sympy/functions/special/tests/test_gamma_functions.py -> build-3/lib/sympy/functions/special/tests copying sympy/functions/special/tests/test_hyper.py -> build-3/lib/sympy/functions/special/tests copying sympy/functions/special/tests/test_mathieu.py -> build-3/lib/sympy/functions/special/tests copying sympy/functions/special/tests/test_singularity_functions.py -> build-3/lib/sympy/functions/special/tests copying sympy/functions/special/tests/test_spec_polynomials.py -> build-3/lib/sympy/functions/special/tests copying sympy/functions/special/tests/test_spherical_harmonics.py -> build-3/lib/sympy/functions/special/tests copying sympy/functions/special/tests/test_tensor_functions.py -> build-3/lib/sympy/functions/special/tests copying sympy/functions/special/tests/test_zeta_functions.py -> build-3/lib/sympy/functions/special/tests creating build-3/lib/sympy/geometry/tests copying sympy/geometry/tests/__init__.py -> build-3/lib/sympy/geometry/tests copying sympy/geometry/tests/test_curve.py -> build-3/lib/sympy/geometry/tests copying sympy/geometry/tests/test_ellipse.py -> build-3/lib/sympy/geometry/tests copying sympy/geometry/tests/test_entity.py -> build-3/lib/sympy/geometry/tests copying sympy/geometry/tests/test_geometrysets.py -> build-3/lib/sympy/geometry/tests copying sympy/geometry/tests/test_line.py -> build-3/lib/sympy/geometry/tests copying sympy/geometry/tests/test_parabola.py -> build-3/lib/sympy/geometry/tests copying sympy/geometry/tests/test_plane.py -> build-3/lib/sympy/geometry/tests copying sympy/geometry/tests/test_point.py -> build-3/lib/sympy/geometry/tests copying sympy/geometry/tests/test_polygon.py -> build-3/lib/sympy/geometry/tests copying sympy/geometry/tests/test_util.py -> build-3/lib/sympy/geometry/tests creating build-3/lib/sympy/holonomic/tests copying sympy/holonomic/tests/__init__.py -> build-3/lib/sympy/holonomic/tests copying sympy/holonomic/tests/test_holonomic.py -> build-3/lib/sympy/holonomic/tests copying sympy/holonomic/tests/test_recurrence.py -> build-3/lib/sympy/holonomic/tests creating build-3/lib/sympy/integrals/rubi/parsetools/tests copying sympy/integrals/rubi/parsetools/tests/__init__.py -> build-3/lib/sympy/integrals/rubi/parsetools/tests copying sympy/integrals/rubi/parsetools/tests/test_parse.py -> build-3/lib/sympy/integrals/rubi/parsetools/tests creating build-3/lib/sympy/integrals/rubi/rubi_tests/tests copying sympy/integrals/rubi/rubi_tests/tests/__init__.py -> build-3/lib/sympy/integrals/rubi/rubi_tests/tests copying sympy/integrals/rubi/rubi_tests/tests/test_1_2.py -> build-3/lib/sympy/integrals/rubi/rubi_tests/tests copying sympy/integrals/rubi/rubi_tests/tests/test_1_3.py -> build-3/lib/sympy/integrals/rubi/rubi_tests/tests copying sympy/integrals/rubi/rubi_tests/tests/test_1_4.py -> build-3/lib/sympy/integrals/rubi/rubi_tests/tests copying sympy/integrals/rubi/rubi_tests/tests/test_exponential.py -> build-3/lib/sympy/integrals/rubi/rubi_tests/tests copying sympy/integrals/rubi/rubi_tests/tests/test_hyperbolic_sine.py -> build-3/lib/sympy/integrals/rubi/rubi_tests/tests copying sympy/integrals/rubi/rubi_tests/tests/test_inverse_hyperbolic_sine.py -> build-3/lib/sympy/integrals/rubi/rubi_tests/tests copying sympy/integrals/rubi/rubi_tests/tests/test_inverse_sine.py -> build-3/lib/sympy/integrals/rubi/rubi_tests/tests copying sympy/integrals/rubi/rubi_tests/tests/test_logarithms.py -> build-3/lib/sympy/integrals/rubi/rubi_tests/tests copying sympy/integrals/rubi/rubi_tests/tests/test_miscellaneous_algebra.py -> build-3/lib/sympy/integrals/rubi/rubi_tests/tests copying sympy/integrals/rubi/rubi_tests/tests/test_secant.py -> build-3/lib/sympy/integrals/rubi/rubi_tests/tests copying sympy/integrals/rubi/rubi_tests/tests/test_sine.py -> build-3/lib/sympy/integrals/rubi/rubi_tests/tests copying sympy/integrals/rubi/rubi_tests/tests/test_special_functions.py -> build-3/lib/sympy/integrals/rubi/rubi_tests/tests copying sympy/integrals/rubi/rubi_tests/tests/test_tangent.py -> build-3/lib/sympy/integrals/rubi/rubi_tests/tests copying sympy/integrals/rubi/rubi_tests/tests/test_trinomials.py -> build-3/lib/sympy/integrals/rubi/rubi_tests/tests creating build-3/lib/sympy/integrals/rubi/tests copying sympy/integrals/rubi/tests/__init__.py -> build-3/lib/sympy/integrals/rubi/tests copying sympy/integrals/rubi/tests/test_rubi_integrate.py -> build-3/lib/sympy/integrals/rubi/tests copying sympy/integrals/rubi/tests/test_utility_function.py -> build-3/lib/sympy/integrals/rubi/tests creating build-3/lib/sympy/integrals/tests copying sympy/integrals/tests/__init__.py -> build-3/lib/sympy/integrals/tests copying sympy/integrals/tests/test_deltafunctions.py -> build-3/lib/sympy/integrals/tests copying sympy/integrals/tests/test_failing_integrals.py -> build-3/lib/sympy/integrals/tests copying sympy/integrals/tests/test_heurisch.py -> build-3/lib/sympy/integrals/tests copying sympy/integrals/tests/test_integrals.py -> build-3/lib/sympy/integrals/tests copying sympy/integrals/tests/test_intpoly.py -> build-3/lib/sympy/integrals/tests copying sympy/integrals/tests/test_lineintegrals.py -> build-3/lib/sympy/integrals/tests copying sympy/integrals/tests/test_manual.py -> build-3/lib/sympy/integrals/tests copying sympy/integrals/tests/test_meijerint.py -> build-3/lib/sympy/integrals/tests copying sympy/integrals/tests/test_prde.py -> build-3/lib/sympy/integrals/tests copying sympy/integrals/tests/test_quadrature.py -> build-3/lib/sympy/integrals/tests copying sympy/integrals/tests/test_rationaltools.py -> build-3/lib/sympy/integrals/tests copying sympy/integrals/tests/test_rde.py -> build-3/lib/sympy/integrals/tests copying sympy/integrals/tests/test_risch.py -> build-3/lib/sympy/integrals/tests copying sympy/integrals/tests/test_singularityfunctions.py -> build-3/lib/sympy/integrals/tests copying sympy/integrals/tests/test_transforms.py -> build-3/lib/sympy/integrals/tests copying sympy/integrals/tests/test_trigonometry.py -> build-3/lib/sympy/integrals/tests creating build-3/lib/sympy/interactive/tests copying sympy/interactive/tests/__init__.py -> build-3/lib/sympy/interactive/tests copying sympy/interactive/tests/test_interactive.py -> build-3/lib/sympy/interactive/tests copying sympy/interactive/tests/test_ipython.py -> build-3/lib/sympy/interactive/tests copying sympy/interactive/tests/test_ipythonprinting.py -> build-3/lib/sympy/interactive/tests creating build-3/lib/sympy/liealgebras/tests copying sympy/liealgebras/tests/__init__.py -> build-3/lib/sympy/liealgebras/tests copying sympy/liealgebras/tests/test_cartan_matrix.py -> build-3/lib/sympy/liealgebras/tests copying sympy/liealgebras/tests/test_cartan_type.py -> build-3/lib/sympy/liealgebras/tests copying sympy/liealgebras/tests/test_dynkin_diagram.py -> build-3/lib/sympy/liealgebras/tests copying sympy/liealgebras/tests/test_root_system.py -> build-3/lib/sympy/liealgebras/tests copying sympy/liealgebras/tests/test_type_A.py -> build-3/lib/sympy/liealgebras/tests copying sympy/liealgebras/tests/test_type_B.py -> build-3/lib/sympy/liealgebras/tests copying sympy/liealgebras/tests/test_type_C.py -> build-3/lib/sympy/liealgebras/tests copying sympy/liealgebras/tests/test_type_D.py -> build-3/lib/sympy/liealgebras/tests copying sympy/liealgebras/tests/test_type_E.py -> build-3/lib/sympy/liealgebras/tests copying sympy/liealgebras/tests/test_type_F.py -> build-3/lib/sympy/liealgebras/tests copying sympy/liealgebras/tests/test_type_G.py -> build-3/lib/sympy/liealgebras/tests copying sympy/liealgebras/tests/test_weyl_group.py -> build-3/lib/sympy/liealgebras/tests creating build-3/lib/sympy/logic/tests copying sympy/logic/tests/__init__.py -> build-3/lib/sympy/logic/tests copying sympy/logic/tests/test_boolalg.py -> build-3/lib/sympy/logic/tests copying sympy/logic/tests/test_dimacs.py -> build-3/lib/sympy/logic/tests copying sympy/logic/tests/test_inference.py -> build-3/lib/sympy/logic/tests creating build-3/lib/sympy/matrices/expressions/tests copying sympy/matrices/expressions/tests/__init__.py -> build-3/lib/sympy/matrices/expressions/tests copying sympy/matrices/expressions/tests/test_adjoint.py -> build-3/lib/sympy/matrices/expressions/tests copying sympy/matrices/expressions/tests/test_applyfunc.py -> build-3/lib/sympy/matrices/expressions/tests copying sympy/matrices/expressions/tests/test_blockmatrix.py -> build-3/lib/sympy/matrices/expressions/tests copying sympy/matrices/expressions/tests/test_companion.py -> build-3/lib/sympy/matrices/expressions/tests copying sympy/matrices/expressions/tests/test_derivatives.py -> build-3/lib/sympy/matrices/expressions/tests copying sympy/matrices/expressions/tests/test_determinant.py -> build-3/lib/sympy/matrices/expressions/tests copying sympy/matrices/expressions/tests/test_diagonal.py -> build-3/lib/sympy/matrices/expressions/tests copying sympy/matrices/expressions/tests/test_dotproduct.py -> build-3/lib/sympy/matrices/expressions/tests copying sympy/matrices/expressions/tests/test_factorizations.py -> build-3/lib/sympy/matrices/expressions/tests copying sympy/matrices/expressions/tests/test_fourier.py -> build-3/lib/sympy/matrices/expressions/tests copying sympy/matrices/expressions/tests/test_funcmatrix.py -> build-3/lib/sympy/matrices/expressions/tests copying sympy/matrices/expressions/tests/test_hadamard.py -> build-3/lib/sympy/matrices/expressions/tests copying sympy/matrices/expressions/tests/test_indexing.py -> build-3/lib/sympy/matrices/expressions/tests copying sympy/matrices/expressions/tests/test_inverse.py -> build-3/lib/sympy/matrices/expressions/tests copying sympy/matrices/expressions/tests/test_kronecker.py -> build-3/lib/sympy/matrices/expressions/tests copying sympy/matrices/expressions/tests/test_matadd.py -> build-3/lib/sympy/matrices/expressions/tests copying sympy/matrices/expressions/tests/test_matexpr.py -> build-3/lib/sympy/matrices/expressions/tests copying sympy/matrices/expressions/tests/test_matmul.py -> build-3/lib/sympy/matrices/expressions/tests copying sympy/matrices/expressions/tests/test_matpow.py -> build-3/lib/sympy/matrices/expressions/tests copying sympy/matrices/expressions/tests/test_permutation.py -> build-3/lib/sympy/matrices/expressions/tests copying sympy/matrices/expressions/tests/test_sets.py -> build-3/lib/sympy/matrices/expressions/tests copying sympy/matrices/expressions/tests/test_slice.py -> build-3/lib/sympy/matrices/expressions/tests copying sympy/matrices/expressions/tests/test_special.py -> build-3/lib/sympy/matrices/expressions/tests copying sympy/matrices/expressions/tests/test_trace.py -> build-3/lib/sympy/matrices/expressions/tests copying sympy/matrices/expressions/tests/test_transpose.py -> build-3/lib/sympy/matrices/expressions/tests creating build-3/lib/sympy/matrices/tests copying sympy/matrices/tests/__init__.py -> build-3/lib/sympy/matrices/tests copying sympy/matrices/tests/test_commonmatrix.py -> build-3/lib/sympy/matrices/tests copying sympy/matrices/tests/test_decompositions.py -> build-3/lib/sympy/matrices/tests copying sympy/matrices/tests/test_densearith.py -> build-3/lib/sympy/matrices/tests copying sympy/matrices/tests/test_densesolve.py -> build-3/lib/sympy/matrices/tests copying sympy/matrices/tests/test_densetools.py -> build-3/lib/sympy/matrices/tests copying sympy/matrices/tests/test_determinant.py -> build-3/lib/sympy/matrices/tests copying sympy/matrices/tests/test_eigen.py -> build-3/lib/sympy/matrices/tests copying sympy/matrices/tests/test_graph.py -> build-3/lib/sympy/matrices/tests copying sympy/matrices/tests/test_immutable.py -> build-3/lib/sympy/matrices/tests copying sympy/matrices/tests/test_interactions.py -> build-3/lib/sympy/matrices/tests copying sympy/matrices/tests/test_matrices.py -> build-3/lib/sympy/matrices/tests copying sympy/matrices/tests/test_normalforms.py -> build-3/lib/sympy/matrices/tests copying sympy/matrices/tests/test_reductions.py -> build-3/lib/sympy/matrices/tests copying sympy/matrices/tests/test_solvers.py -> build-3/lib/sympy/matrices/tests copying sympy/matrices/tests/test_sparse.py -> build-3/lib/sympy/matrices/tests copying sympy/matrices/tests/test_sparsetools.py -> build-3/lib/sympy/matrices/tests copying sympy/matrices/tests/test_subspaces.py -> build-3/lib/sympy/matrices/tests creating build-3/lib/sympy/multipledispatch/tests copying sympy/multipledispatch/tests/__init__.py -> build-3/lib/sympy/multipledispatch/tests copying sympy/multipledispatch/tests/test_conflict.py -> build-3/lib/sympy/multipledispatch/tests copying sympy/multipledispatch/tests/test_core.py -> build-3/lib/sympy/multipledispatch/tests copying sympy/multipledispatch/tests/test_dispatcher.py -> build-3/lib/sympy/multipledispatch/tests creating build-3/lib/sympy/ntheory/tests copying sympy/ntheory/tests/__init__.py -> build-3/lib/sympy/ntheory/tests copying sympy/ntheory/tests/test_bbp_pi.py -> build-3/lib/sympy/ntheory/tests copying sympy/ntheory/tests/test_continued_fraction.py -> build-3/lib/sympy/ntheory/tests copying sympy/ntheory/tests/test_digits.py -> build-3/lib/sympy/ntheory/tests copying sympy/ntheory/tests/test_ecm.py -> build-3/lib/sympy/ntheory/tests copying sympy/ntheory/tests/test_egyptian_fraction.py -> build-3/lib/sympy/ntheory/tests copying sympy/ntheory/tests/test_elliptic_curve.py -> build-3/lib/sympy/ntheory/tests copying sympy/ntheory/tests/test_factor_.py -> build-3/lib/sympy/ntheory/tests copying sympy/ntheory/tests/test_generate.py -> build-3/lib/sympy/ntheory/tests copying sympy/ntheory/tests/test_modular.py -> build-3/lib/sympy/ntheory/tests copying sympy/ntheory/tests/test_multinomial.py -> build-3/lib/sympy/ntheory/tests copying sympy/ntheory/tests/test_partitions.py -> build-3/lib/sympy/ntheory/tests copying sympy/ntheory/tests/test_primetest.py -> build-3/lib/sympy/ntheory/tests copying sympy/ntheory/tests/test_qs.py -> build-3/lib/sympy/ntheory/tests copying sympy/ntheory/tests/test_residue.py -> build-3/lib/sympy/ntheory/tests creating build-3/lib/sympy/parsing/tests copying sympy/parsing/tests/__init__.py -> build-3/lib/sympy/parsing/tests copying sympy/parsing/tests/test_ast_parser.py -> build-3/lib/sympy/parsing/tests copying sympy/parsing/tests/test_autolev.py -> build-3/lib/sympy/parsing/tests copying sympy/parsing/tests/test_c_parser.py -> build-3/lib/sympy/parsing/tests copying sympy/parsing/tests/test_fortran_parser.py -> build-3/lib/sympy/parsing/tests copying sympy/parsing/tests/test_implicit_multiplication_application.py -> build-3/lib/sympy/parsing/tests copying sympy/parsing/tests/test_latex.py -> build-3/lib/sympy/parsing/tests copying sympy/parsing/tests/test_latex_deps.py -> build-3/lib/sympy/parsing/tests copying sympy/parsing/tests/test_mathematica.py -> build-3/lib/sympy/parsing/tests copying sympy/parsing/tests/test_maxima.py -> build-3/lib/sympy/parsing/tests copying sympy/parsing/tests/test_sym_expr.py -> build-3/lib/sympy/parsing/tests copying sympy/parsing/tests/test_sympy_parser.py -> build-3/lib/sympy/parsing/tests creating build-3/lib/sympy/physics/continuum_mechanics/tests copying sympy/physics/continuum_mechanics/tests/__init__.py -> build-3/lib/sympy/physics/continuum_mechanics/tests copying sympy/physics/continuum_mechanics/tests/test_beam.py -> build-3/lib/sympy/physics/continuum_mechanics/tests creating build-3/lib/sympy/physics/control/tests copying sympy/physics/control/tests/__init__.py -> build-3/lib/sympy/physics/control/tests copying sympy/physics/control/tests/test_lti.py -> build-3/lib/sympy/physics/control/tests creating build-3/lib/sympy/physics/hep/tests copying sympy/physics/hep/tests/__init__.py -> build-3/lib/sympy/physics/hep/tests copying sympy/physics/hep/tests/test_gamma_matrices.py -> build-3/lib/sympy/physics/hep/tests creating build-3/lib/sympy/physics/mechanics/tests copying sympy/physics/mechanics/tests/__init__.py -> build-3/lib/sympy/physics/mechanics/tests copying sympy/physics/mechanics/tests/test_body.py -> build-3/lib/sympy/physics/mechanics/tests copying sympy/physics/mechanics/tests/test_functions.py -> build-3/lib/sympy/physics/mechanics/tests copying sympy/physics/mechanics/tests/test_kane.py -> build-3/lib/sympy/physics/mechanics/tests copying sympy/physics/mechanics/tests/test_kane2.py -> build-3/lib/sympy/physics/mechanics/tests copying sympy/physics/mechanics/tests/test_kane3.py -> build-3/lib/sympy/physics/mechanics/tests copying sympy/physics/mechanics/tests/test_kane4.py -> build-3/lib/sympy/physics/mechanics/tests copying sympy/physics/mechanics/tests/test_lagrange.py -> build-3/lib/sympy/physics/mechanics/tests copying sympy/physics/mechanics/tests/test_lagrange2.py -> build-3/lib/sympy/physics/mechanics/tests copying sympy/physics/mechanics/tests/test_linearize.py -> build-3/lib/sympy/physics/mechanics/tests copying sympy/physics/mechanics/tests/test_models.py -> build-3/lib/sympy/physics/mechanics/tests copying sympy/physics/mechanics/tests/test_particle.py -> build-3/lib/sympy/physics/mechanics/tests copying sympy/physics/mechanics/tests/test_rigidbody.py -> build-3/lib/sympy/physics/mechanics/tests copying sympy/physics/mechanics/tests/test_system.py -> build-3/lib/sympy/physics/mechanics/tests creating build-3/lib/sympy/physics/optics/tests copying sympy/physics/optics/tests/__init__.py -> build-3/lib/sympy/physics/optics/tests copying sympy/physics/optics/tests/test_gaussopt.py -> build-3/lib/sympy/physics/optics/tests copying sympy/physics/optics/tests/test_medium.py -> build-3/lib/sympy/physics/optics/tests copying sympy/physics/optics/tests/test_polarization.py -> build-3/lib/sympy/physics/optics/tests copying sympy/physics/optics/tests/test_utils.py -> build-3/lib/sympy/physics/optics/tests copying sympy/physics/optics/tests/test_waves.py -> build-3/lib/sympy/physics/optics/tests creating build-3/lib/sympy/physics/quantum/tests copying sympy/physics/quantum/tests/__init__.py -> build-3/lib/sympy/physics/quantum/tests copying sympy/physics/quantum/tests/test_anticommutator.py -> build-3/lib/sympy/physics/quantum/tests copying sympy/physics/quantum/tests/test_boson.py -> build-3/lib/sympy/physics/quantum/tests copying sympy/physics/quantum/tests/test_cartesian.py -> build-3/lib/sympy/physics/quantum/tests copying sympy/physics/quantum/tests/test_cg.py -> build-3/lib/sympy/physics/quantum/tests copying sympy/physics/quantum/tests/test_circuitplot.py -> build-3/lib/sympy/physics/quantum/tests copying sympy/physics/quantum/tests/test_circuitutils.py -> build-3/lib/sympy/physics/quantum/tests copying sympy/physics/quantum/tests/test_commutator.py -> build-3/lib/sympy/physics/quantum/tests copying sympy/physics/quantum/tests/test_constants.py -> build-3/lib/sympy/physics/quantum/tests copying sympy/physics/quantum/tests/test_dagger.py -> build-3/lib/sympy/physics/quantum/tests copying sympy/physics/quantum/tests/test_density.py -> build-3/lib/sympy/physics/quantum/tests copying sympy/physics/quantum/tests/test_fermion.py -> build-3/lib/sympy/physics/quantum/tests copying sympy/physics/quantum/tests/test_gate.py -> build-3/lib/sympy/physics/quantum/tests copying sympy/physics/quantum/tests/test_grover.py -> build-3/lib/sympy/physics/quantum/tests copying sympy/physics/quantum/tests/test_hilbert.py -> build-3/lib/sympy/physics/quantum/tests copying sympy/physics/quantum/tests/test_identitysearch.py -> build-3/lib/sympy/physics/quantum/tests copying sympy/physics/quantum/tests/test_innerproduct.py -> build-3/lib/sympy/physics/quantum/tests copying sympy/physics/quantum/tests/test_matrixutils.py -> build-3/lib/sympy/physics/quantum/tests copying sympy/physics/quantum/tests/test_operator.py -> build-3/lib/sympy/physics/quantum/tests copying sympy/physics/quantum/tests/test_operatorordering.py -> build-3/lib/sympy/physics/quantum/tests copying sympy/physics/quantum/tests/test_operatorset.py -> build-3/lib/sympy/physics/quantum/tests copying sympy/physics/quantum/tests/test_pauli.py -> build-3/lib/sympy/physics/quantum/tests copying sympy/physics/quantum/tests/test_piab.py -> build-3/lib/sympy/physics/quantum/tests copying sympy/physics/quantum/tests/test_printing.py -> build-3/lib/sympy/physics/quantum/tests copying sympy/physics/quantum/tests/test_qapply.py -> build-3/lib/sympy/physics/quantum/tests copying sympy/physics/quantum/tests/test_qasm.py -> build-3/lib/sympy/physics/quantum/tests copying sympy/physics/quantum/tests/test_qexpr.py -> build-3/lib/sympy/physics/quantum/tests copying sympy/physics/quantum/tests/test_qft.py -> build-3/lib/sympy/physics/quantum/tests copying sympy/physics/quantum/tests/test_qubit.py -> build-3/lib/sympy/physics/quantum/tests copying sympy/physics/quantum/tests/test_represent.py -> build-3/lib/sympy/physics/quantum/tests copying sympy/physics/quantum/tests/test_sho1d.py -> build-3/lib/sympy/physics/quantum/tests copying sympy/physics/quantum/tests/test_shor.py -> build-3/lib/sympy/physics/quantum/tests copying sympy/physics/quantum/tests/test_spin.py -> build-3/lib/sympy/physics/quantum/tests copying sympy/physics/quantum/tests/test_state.py -> build-3/lib/sympy/physics/quantum/tests copying sympy/physics/quantum/tests/test_tensorproduct.py -> build-3/lib/sympy/physics/quantum/tests creating build-3/lib/sympy/physics/tests copying sympy/physics/tests/__init__.py -> build-3/lib/sympy/physics/tests copying sympy/physics/tests/test_clebsch_gordan.py -> build-3/lib/sympy/physics/tests copying sympy/physics/tests/test_hydrogen.py -> build-3/lib/sympy/physics/tests copying sympy/physics/tests/test_paulialgebra.py -> build-3/lib/sympy/physics/tests copying sympy/physics/tests/test_physics_matrices.py -> build-3/lib/sympy/physics/tests copying sympy/physics/tests/test_pring.py -> build-3/lib/sympy/physics/tests copying sympy/physics/tests/test_qho_1d.py -> build-3/lib/sympy/physics/tests copying sympy/physics/tests/test_secondquant.py -> build-3/lib/sympy/physics/tests copying sympy/physics/tests/test_sho.py -> build-3/lib/sympy/physics/tests creating build-3/lib/sympy/physics/units/tests copying sympy/physics/units/tests/__init__.py -> build-3/lib/sympy/physics/units/tests copying sympy/physics/units/tests/test_dimensions.py -> build-3/lib/sympy/physics/units/tests copying sympy/physics/units/tests/test_dimensionsystem.py -> build-3/lib/sympy/physics/units/tests copying sympy/physics/units/tests/test_prefixes.py -> build-3/lib/sympy/physics/units/tests copying sympy/physics/units/tests/test_quantities.py -> build-3/lib/sympy/physics/units/tests copying sympy/physics/units/tests/test_unit_system_cgs_gauss.py -> build-3/lib/sympy/physics/units/tests copying sympy/physics/units/tests/test_unitsystem.py -> build-3/lib/sympy/physics/units/tests copying sympy/physics/units/tests/test_util.py -> build-3/lib/sympy/physics/units/tests creating build-3/lib/sympy/physics/vector/tests copying sympy/physics/vector/tests/__init__.py -> build-3/lib/sympy/physics/vector/tests copying sympy/physics/vector/tests/test_dyadic.py -> build-3/lib/sympy/physics/vector/tests copying sympy/physics/vector/tests/test_fieldfunctions.py -> build-3/lib/sympy/physics/vector/tests copying sympy/physics/vector/tests/test_frame.py -> build-3/lib/sympy/physics/vector/tests copying sympy/physics/vector/tests/test_functions.py -> build-3/lib/sympy/physics/vector/tests copying sympy/physics/vector/tests/test_output.py -> build-3/lib/sympy/physics/vector/tests copying sympy/physics/vector/tests/test_point.py -> build-3/lib/sympy/physics/vector/tests copying sympy/physics/vector/tests/test_printing.py -> build-3/lib/sympy/physics/vector/tests copying sympy/physics/vector/tests/test_vector.py -> build-3/lib/sympy/physics/vector/tests creating build-3/lib/sympy/plotting/intervalmath/tests copying sympy/plotting/intervalmath/tests/__init__.py -> build-3/lib/sympy/plotting/intervalmath/tests copying sympy/plotting/intervalmath/tests/test_interval_functions.py -> build-3/lib/sympy/plotting/intervalmath/tests copying sympy/plotting/intervalmath/tests/test_interval_membership.py -> build-3/lib/sympy/plotting/intervalmath/tests copying sympy/plotting/intervalmath/tests/test_intervalmath.py -> build-3/lib/sympy/plotting/intervalmath/tests creating build-3/lib/sympy/plotting/pygletplot/tests copying sympy/plotting/pygletplot/tests/__init__.py -> build-3/lib/sympy/plotting/pygletplot/tests copying sympy/plotting/pygletplot/tests/test_plotting.py -> build-3/lib/sympy/plotting/pygletplot/tests creating build-3/lib/sympy/plotting/tests copying sympy/plotting/tests/__init__.py -> build-3/lib/sympy/plotting/tests copying sympy/plotting/tests/test_experimental_lambdify.py -> build-3/lib/sympy/plotting/tests copying sympy/plotting/tests/test_plot.py -> build-3/lib/sympy/plotting/tests copying sympy/plotting/tests/test_plot_implicit.py -> build-3/lib/sympy/plotting/tests copying sympy/plotting/tests/test_textplot.py -> build-3/lib/sympy/plotting/tests creating build-3/lib/sympy/polys/agca/tests copying sympy/polys/agca/tests/__init__.py -> build-3/lib/sympy/polys/agca/tests copying sympy/polys/agca/tests/test_extensions.py -> build-3/lib/sympy/polys/agca/tests copying sympy/polys/agca/tests/test_homomorphisms.py -> build-3/lib/sympy/polys/agca/tests copying sympy/polys/agca/tests/test_ideals.py -> build-3/lib/sympy/polys/agca/tests copying sympy/polys/agca/tests/test_modules.py -> build-3/lib/sympy/polys/agca/tests creating build-3/lib/sympy/polys/domains/tests copying sympy/polys/domains/tests/__init__.py -> build-3/lib/sympy/polys/domains/tests copying sympy/polys/domains/tests/test_domains.py -> build-3/lib/sympy/polys/domains/tests copying sympy/polys/domains/tests/test_polynomialring.py -> build-3/lib/sympy/polys/domains/tests copying sympy/polys/domains/tests/test_quotientring.py -> build-3/lib/sympy/polys/domains/tests creating build-3/lib/sympy/polys/tests copying sympy/polys/tests/__init__.py -> build-3/lib/sympy/polys/tests copying sympy/polys/tests/test_constructor.py -> build-3/lib/sympy/polys/tests copying sympy/polys/tests/test_densearith.py -> build-3/lib/sympy/polys/tests copying sympy/polys/tests/test_densebasic.py -> build-3/lib/sympy/polys/tests copying sympy/polys/tests/test_densetools.py -> build-3/lib/sympy/polys/tests copying sympy/polys/tests/test_dispersion.py -> build-3/lib/sympy/polys/tests copying sympy/polys/tests/test_distributedmodules.py -> build-3/lib/sympy/polys/tests copying sympy/polys/tests/test_domainmatrix.py -> build-3/lib/sympy/polys/tests copying sympy/polys/tests/test_euclidtools.py -> build-3/lib/sympy/polys/tests copying sympy/polys/tests/test_factortools.py -> build-3/lib/sympy/polys/tests copying sympy/polys/tests/test_fields.py -> build-3/lib/sympy/polys/tests copying sympy/polys/tests/test_galoistools.py -> build-3/lib/sympy/polys/tests copying sympy/polys/tests/test_groebnertools.py -> build-3/lib/sympy/polys/tests copying sympy/polys/tests/test_heuristicgcd.py -> build-3/lib/sympy/polys/tests copying sympy/polys/tests/test_injections.py -> build-3/lib/sympy/polys/tests copying sympy/polys/tests/test_modulargcd.py -> build-3/lib/sympy/polys/tests copying sympy/polys/tests/test_monomials.py -> build-3/lib/sympy/polys/tests copying sympy/polys/tests/test_multivariate_resultants.py -> build-3/lib/sympy/polys/tests copying sympy/polys/tests/test_numberfields.py -> build-3/lib/sympy/polys/tests copying sympy/polys/tests/test_orderings.py -> build-3/lib/sympy/polys/tests copying sympy/polys/tests/test_orthopolys.py -> build-3/lib/sympy/polys/tests copying sympy/polys/tests/test_partfrac.py -> build-3/lib/sympy/polys/tests copying sympy/polys/tests/test_polyclasses.py -> build-3/lib/sympy/polys/tests copying sympy/polys/tests/test_polyfuncs.py -> build-3/lib/sympy/polys/tests copying sympy/polys/tests/test_polymatrix.py -> build-3/lib/sympy/polys/tests copying sympy/polys/tests/test_polyoptions.py -> build-3/lib/sympy/polys/tests copying sympy/polys/tests/test_polyroots.py -> build-3/lib/sympy/polys/tests copying sympy/polys/tests/test_polytools.py -> build-3/lib/sympy/polys/tests copying sympy/polys/tests/test_polyutils.py -> build-3/lib/sympy/polys/tests copying sympy/polys/tests/test_pythonrational.py -> build-3/lib/sympy/polys/tests copying sympy/polys/tests/test_rationaltools.py -> build-3/lib/sympy/polys/tests copying sympy/polys/tests/test_ring_series.py -> build-3/lib/sympy/polys/tests copying sympy/polys/tests/test_rings.py -> build-3/lib/sympy/polys/tests copying sympy/polys/tests/test_rootisolation.py -> build-3/lib/sympy/polys/tests copying sympy/polys/tests/test_rootoftools.py -> build-3/lib/sympy/polys/tests copying sympy/polys/tests/test_solvers.py -> build-3/lib/sympy/polys/tests copying sympy/polys/tests/test_specialpolys.py -> build-3/lib/sympy/polys/tests copying sympy/polys/tests/test_sqfreetools.py -> build-3/lib/sympy/polys/tests copying sympy/polys/tests/test_subresultants_qq_zz.py -> build-3/lib/sympy/polys/tests creating build-3/lib/sympy/printing/pretty/tests copying sympy/printing/pretty/tests/__init__.py -> build-3/lib/sympy/printing/pretty/tests copying sympy/printing/pretty/tests/test_pretty.py -> build-3/lib/sympy/printing/pretty/tests creating build-3/lib/sympy/printing/tests copying sympy/printing/tests/__init__.py -> build-3/lib/sympy/printing/tests copying sympy/printing/tests/test_c.py -> build-3/lib/sympy/printing/tests copying sympy/printing/tests/test_codeprinter.py -> build-3/lib/sympy/printing/tests copying sympy/printing/tests/test_conventions.py -> build-3/lib/sympy/printing/tests copying sympy/printing/tests/test_cxx.py -> build-3/lib/sympy/printing/tests copying sympy/printing/tests/test_dot.py -> build-3/lib/sympy/printing/tests copying sympy/printing/tests/test_fortran.py -> build-3/lib/sympy/printing/tests copying sympy/printing/tests/test_glsl.py -> build-3/lib/sympy/printing/tests copying sympy/printing/tests/test_gtk.py -> build-3/lib/sympy/printing/tests copying sympy/printing/tests/test_jscode.py -> build-3/lib/sympy/printing/tests copying sympy/printing/tests/test_julia.py -> build-3/lib/sympy/printing/tests copying sympy/printing/tests/test_lambdarepr.py -> build-3/lib/sympy/printing/tests copying sympy/printing/tests/test_latex.py -> build-3/lib/sympy/printing/tests copying sympy/printing/tests/test_llvmjit.py -> build-3/lib/sympy/printing/tests copying sympy/printing/tests/test_maple.py -> build-3/lib/sympy/printing/tests copying sympy/printing/tests/test_mathematica.py -> build-3/lib/sympy/printing/tests copying sympy/printing/tests/test_mathml.py -> build-3/lib/sympy/printing/tests copying sympy/printing/tests/test_numpy.py -> build-3/lib/sympy/printing/tests copying sympy/printing/tests/test_octave.py -> build-3/lib/sympy/printing/tests copying sympy/printing/tests/test_precedence.py -> build-3/lib/sympy/printing/tests copying sympy/printing/tests/test_preview.py -> build-3/lib/sympy/printing/tests copying sympy/printing/tests/test_pycode.py -> build-3/lib/sympy/printing/tests copying sympy/printing/tests/test_python.py -> build-3/lib/sympy/printing/tests copying sympy/printing/tests/test_rcode.py -> build-3/lib/sympy/printing/tests copying sympy/printing/tests/test_repr.py -> build-3/lib/sympy/printing/tests copying sympy/printing/tests/test_rust.py -> build-3/lib/sympy/printing/tests copying sympy/printing/tests/test_str.py -> build-3/lib/sympy/printing/tests copying sympy/printing/tests/test_tableform.py -> build-3/lib/sympy/printing/tests copying sympy/printing/tests/test_tensorflow.py -> build-3/lib/sympy/printing/tests copying sympy/printing/tests/test_theanocode.py -> build-3/lib/sympy/printing/tests copying sympy/printing/tests/test_tree.py -> build-3/lib/sympy/printing/tests creating build-3/lib/sympy/sandbox/tests copying sympy/sandbox/tests/__init__.py -> build-3/lib/sympy/sandbox/tests copying sympy/sandbox/tests/test_indexed_integrals.py -> build-3/lib/sympy/sandbox/tests creating build-3/lib/sympy/series/tests copying sympy/series/tests/__init__.py -> build-3/lib/sympy/series/tests copying sympy/series/tests/test_approximants.py -> build-3/lib/sympy/series/tests copying sympy/series/tests/test_aseries.py -> build-3/lib/sympy/series/tests copying sympy/series/tests/test_demidovich.py -> build-3/lib/sympy/series/tests copying sympy/series/tests/test_formal.py -> build-3/lib/sympy/series/tests copying sympy/series/tests/test_fourier.py -> build-3/lib/sympy/series/tests copying sympy/series/tests/test_gruntz.py -> build-3/lib/sympy/series/tests copying sympy/series/tests/test_kauers.py -> build-3/lib/sympy/series/tests copying sympy/series/tests/test_limits.py -> build-3/lib/sympy/series/tests copying sympy/series/tests/test_limitseq.py -> build-3/lib/sympy/series/tests copying sympy/series/tests/test_lseries.py -> build-3/lib/sympy/series/tests copying sympy/series/tests/test_nseries.py -> build-3/lib/sympy/series/tests copying sympy/series/tests/test_order.py -> build-3/lib/sympy/series/tests copying sympy/series/tests/test_residues.py -> build-3/lib/sympy/series/tests copying sympy/series/tests/test_sequences.py -> build-3/lib/sympy/series/tests copying sympy/series/tests/test_series.py -> build-3/lib/sympy/series/tests creating build-3/lib/sympy/sets/tests copying sympy/sets/tests/__init__.py -> build-3/lib/sympy/sets/tests copying sympy/sets/tests/test_conditionset.py -> build-3/lib/sympy/sets/tests copying sympy/sets/tests/test_contains.py -> build-3/lib/sympy/sets/tests copying sympy/sets/tests/test_fancysets.py -> build-3/lib/sympy/sets/tests copying sympy/sets/tests/test_ordinals.py -> build-3/lib/sympy/sets/tests copying sympy/sets/tests/test_powerset.py -> build-3/lib/sympy/sets/tests copying sympy/sets/tests/test_setexpr.py -> build-3/lib/sympy/sets/tests copying sympy/sets/tests/test_sets.py -> build-3/lib/sympy/sets/tests creating build-3/lib/sympy/simplify/tests copying sympy/simplify/tests/__init__.py -> build-3/lib/sympy/simplify/tests copying sympy/simplify/tests/test_combsimp.py -> build-3/lib/sympy/simplify/tests copying sympy/simplify/tests/test_cse.py -> build-3/lib/sympy/simplify/tests copying sympy/simplify/tests/test_epathtools.py -> build-3/lib/sympy/simplify/tests copying sympy/simplify/tests/test_fu.py -> build-3/lib/sympy/simplify/tests copying sympy/simplify/tests/test_function.py -> build-3/lib/sympy/simplify/tests copying sympy/simplify/tests/test_gammasimp.py -> build-3/lib/sympy/simplify/tests copying sympy/simplify/tests/test_hyperexpand.py -> build-3/lib/sympy/simplify/tests copying sympy/simplify/tests/test_powsimp.py -> build-3/lib/sympy/simplify/tests copying sympy/simplify/tests/test_radsimp.py -> build-3/lib/sympy/simplify/tests copying sympy/simplify/tests/test_ratsimp.py -> build-3/lib/sympy/simplify/tests copying sympy/simplify/tests/test_rewrite.py -> build-3/lib/sympy/simplify/tests copying sympy/simplify/tests/test_simplify.py -> build-3/lib/sympy/simplify/tests copying sympy/simplify/tests/test_sqrtdenest.py -> build-3/lib/sympy/simplify/tests copying sympy/simplify/tests/test_traversaltools.py -> build-3/lib/sympy/simplify/tests copying sympy/simplify/tests/test_trigsimp.py -> build-3/lib/sympy/simplify/tests creating build-3/lib/sympy/solvers/diophantine/tests copying sympy/solvers/diophantine/tests/__init__.py -> build-3/lib/sympy/solvers/diophantine/tests copying sympy/solvers/diophantine/tests/test_diophantine.py -> build-3/lib/sympy/solvers/diophantine/tests creating build-3/lib/sympy/solvers/ode/tests copying sympy/solvers/ode/tests/__init__.py -> build-3/lib/sympy/solvers/ode/tests copying sympy/solvers/ode/tests/test_ode.py -> build-3/lib/sympy/solvers/ode/tests copying sympy/solvers/ode/tests/test_single.py -> build-3/lib/sympy/solvers/ode/tests copying sympy/solvers/ode/tests/test_subscheck.py -> build-3/lib/sympy/solvers/ode/tests copying sympy/solvers/ode/tests/test_systems.py -> build-3/lib/sympy/solvers/ode/tests creating build-3/lib/sympy/solvers/tests copying sympy/solvers/tests/__init__.py -> build-3/lib/sympy/solvers/tests copying sympy/solvers/tests/test_constantsimp.py -> build-3/lib/sympy/solvers/tests copying sympy/solvers/tests/test_decompogen.py -> build-3/lib/sympy/solvers/tests copying sympy/solvers/tests/test_inequalities.py -> build-3/lib/sympy/solvers/tests copying sympy/solvers/tests/test_numeric.py -> build-3/lib/sympy/solvers/tests copying sympy/solvers/tests/test_pde.py -> build-3/lib/sympy/solvers/tests copying sympy/solvers/tests/test_polysys.py -> build-3/lib/sympy/solvers/tests copying sympy/solvers/tests/test_recurr.py -> build-3/lib/sympy/solvers/tests copying sympy/solvers/tests/test_solvers.py -> build-3/lib/sympy/solvers/tests copying sympy/solvers/tests/test_solveset.py -> build-3/lib/sympy/solvers/tests creating build-3/lib/sympy/stats/tests copying sympy/stats/tests/__init__.py -> build-3/lib/sympy/stats/tests copying sympy/stats/tests/test_compound_rv.py -> build-3/lib/sympy/stats/tests copying sympy/stats/tests/test_continuous_rv.py -> build-3/lib/sympy/stats/tests copying sympy/stats/tests/test_discrete_rv.py -> build-3/lib/sympy/stats/tests copying sympy/stats/tests/test_error_prop.py -> build-3/lib/sympy/stats/tests copying sympy/stats/tests/test_finite_rv.py -> build-3/lib/sympy/stats/tests copying sympy/stats/tests/test_joint_rv.py -> build-3/lib/sympy/stats/tests copying sympy/stats/tests/test_matrix_distributions.py -> build-3/lib/sympy/stats/tests copying sympy/stats/tests/test_mix.py -> build-3/lib/sympy/stats/tests copying sympy/stats/tests/test_random_matrix.py -> build-3/lib/sympy/stats/tests copying sympy/stats/tests/test_rv.py -> build-3/lib/sympy/stats/tests copying sympy/stats/tests/test_stochastic_process.py -> build-3/lib/sympy/stats/tests copying sympy/stats/tests/test_symbolic_multivariate.py -> build-3/lib/sympy/stats/tests copying sympy/stats/tests/test_symbolic_probability.py -> build-3/lib/sympy/stats/tests creating build-3/lib/sympy/strategies/branch/tests copying sympy/strategies/branch/tests/__init__.py -> build-3/lib/sympy/strategies/branch/tests copying sympy/strategies/branch/tests/test_core.py -> build-3/lib/sympy/strategies/branch/tests copying sympy/strategies/branch/tests/test_tools.py -> build-3/lib/sympy/strategies/branch/tests copying sympy/strategies/branch/tests/test_traverse.py -> build-3/lib/sympy/strategies/branch/tests creating build-3/lib/sympy/strategies/tests copying sympy/strategies/tests/__init__.py -> build-3/lib/sympy/strategies/tests copying sympy/strategies/tests/test_core.py -> build-3/lib/sympy/strategies/tests copying sympy/strategies/tests/test_rl.py -> build-3/lib/sympy/strategies/tests copying sympy/strategies/tests/test_strat.py -> build-3/lib/sympy/strategies/tests copying sympy/strategies/tests/test_tools.py -> build-3/lib/sympy/strategies/tests copying sympy/strategies/tests/test_traverse.py -> build-3/lib/sympy/strategies/tests copying sympy/strategies/tests/test_tree.py -> build-3/lib/sympy/strategies/tests creating build-3/lib/sympy/tensor/array/tests copying sympy/tensor/array/tests/__init__.py -> build-3/lib/sympy/tensor/array/tests copying sympy/tensor/array/tests/test_array_comprehension.py -> build-3/lib/sympy/tensor/array/tests copying sympy/tensor/array/tests/test_array_derivatives.py -> build-3/lib/sympy/tensor/array/tests copying sympy/tensor/array/tests/test_arrayop.py -> build-3/lib/sympy/tensor/array/tests copying sympy/tensor/array/tests/test_immutable_ndim_array.py -> build-3/lib/sympy/tensor/array/tests copying sympy/tensor/array/tests/test_mutable_ndim_array.py -> build-3/lib/sympy/tensor/array/tests copying sympy/tensor/array/tests/test_ndim_array.py -> build-3/lib/sympy/tensor/array/tests copying sympy/tensor/array/tests/test_ndim_array_conversions.py -> build-3/lib/sympy/tensor/array/tests creating build-3/lib/sympy/tensor/tests copying sympy/tensor/tests/__init__.py -> build-3/lib/sympy/tensor/tests copying sympy/tensor/tests/test_functions.py -> build-3/lib/sympy/tensor/tests copying sympy/tensor/tests/test_index_methods.py -> build-3/lib/sympy/tensor/tests copying sympy/tensor/tests/test_indexed.py -> build-3/lib/sympy/tensor/tests copying sympy/tensor/tests/test_tensor.py -> build-3/lib/sympy/tensor/tests copying sympy/tensor/tests/test_tensor_element.py -> build-3/lib/sympy/tensor/tests copying sympy/tensor/tests/test_tensor_operators.py -> build-3/lib/sympy/tensor/tests creating build-3/lib/sympy/testing/tests copying sympy/testing/tests/__init__.py -> build-3/lib/sympy/testing/tests copying sympy/testing/tests/diagnose_imports.py -> build-3/lib/sympy/testing/tests copying sympy/testing/tests/test_code_quality.py -> build-3/lib/sympy/testing/tests copying sympy/testing/tests/test_module_imports.py -> build-3/lib/sympy/testing/tests copying sympy/testing/tests/test_pytest.py -> build-3/lib/sympy/testing/tests creating build-3/lib/sympy/unify/tests copying sympy/unify/tests/__init__.py -> build-3/lib/sympy/unify/tests copying sympy/unify/tests/test_rewrite.py -> build-3/lib/sympy/unify/tests copying sympy/unify/tests/test_sympy.py -> build-3/lib/sympy/unify/tests copying sympy/unify/tests/test_unify.py -> build-3/lib/sympy/unify/tests creating build-3/lib/sympy/utilities/_compilation/tests copying sympy/utilities/_compilation/tests/__init__.py -> build-3/lib/sympy/utilities/_compilation/tests copying sympy/utilities/_compilation/tests/test_compilation.py -> build-3/lib/sympy/utilities/_compilation/tests creating build-3/lib/sympy/utilities/tests copying sympy/utilities/tests/__init__.py -> build-3/lib/sympy/utilities/tests copying sympy/utilities/tests/test_autowrap.py -> build-3/lib/sympy/utilities/tests copying sympy/utilities/tests/test_codegen.py -> build-3/lib/sympy/utilities/tests copying sympy/utilities/tests/test_codegen_julia.py -> build-3/lib/sympy/utilities/tests copying sympy/utilities/tests/test_codegen_octave.py -> build-3/lib/sympy/utilities/tests copying sympy/utilities/tests/test_codegen_rust.py -> build-3/lib/sympy/utilities/tests copying sympy/utilities/tests/test_decorator.py -> build-3/lib/sympy/utilities/tests copying sympy/utilities/tests/test_deprecated.py -> build-3/lib/sympy/utilities/tests copying sympy/utilities/tests/test_enumerative.py -> build-3/lib/sympy/utilities/tests copying sympy/utilities/tests/test_iterables.py -> build-3/lib/sympy/utilities/tests copying sympy/utilities/tests/test_lambdify.py -> build-3/lib/sympy/utilities/tests copying sympy/utilities/tests/test_misc.py -> build-3/lib/sympy/utilities/tests copying sympy/utilities/tests/test_pickling.py -> build-3/lib/sympy/utilities/tests copying sympy/utilities/tests/test_source.py -> build-3/lib/sympy/utilities/tests copying sympy/utilities/tests/test_timeutils.py -> build-3/lib/sympy/utilities/tests copying sympy/utilities/tests/test_wester.py -> build-3/lib/sympy/utilities/tests creating build-3/lib/sympy/vector/tests copying sympy/vector/tests/__init__.py -> build-3/lib/sympy/vector/tests copying sympy/vector/tests/test_coordsysrect.py -> build-3/lib/sympy/vector/tests copying sympy/vector/tests/test_dyadic.py -> build-3/lib/sympy/vector/tests copying sympy/vector/tests/test_field_functions.py -> build-3/lib/sympy/vector/tests copying sympy/vector/tests/test_functions.py -> build-3/lib/sympy/vector/tests copying sympy/vector/tests/test_implicitregion.py -> build-3/lib/sympy/vector/tests copying sympy/vector/tests/test_integrals.py -> build-3/lib/sympy/vector/tests copying sympy/vector/tests/test_operators.py -> build-3/lib/sympy/vector/tests copying sympy/vector/tests/test_parametricregion.py -> build-3/lib/sympy/vector/tests copying sympy/vector/tests/test_printing.py -> build-3/lib/sympy/vector/tests copying sympy/vector/tests/test_vector.py -> build-3/lib/sympy/vector/tests copying sympy/integrals/rubi/parsetools/header.py.txt -> build-3/lib/sympy/integrals/rubi/parsetools copying sympy/parsing/autolev/Autolev.g4 -> build-3/lib/sympy/parsing/autolev creating build-3/lib/sympy/parsing/autolev/test-examples copying sympy/parsing/autolev/test-examples/ruletest1.al -> build-3/lib/sympy/parsing/autolev/test-examples copying sympy/parsing/autolev/test-examples/ruletest10.al -> build-3/lib/sympy/parsing/autolev/test-examples copying sympy/parsing/autolev/test-examples/ruletest11.al -> build-3/lib/sympy/parsing/autolev/test-examples copying sympy/parsing/autolev/test-examples/ruletest12.al -> build-3/lib/sympy/parsing/autolev/test-examples copying sympy/parsing/autolev/test-examples/ruletest2.al -> build-3/lib/sympy/parsing/autolev/test-examples copying sympy/parsing/autolev/test-examples/ruletest3.al -> build-3/lib/sympy/parsing/autolev/test-examples copying sympy/parsing/autolev/test-examples/ruletest4.al -> build-3/lib/sympy/parsing/autolev/test-examples copying sympy/parsing/autolev/test-examples/ruletest5.al -> build-3/lib/sympy/parsing/autolev/test-examples copying sympy/parsing/autolev/test-examples/ruletest6.al -> build-3/lib/sympy/parsing/autolev/test-examples copying sympy/parsing/autolev/test-examples/ruletest7.al -> build-3/lib/sympy/parsing/autolev/test-examples copying sympy/parsing/autolev/test-examples/ruletest8.al -> build-3/lib/sympy/parsing/autolev/test-examples copying sympy/parsing/autolev/test-examples/ruletest9.al -> build-3/lib/sympy/parsing/autolev/test-examples copying sympy/parsing/autolev/test-examples/ruletest1.py -> build-3/lib/sympy/parsing/autolev/test-examples copying sympy/parsing/autolev/test-examples/ruletest10.py -> build-3/lib/sympy/parsing/autolev/test-examples copying sympy/parsing/autolev/test-examples/ruletest11.py -> build-3/lib/sympy/parsing/autolev/test-examples copying sympy/parsing/autolev/test-examples/ruletest12.py -> build-3/lib/sympy/parsing/autolev/test-examples copying sympy/parsing/autolev/test-examples/ruletest2.py -> build-3/lib/sympy/parsing/autolev/test-examples copying sympy/parsing/autolev/test-examples/ruletest3.py -> build-3/lib/sympy/parsing/autolev/test-examples copying sympy/parsing/autolev/test-examples/ruletest4.py -> build-3/lib/sympy/parsing/autolev/test-examples copying sympy/parsing/autolev/test-examples/ruletest5.py -> build-3/lib/sympy/parsing/autolev/test-examples copying sympy/parsing/autolev/test-examples/ruletest6.py -> build-3/lib/sympy/parsing/autolev/test-examples copying sympy/parsing/autolev/test-examples/ruletest7.py -> build-3/lib/sympy/parsing/autolev/test-examples copying sympy/parsing/autolev/test-examples/ruletest8.py -> build-3/lib/sympy/parsing/autolev/test-examples copying sympy/parsing/autolev/test-examples/ruletest9.py -> build-3/lib/sympy/parsing/autolev/test-examples creating build-3/lib/sympy/parsing/autolev/test-examples/pydy-example-repo copying sympy/parsing/autolev/test-examples/pydy-example-repo/chaos_pendulum.al -> build-3/lib/sympy/parsing/autolev/test-examples/pydy-example-repo copying sympy/parsing/autolev/test-examples/pydy-example-repo/double_pendulum.al -> build-3/lib/sympy/parsing/autolev/test-examples/pydy-example-repo copying sympy/parsing/autolev/test-examples/pydy-example-repo/mass_spring_damper.al -> build-3/lib/sympy/parsing/autolev/test-examples/pydy-example-repo copying sympy/parsing/autolev/test-examples/pydy-example-repo/non_min_pendulum.al -> build-3/lib/sympy/parsing/autolev/test-examples/pydy-example-repo copying sympy/parsing/autolev/test-examples/pydy-example-repo/chaos_pendulum.py -> build-3/lib/sympy/parsing/autolev/test-examples/pydy-example-repo copying sympy/parsing/autolev/test-examples/pydy-example-repo/double_pendulum.py -> build-3/lib/sympy/parsing/autolev/test-examples/pydy-example-repo copying sympy/parsing/autolev/test-examples/pydy-example-repo/mass_spring_damper.py -> build-3/lib/sympy/parsing/autolev/test-examples/pydy-example-repo copying sympy/parsing/autolev/test-examples/pydy-example-repo/non_min_pendulum.py -> build-3/lib/sympy/parsing/autolev/test-examples/pydy-example-repo copying sympy/parsing/autolev/test-examples/README.txt -> build-3/lib/sympy/parsing/autolev/test-examples copying sympy/parsing/latex/LICENSE.txt -> build-3/lib/sympy/parsing/latex copying sympy/parsing/latex/LaTeX.g4 -> build-3/lib/sympy/parsing/latex creating build-3/lib/sympy/utilities/mathml/data copying sympy/utilities/mathml/data/mmlctop.xsl -> build-3/lib/sympy/utilities/mathml/data copying sympy/utilities/mathml/data/mmltex.xsl -> build-3/lib/sympy/utilities/mathml/data copying sympy/utilities/mathml/data/simple_mmlctop.xsl -> build-3/lib/sympy/utilities/mathml/data copying sympy/plotting/tests/test_region_and.png -> build-3/lib/sympy/plotting/tests copying sympy/plotting/tests/test_region_not.png -> build-3/lib/sympy/plotting/tests copying sympy/plotting/tests/test_region_or.png -> build-3/lib/sympy/plotting/tests copying sympy/plotting/tests/test_region_xor.png -> build-3/lib/sympy/plotting/tests running test /tmp/B.267c4rwc/BUILD/sympy-1.7.1/sympy/utilities/runtests.py:7: SymPyDeprecationWarning: Import sympy.utilities.runtests has been deprecated since SymPy 1.6. Use Import from sympy.testing.runtests instead. See https://github.com/sympy/sympy/issues/18095 for more info. deprecated_since_version="1.6").warn() ============================= test process starts ============================== executable: /usr/bin/python3 (3.10.4-final-0) [CPython] architecture: 32-bit cache: yes ground types: python numpy: 1.22.2 random seed: 85905946 hash randomization: on (PYTHONHASHSEED=1873082225) sympy/algebras/tests/test_quaternion.py[7] ....... [OK] sympy/assumptions/tests/test_assumptions_2.py[4] .... [OK] sympy/assumptions/tests/test_context.py[4] .... [OK] sympy/assumptions/tests/test_matrices.py[21] ...f..........f...... [OK] sympy/assumptions/tests/test_query.py[68] .................f...f..........f..... .................w.......f.... [OK] sympy/assumptions/tests/test_refine.py[15] ............... [OK] sympy/assumptions/tests/test_satask.py[17] ....f............ [OK] sympy/assumptions/tests/test_sathandlers.py[6] ...... [OK] sympy/calculus/tests/test_euler.py[5] ..... [OK] sympy/calculus/tests/test_finite_diff.py[4] .... [OK] sympy/calculus/tests/test_singularities.py[6] ...... [OK] sympy/calculus/tests/test_util.py[22] ...................... [OK] sympy/categories/tests/test_baseclasses.py[3] ... [OK] sympy/categories/tests/test_drawing.py[9] ......... [OK] sympy/codegen/tests/test_algorithms.py[5] ....s [OK] sympy/codegen/tests/test_applications.py[1] . [OK] sympy/codegen/tests/test_approximations.py[3] ... [OK] sympy/codegen/tests/test_array_utils.py[14] .............. [OK] sympy/codegen/tests/test_ast.py[31] ............................... [OK] sympy/codegen/tests/test_cfunctions.py[9] ......... [OK] sympy/codegen/tests/test_cnodes.py[10] .......... [OK] sympy/codegen/tests/test_cxxnodes.py[1] . [OK] sympy/codegen/tests/test_fnodes.py[12] ..X..X...... [OK] sympy/codegen/tests/test_numpy_nodes.py[2] .. [OK] sympy/codegen/tests/test_pyutils.py[1] . [OK] sympy/codegen/tests/test_rewriting.py[16] ...f.ff........f [OK] sympy/codegen/tests/test_scipy_nodes.py[1] . [OK] sympy/combinatorics/tests/test_coset_table.py[4] .w.. [OK] sympy/combinatorics/tests/test_fp_groups.py[8] ..w..... [OK] sympy/combinatorics/tests/test_free_groups.py[21] ..................... [OK] sympy/combinatorics/tests/test_generators.py[1] . [OK] sympy/combinatorics/tests/test_graycode.py[2] .. [OK] sympy/combinatorics/tests/test_group_constructs.py[1] . [OK] sympy/combinatorics/tests/test_homomorphisms.py[3] ... [OK] sympy/combinatorics/tests/test_named_groups.py[6] ...... [OK] sympy/combinatorics/tests/test_partitions.py[5] ..... [OK] sympy/combinatorics/tests/test_pc_groups.py[3] ... [OK] sympy/combinatorics/tests/test_perm_groups.py[61] ...............f.............. .f................w............ [OK] sympy/combinatorics/tests/test_permutations.py[16] ................ [OK] sympy/combinatorics/tests/test_polyhedron.py[2] .. [OK] sympy/combinatorics/tests/test_prufer.py[2] .. [OK] sympy/combinatorics/tests/test_rewriting.py[1] . [OK] sympy/combinatorics/tests/test_schur_number.py[2] .. [OK] sympy/combinatorics/tests/test_subsets.py[2] .. [OK] sympy/combinatorics/tests/test_tensor_can.py[12] .........f.. [OK] sympy/combinatorics/tests/test_testutil.py[5] ..... [OK] sympy/combinatorics/tests/test_util.py[8] ........ [OK] sympy/concrete/tests/test_delta.py[27] ........................... [OK] sympy/concrete/tests/test_gosper.py[11] ........... [OK] sympy/concrete/tests/test_guess.py[6] ...... [OK] sympy/concrete/tests/test_products.py[21] ..................... [OK] sympy/concrete/tests/test_sums_products.py[83] ..............w.................. .....................f....................f......f [OK] sympy/core/tests/test_args.py[950] E........ss.................................. ..............................f.....f.f.sss............s................s....... .s.ss.....s...............s..........................s...........sss.....s.s.... ..................ss............................................................ .................................................s.............................. s...sss............s......s..sss..............sss..............................s ......s...................ss..s............s......................s....s..s....s ..fffffffffff.s.s............s........s...................................s..... ....................................s........................................... ...s...............................................s..s...s..................... ......s....s.s......s....s.....s...........s...s.............s...s...s........s. ...........X...f................................................................ ......................... [FAIL] sympy/core/tests/test_arit.py[93] .....................f.f...................... ............................................... [OK] sympy/core/tests/test_assumptions.py[78] .......................f.....f......... ..............f........f............... [OK] sympy/core/tests/test_basic.py[23] ....................... [OK] sympy/core/tests/test_cache.py[2] .. [OK] sympy/core/tests/test_compatibility.py[4] .... [OK] sympy/core/tests/test_complex.py[18] .................. [OK] sympy/core/tests/test_constructor_postprocessor.py[3] ..f [OK] sympy/core/tests/test_containers.py[13] ............. [OK] sympy/core/tests/test_count_ops.py[3] ... [OK] sympy/core/tests/test_diff.py[8] ........ [OK] sympy/core/tests/test_equal.py[6] ...... [OK] sympy/core/tests/test_eval.py[8] ...f.... [OK] sympy/core/tests/test_evalf.py[54] ......f.f.................................... ......... [OK] sympy/core/tests/test_expand.py[14] .............. [OK] sympy/core/tests/test_expr.py[100] ................................f............ ...........................................f........... [OK] sympy/core/tests/test_exprtools.py[12] ............ [OK] sympy/core/tests/test_facts.py[10] .......... [OK] sympy/core/tests/test_function.py[83] .....................f.................... ......................................... [OK] sympy/core/tests/test_logic.py[16] ................ [OK] sympy/core/tests/test_match.py[42] ..........f......................f........ [OK] sympy/core/tests/test_multidimensional.py[1] . [OK] sympy/core/tests/test_noncommutative.py[16] ..f.......ff.... [OK] sympy/core/tests/test_numbers.py[99] ........................................... .......................f................................ [OK] sympy/core/tests/test_operations.py[8] ........ [OK] sympy/core/tests/test_parameters.py[2] .. [OK] sympy/core/tests/test_power.py[34] .................................. [OK] sympy/core/tests/test_priority.py[7] ....... [OK] sympy/core/tests/test_relational.py[63] ...............f.....................f.. ....................... [OK] sympy/core/tests/test_rules.py[1] . [OK] sympy/core/tests/test_singleton.py[3] ... [OK] sympy/core/tests/test_subs.py[66] .............................................. .f.................. [OK] sympy/core/tests/test_symbol.py[12] ............ [OK] sympy/core/tests/test_sympify.py[50] ...........f............................... f...... [OK] sympy/core/tests/test_trace.py[3] ... [OK] sympy/core/tests/test_truediv.py[3] ... [OK] sympy/core/tests/test_var.py[5] ..... [OK] sympy/crypto/tests/test_crypto.py[51] .......................................... ......... [OK] sympy/deprecated/tests/test_class_registry.py[1] . [OK] sympy/diffgeom/tests/test_class_structure.py[3] ... [OK] sympy/diffgeom/tests/test_diffgeom.py[12] ............ [OK] sympy/diffgeom/tests/test_function_diffgeom_book.py[4] .... [OK] sympy/diffgeom/tests/test_hyperbolic_space.py[1] . [OK] sympy/discrete/tests/test_convolutions.py[8] ........ [OK] sympy/discrete/tests/test_recurrences.py[1] . [OK] sympy/discrete/tests/test_transforms.py[4] .... [OK] sympy/external/tests/test_autowrap.py[16] ................ [OK] sympy/external/tests/test_codegen.py[9] ..s.s.... [OK] sympy/external/tests/test_importtools.py[4] EEE. [FAIL] sympy/external/tests/test_numpy.py[23] ....................... [OK] sympy/external/tests/test_scipy.py[1] . [OK] sympy/functions/combinatorial/tests/test_comb_factorials.py[18] .............w.. f. [OK] sympy/functions/combinatorial/tests/test_comb_numbers.py[22] .........f......... ... [OK] sympy/functions/elementary/tests/test_complexes.py[31] ....f...................f .f.... [OK] sympy/functions/elementary/tests/test_exponential.py[46] ....................... .......f...........f... [OK] sympy/functions/elementary/tests/test_hyperbolic.py[61] ........................ ..................................... [OK] sympy/functions/elementary/tests/test_integers.py[9] ....f.... [OK] sympy/functions/elementary/tests/test_interface.py[3] ... [OK] sympy/functions/elementary/tests/test_miscellaneous.py[14] .............. [OK] sympy/functions/elementary/tests/test_piecewise.py[58] ....ww...w............... ..............................w.. [OK] sympy/functions/elementary/tests/test_trigonometric.py[81] ..................... ...f..................................fww................... [OK] sympy/functions/special/tests/test_bessel.py[22] .....w................ [OK] sympy/functions/special/tests/test_beta_functions.py[1] . [OK] sympy/functions/special/tests/test_bsplines.py[11] .........w. [OK] sympy/functions/special/tests/test_delta_functions.py[4] .... [OK] sympy/functions/special/tests/test_elliptic_integrals.py[4] .... [OK] sympy/functions/special/tests/test_error_functions.py[24] ...................... .w [OK] sympy/functions/special/tests/test_gamma_functions.py[19] ................... [OK] sympy/functions/special/tests/test_hyper.py[15] .........ww.... [OK] sympy/functions/special/tests/test_mathieu.py[4] .... [OK] sympy/functions/special/tests/test_singularity_functions.py[3] ... [OK] sympy/functions/special/tests/test_spec_polynomials.py[8] ........ [OK] sympy/functions/special/tests/test_spherical_harmonics.py[3] ... [OK] sympy/functions/special/tests/test_tensor_functions.py[3] ... [OK] sympy/functions/special/tests/test_zeta_functions.py[13] ............. [OK] sympy/geometry/tests/test_curve.py[6] .w.... [OK] sympy/geometry/tests/test_ellipse.py[20] ..w........w........ [OK] sympy/geometry/tests/test_entity.py[3] ... [OK] sympy/geometry/tests/test_geometrysets.py[1] . [OK] sympy/geometry/tests/test_line.py[34] .................................. [OK] sympy/geometry/tests/test_parabola.py[2] .. [OK] sympy/geometry/tests/test_plane.py[3] ... [OK] sympy/geometry/tests/test_point.py[12] ............ [OK] sympy/geometry/tests/test_polygon.py[24] w....................... [OK] sympy/geometry/tests/test_util.py[6] ...... [OK] sympy/holonomic/tests/test_holonomic.py[27] ........................... [OK] sympy/holonomic/tests/test_recurrence.py[2] .. [OK] sympy/integrals/tests/test_deltafunctions.py[2] .. [OK] sympy/integrals/tests/test_failing_integrals.py[42] sffffwwwwfffwffffffwfwwfwfwf ffffffffffffff [OK] sympy/integrals/tests/test_heurisch.py[27] ...............f....w...ww. [OK] sympy/integrals/tests/test_integrals.py[169] ................................... .......w............................................w........................... ......ww..w.................w......................... [OK] sympy/integrals/tests/test_intpoly.py[14] ..w........... [OK] sympy/integrals/tests/test_lineintegrals.py[1] . [OK] sympy/integrals/tests/test_manual.py[34] ...................w..w......w.... [OK] sympy/integrals/tests/test_meijerint.py[29] ......w....w..ww............. [OK] sympy/integrals/tests/test_prde.py[15] ............... [OK] sympy/integrals/tests/test_quadrature.py[16] ................ [OK] sympy/integrals/tests/test_rationaltools.py[11] ........... [OK] sympy/integrals/tests/test_rde.py[10] .......... [OK] sympy/integrals/tests/test_risch.py[35] ................................... [OK] sympy/integrals/tests/test_singularityfunctions.py[1] . [OK] sympy/integrals/tests/test_transforms.py[24] ...w.wwwww.............. [OK] sympy/integrals/tests/test_trigonometry.py[4] .... [OK] sympy/interactive/tests/test_interactive.py[1] . [OK] sympy/interactive/tests/test_ipython.py[2] EE [FAIL] sympy/interactive/tests/test_ipythonprinting.py[5] EEEEE [FAIL] sympy/liealgebras/tests/test_cartan_matrix.py[1] . [OK] sympy/liealgebras/tests/test_cartan_type.py[1] . [OK] sympy/liealgebras/tests/test_dynkin_diagram.py[1] . [OK] sympy/liealgebras/tests/test_root_system.py[1] . [OK] sympy/liealgebras/tests/test_type_A.py[1] . [OK] sympy/liealgebras/tests/test_type_B.py[1] . [OK] sympy/liealgebras/tests/test_type_C.py[1] . [OK] sympy/liealgebras/tests/test_type_D.py[1] . [OK] sympy/liealgebras/tests/test_type_E.py[1] . [OK] sympy/liealgebras/tests/test_type_F.py[1] . [OK] sympy/liealgebras/tests/test_type_G.py[1] . [OK] sympy/liealgebras/tests/test_weyl_group.py[1] . [OK] sympy/logic/tests/test_boolalg.py[71] .......................................... ...f................w........ [OK] sympy/logic/tests/test_dimacs.py[5] ..... [OK] sympy/logic/tests/test_inference.py[20] .................... [OK] sympy/matrices/expressions/tests/test_adjoint.py[1] . [OK] sympy/matrices/expressions/tests/test_applyfunc.py[3] ... [OK] sympy/matrices/expressions/tests/test_blockmatrix.py[26] ..............w........ ... [OK] sympy/matrices/expressions/tests/test_companion.py[4] .... [OK] sympy/matrices/expressions/tests/test_derivatives.py[11] ........... [OK] sympy/matrices/expressions/tests/test_determinant.py[4] .... [OK] sympy/matrices/expressions/tests/test_diagonal.py[3] ... [OK] sympy/matrices/expressions/tests/test_dotproduct.py[2] .. [OK] sympy/matrices/expressions/tests/test_factorizations.py[4] .... [OK] sympy/matrices/expressions/tests/test_fourier.py[2] .. [OK] sympy/matrices/expressions/tests/test_funcmatrix.py[3] ... [OK] sympy/matrices/expressions/tests/test_hadamard.py[8] ........ [OK] sympy/matrices/expressions/tests/test_indexing.py[15] ..........f.... [OK] sympy/matrices/expressions/tests/test_inverse.py[4] .... [OK] sympy/matrices/expressions/tests/test_kronecker.py[18] .................. [OK] sympy/matrices/expressions/tests/test_matadd.py[8] .......f [OK] sympy/matrices/expressions/tests/test_matexpr.py[38] .........................f. ...f....... [OK] sympy/matrices/expressions/tests/test_matmul.py[24] ...................f.... [OK] sympy/matrices/expressions/tests/test_matpow.py[16] ................ [OK] sympy/matrices/expressions/tests/test_permutation.py[12] ............ [OK] sympy/matrices/expressions/tests/test_sets.py[1] . [OK] sympy/matrices/expressions/tests/test_slice.py[9] ......f.. [OK] sympy/matrices/expressions/tests/test_special.py[12] ............ [OK] sympy/matrices/expressions/tests/test_trace.py[8] ........ [OK] sympy/matrices/expressions/tests/test_transpose.py[4] .... [OK] sympy/matrices/tests/test_commonmatrix.py[73] .................................. ..............................f........ [OK] sympy/matrices/tests/test_decompositions.py[10] .......... [OK] sympy/matrices/tests/test_densearith.py[4] .... [OK] sympy/matrices/tests/test_densesolve.py[3] ... [OK] sympy/matrices/tests/test_densetools.py[2] .. [OK] sympy/matrices/tests/test_determinant.py[8] ........ [OK] sympy/matrices/tests/test_eigen.py[16] .w.f....w....... [OK] sympy/matrices/tests/test_graph.py[1] . [OK] sympy/matrices/tests/test_immutable.py[10] .......... [OK] sympy/matrices/tests/test_interactions.py[7] ....... [OK] sympy/matrices/tests/test_matrices.py[178] ..................................... ................................................................................ ...........................f......f.......................... [OK] sympy/matrices/tests/test_normalforms.py[1] . [OK] sympy/matrices/tests/test_reductions.py[10] .......... [OK] sympy/matrices/tests/test_solvers.py[16] ................ [OK] sympy/matrices/tests/test_sparse.py[15] ............... [OK] sympy/matrices/tests/test_sparsetools.py[3] ... [OK] sympy/matrices/tests/test_subspaces.py[5] ..... [OK] sympy/multipledispatch/tests/test_conflict.py[7] ....... [OK] sympy/multipledispatch/tests/test_core.py[12] ............ [OK] sympy/multipledispatch/tests/test_dispatcher.py[17] ................. [OK] sympy/ntheory/tests/test_bbp_pi.py[1] . [OK] sympy/ntheory/tests/test_continued_fraction.py[1] . [OK] sympy/ntheory/tests/test_digits.py[3] ... [OK] sympy/ntheory/tests/test_ecm.py[2] w. [OK] sympy/ntheory/tests/test_egyptian_fraction.py[1] . [OK] sympy/ntheory/tests/test_elliptic_curve.py[1] . [OK] sympy/ntheory/tests/test_factor_.py[35] ................................... [OK] sympy/ntheory/tests/test_generate.py[11] ........... [OK] sympy/ntheory/tests/test_modular.py[2] .. [OK] sympy/ntheory/tests/test_multinomial.py[3] ... [OK] sympy/ntheory/tests/test_partitions.py[1] . [OK] sympy/ntheory/tests/test_primetest.py[6] ..w... [OK] sympy/ntheory/tests/test_residue.py[1] . [OK] sympy/parsing/tests/test_ast_parser.py[1] . [OK] sympy/parsing/tests/test_c_parser.py[1] . [OK] sympy/parsing/tests/test_fortran_parser.py[1] . [OK] sympy/parsing/tests/test_implicit_multiplication_application.py[5] ..... [OK] sympy/parsing/tests/test_latex_deps.py[1] . [OK] sympy/parsing/tests/test_mathematica.py[1] . [OK] sympy/parsing/tests/test_maxima.py[3] ... [OK] sympy/parsing/tests/test_sym_expr.py[1] . [OK] sympy/parsing/tests/test_sympy_parser.py[22] ...................... [OK] sympy/physics/continuum_mechanics/tests/test_beam.py[16] ................ [OK] sympy/physics/control/tests/test_lti.py[13] ............. [OK] sympy/physics/hep/tests/test_gamma_matrices.py[4] .... [OK] sympy/physics/mechanics/tests/test_body.py[6] ...... [OK] sympy/physics/mechanics/tests/test_functions.py[11] ........... [OK] sympy/physics/mechanics/tests/test_kane.py[7] ....... [OK] sympy/physics/mechanics/tests/test_kane2.py[4] .... [OK] sympy/physics/mechanics/tests/test_kane3.py[1] w [OK] sympy/physics/mechanics/tests/test_kane4.py[1] . [OK] sympy/physics/mechanics/tests/test_lagrange.py[5] ..... [OK] sympy/physics/mechanics/tests/test_lagrange2.py[1] . [OK] sympy/physics/mechanics/tests/test_linearize.py[6] w..... [OK] sympy/physics/mechanics/tests/test_models.py[4] .... [OK] sympy/physics/mechanics/tests/test_particle.py[2] .. [OK] sympy/physics/mechanics/tests/test_rigidbody.py[5] ..... [OK] sympy/physics/mechanics/tests/test_system.py[5] ..... [OK] sympy/physics/optics/tests/test_gaussopt.py[1] . [OK] sympy/physics/optics/tests/test_medium.py[1] . [OK] sympy/physics/optics/tests/test_polarization.py[1] . [OK] sympy/physics/optics/tests/test_utils.py[10] .......... [OK] sympy/physics/optics/tests/test_waves.py[1] . [OK] sympy/physics/quantum/tests/test_anticommutator.py[4] .... [OK] sympy/physics/quantum/tests/test_boson.py[2] .. [OK] sympy/physics/quantum/tests/test_cartesian.py[3] ... [OK] sympy/physics/quantum/tests/test_cg.py[3] ... [OK] sympy/physics/quantum/tests/test_circuitplot.py[8] ........ [OK] sympy/physics/quantum/tests/test_circuitutils.py[7] .....ww [OK] sympy/physics/quantum/tests/test_commutator.py[4] .... [OK] sympy/physics/quantum/tests/test_constants.py[1] . [OK] sympy/physics/quantum/tests/test_dagger.py[6] ...... [OK] sympy/physics/quantum/tests/test_density.py[11] ........E.. [FAIL] sympy/physics/quantum/tests/test_fermion.py[2] .. [OK] sympy/physics/quantum/tests/test_gate.py[26] .......................... [OK] sympy/physics/quantum/tests/test_grover.py[6] ...... [OK] sympy/physics/quantum/tests/test_hilbert.py[7] ....... [OK] sympy/physics/quantum/tests/test_identitysearch.py[10] .....E.EEE [FAIL] sympy/physics/quantum/tests/test_innerproduct.py[3] ... [OK] sympy/physics/quantum/tests/test_matrixutils.py[8] ........ [OK] sympy/physics/quantum/tests/test_operator.py[8] ........ [OK] sympy/physics/quantum/tests/test_operatorordering.py[2] .. [OK] sympy/physics/quantum/tests/test_operatorset.py[3] ... [OK] sympy/physics/quantum/tests/test_pauli.py[12] ............ [OK] sympy/physics/quantum/tests/test_piab.py[2] .. [OK] sympy/physics/quantum/tests/test_printing.py[16] .....f.......... [OK] sympy/physics/quantum/tests/test_qapply.py[12] ............ [OK] sympy/physics/quantum/tests/test_qasm.py[17] ................. [OK] sympy/physics/quantum/tests/test_qexpr.py[5] ..... [OK] sympy/physics/quantum/tests/test_qft.py[3] ... [OK] sympy/physics/quantum/tests/test_qubit.py[11] ........... [OK] sympy/physics/quantum/tests/test_represent.py[9] ......... [OK] sympy/physics/quantum/tests/test_sho1d.py[5] ..... [OK] sympy/physics/quantum/tests/test_shor.py[2] f. [OK] sympy/physics/quantum/tests/test_spin.py[38] .............w..................... ... [OK] sympy/physics/quantum/tests/test_state.py[8] ........ [OK] sympy/physics/quantum/tests/test_tensorproduct.py[8] ........ [OK] sympy/physics/tests/test_clebsch_gordan.py[11] ........... [OK] sympy/physics/tests/test_hydrogen.py[5] ..... [OK] sympy/physics/tests/test_paulialgebra.py[3] ..f [OK] sympy/physics/tests/test_physics_matrices.py[4] .... [OK] sympy/physics/tests/test_pring.py[4] .... [OK] sympy/physics/tests/test_qho_1d.py[5] ..... [OK] sympy/physics/tests/test_secondquant.py[52] ..............w..................... ................ [OK] sympy/physics/tests/test_sho.py[2] .. [OK] sympy/physics/units/tests/test_dimensions.py[6] ...... [OK] sympy/physics/units/tests/test_dimensionsystem.py[10] .......... [OK] sympy/physics/units/tests/test_prefixes.py[4] .... [OK] sympy/physics/units/tests/test_quantities.py[27] ..................f........ [OK] sympy/physics/units/tests/test_unit_system_cgs_gauss.py[2] .. [OK] sympy/physics/units/tests/test_unitsystem.py[6] ...... [OK] sympy/physics/units/tests/test_util.py[9] ......... [OK] sympy/physics/vector/tests/test_dyadic.py[4] .... [OK] sympy/physics/vector/tests/test_fieldfunctions.py[7] ....... [OK] sympy/physics/vector/tests/test_frame.py[16] ................ [OK] sympy/physics/vector/tests/test_functions.py[11] ........... [OK] sympy/physics/vector/tests/test_output.py[1] . [OK] sympy/physics/vector/tests/test_point.py[18] .................. [OK] sympy/physics/vector/tests/test_printing.py[14] .............. [OK] sympy/physics/vector/tests/test_vector.py[4] .... [OK] sympy/plotting/intervalmath/tests/test_interval_functions.py[24] ............... ......... [OK] sympy/plotting/intervalmath/tests/test_interval_membership.py[7] ....... [OK] sympy/plotting/intervalmath/tests/test_intervalmath.py[7] ....... [OK] Esympy/plotting/tests/test_experimental_lambdify.py[2] .. [OK] sympy/plotting/tests/test_plot.py[21] EEE.EEEEEE<string>:1: RuntimeWarning: invalid value encountered in double_scalars EEEEEEEEEEE [FAIL] sympy/plotting/tests/test_plot_implicit.py[3] .EE [FAIL] sympy/plotting/tests/test_textplot.py[4] .<lambdifygenerated-117>:2: RuntimeWarning: divide by zero encountered in log return (log(x)) .<lambdifygenerated-118>:2: RuntimeWarning: invalid value encountered in double_scalars return (sin(x)/x) .<lambdifygenerated-119>:2: RuntimeWarning: invalid value encountered in sqrt return (sqrt(x)) . [OK] sympy/polys/agca/tests/test_extensions.py[1] . [OK] sympy/polys/agca/tests/test_homomorphisms.py[4] .... [OK] sympy/polys/agca/tests/test_ideals.py[7] ....... [OK] sympy/polys/agca/tests/test_modules.py[16] ................ [OK] sympy/polys/domains/tests/test_domains.py[28] ............................ [OK] sympy/polys/domains/tests/test_polynomialring.py[5] ..... [OK] sympy/polys/domains/tests/test_quotientring.py[2] .. [OK] sympy/polys/tests/test_constructor.py[4] .... [OK] sympy/polys/tests/test_densearith.py[49] ....................................... .......... [OK] sympy/polys/tests/test_densebasic.py[58] ....................................... ................... [OK] sympy/polys/tests/test_densetools.py[36] .................................... [OK] sympy/polys/tests/test_dispersion.py[1] . [OK] sympy/polys/tests/test_distributedmodules.py[20] .................... [OK] sympy/polys/tests/test_domainmatrix.py[50] ..................................... ............. [OK] sympy/polys/tests/test_euclidtools.py[16] ................ [OK] sympy/polys/tests/test_factortools.py[25] ............f............ [OK] sympy/polys/tests/test_fields.py[21] .................f... [OK] sympy/polys/tests/test_galoistools.py[33] ................................. [OK] sympy/polys/tests/test_groebnertools.py[24] .........w.............. [OK] sympy/polys/tests/test_heuristicgcd.py[3] ... [OK] sympy/polys/tests/test_injections.py[2] .. [OK] sympy/polys/tests/test_modulargcd.py[7] ....... [OK] sympy/polys/tests/test_monomials.py[11] ........... [OK] sympy/polys/tests/test_multivariate_resultants.py[15] ............... [OK] sympy/polys/tests/test_numberfields.py[21] ...............w..... [OK] sympy/polys/tests/test_orderings.py[7] ....... [OK] sympy/polys/tests/test_orthopolys.py[7] ....... [OK] sympy/polys/tests/test_partfrac.py[12] ....X....f.. [OK] sympy/polys/tests/test_polyclasses.py[19] ................... [OK] sympy/polys/tests/test_polyfuncs.py[5] ..... [OK] sympy/polys/tests/test_polymatrix.py[1] . [OK] sympy/polys/tests/test_polyoptions.py[46] ...................................... ........ [OK] sympy/polys/tests/test_polyroots.py[26] ......................w... [OK] sympy/polys/tests/test_polytools.py[155] ....................................... ................................................................................ .................................... [OK] sympy/polys/tests/test_polyutils.py[11] ........... [OK] sympy/polys/tests/test_pythonrational.py[14] .............. [OK] sympy/polys/tests/test_rationaltools.py[1] . [OK] sympy/polys/tests/test_ring_series.py[31] ............................... [OK] sympy/polys/tests/test_rings.py[62] ............................................ .................. [OK] sympy/polys/tests/test_rootisolation.py[20] .................... [OK] sympy/polys/tests/test_rootoftools.py[31] ........w...................w.. [OK] sympy/polys/tests/test_solvers.py[10] .......... [OK] sympy/polys/tests/test_specialpolys.py[8] ........ [OK] sympy/polys/tests/test_sqfreetools.py[3] ... [OK] sympy/polys/tests/test_subresultants_qq_zz.py[25] ......................... [OK] sympy/printing/pretty/tests/test_pretty.py[141] ................................ ................................................................................ ............................. [OK] sympy/printing/tests/test_c.py[50] ........................................f.... ..... [OK] sympy/printing/tests/test_codeprinter.py[3] ... [OK] sympy/printing/tests/test_conventions.py[3] ..f [OK] sympy/printing/tests/test_cxx.py[7] ....... [OK] sympy/printing/tests/test_dot.py[10] .......... [OK] sympy/printing/tests/test_fortran.py[42] ....................................... ... [OK] sympy/printing/tests/test_glsl.py[29] ............................. [OK] sympy/printing/tests/test_gtk.py[2] X. [OK] sympy/printing/tests/test_jscode.py[24] ........................ [OK] sympy/printing/tests/test_julia.py[33] ...............f................. [OK] sympy/printing/tests/test_lambdarepr.py[9] ......... [OK] sympy/printing/tests/test_latex.py[155] .........f.............................. ......................................................................f......... ................................... [OK] sympy/printing/tests/test_maple.py[34] .................................. [OK] sympy/printing/tests/test_mathematica.py[16] ................ [OK] sympy/printing/tests/test_mathml.py[108] ....................................... ..................................................................... [OK] sympy/printing/tests/test_numpy.py[21] ..................... [OK] sympy/printing/tests/test_octave.py[43] ..................f..................... ... [OK] sympy/printing/tests/test_precedence.py[13] ............. [OK] sympy/printing/tests/test_preview.py[3] ... [OK] sympy/printing/tests/test_pycode.py[20] .................... [OK] sympy/printing/tests/test_python.py[11] .....f..... [OK] sympy/printing/tests/test_rcode.py[33] ................................. [OK] sympy/printing/tests/test_repr.py[43] .......................................... . [OK] sympy/printing/tests/test_rust.py[25] ......................... [OK] sympy/printing/tests/test_str.py[94] ........................................... ................................................... [OK] sympy/printing/tests/test_tableform.py[2] .. [OK] sympy/printing/tests/test_tensorflow.py[9] .f.sfss.. [OK] sympy/printing/tests/test_tree.py[2] f. [OK] sympy/sandbox/tests/test_indexed_integrals.py[1] . [OK] sympy/series/tests/test_approximants.py[1] . [OK] sympy/series/tests/test_aseries.py[2] .. [OK] sympy/series/tests/test_demidovich.py[17] ................. [OK] sympy/series/tests/test_formal.py[20] ......ww.....f...... [OK] sympy/series/tests/test_fourier.py[8] ........ [OK] sympy/series/tests/test_gruntz.py[41] wswsff......................f........f... [OK] sympy/series/tests/test_kauers.py[2] .. [OK] sympy/series/tests/test_limits.py[125] ...................f...............f..... ...f.............................................ff............................. .... [OK] sympy/series/tests/test_limitseq.py[14] .............f [OK] sympy/series/tests/test_lseries.py[7] ....... [OK] sympy/series/tests/test_nseries.py[68] .................f....................... ........................... [OK] sympy/series/tests/test_order.py[52] ........................................... ......... [OK] sympy/series/tests/test_residues.py[11] .....f..... [OK] sympy/series/tests/test_sequences.py[16] ..............w. [OK] sympy/series/tests/test_series.py[31] ............................... [OK] sympy/sets/tests/test_conditionset.py[12] ............ [OK] sympy/sets/tests/test_contains.py[5] ..... [OK] sympy/sets/tests/test_fancysets.py[49] ......................................... .f...... [OK] sympy/sets/tests/test_ordinals.py[7] ....... [OK] sympy/sets/tests/test_powerset.py[9] ....f.... [OK] sympy/sets/tests/test_setexpr.py[15] ............... [OK] sympy/sets/tests/test_sets.py[98] .........................................f.... .......f......f.............................f....... [OK] sympy/simplify/tests/test_combsimp.py[3] ... [OK] sympy/simplify/tests/test_cse.py[44] .........f.fff....................f........ . [OK] sympy/simplify/tests/test_epathtools.py[3] ... [OK] sympy/simplify/tests/test_fu.py[28] ............................ [OK] sympy/simplify/tests/test_function.py[6] ...... [OK] sympy/simplify/tests/test_gammasimp.py[1] . [OK] sympy/simplify/tests/test_hyperexpand.py[45] ...f....w......w.fw.w.....w.wwwwwww .w..wfff.. [OK] sympy/simplify/tests/test_powsimp.py[16] ................ [OK] sympy/simplify/tests/test_radsimp.py[25] ......................... [OK] sympy/simplify/tests/test_ratsimp.py[2] .. [OK] sympy/simplify/tests/test_rewrite.py[2] .. [OK] sympy/simplify/tests/test_simplify.py[51] ..........................f........... ........w.... [OK] sympy/simplify/tests/test_sqrtdenest.py[15] .....w......... [OK] sympy/simplify/tests/test_traversaltools.py[1] . [OK] sympy/simplify/tests/test_trigsimp.py[27] ........................f.. [OK] sympy/solvers/diophantine/tests/test_diophantine.py[48] ............w........... .............f......f... [OK] sympy/solvers/ode/tests/test_ode.py[102] ...w...fwf..ww......www.w..f.....w..wf. ....ww.........w.........w.....f.fwf..w...........w............ [OK] sympy/solvers/ode/tests/test_single.py[17] ..www............ [OK] sympy/solvers/ode/tests/test_subscheck.py[2] w. [OK] sympy/solvers/ode/tests/test_systems.py[33] .....w..w..ww.ww..wwwwww.wwww..ww [OK] sympy/solvers/tests/test_constantsimp.py[11] .........f. [OK] sympy/solvers/tests/test_decompogen.py[4] ..f. [OK] sympy/solvers/tests/test_inequalities.py[26] ................f.....f... [OK] sympy/solvers/tests/test_numeric.py[11] f.......... [OK] sympy/solvers/tests/test_pde.py[11] ........... [OK] sympy/solvers/tests/test_polysys.py[4] .... [OK] sympy/solvers/tests/test_recurr.py[9] ........w [OK] sympy/solvers/tests/test_solvers.py[122] ....................f....w............. ..wwf...w......................fw.f..............w...ww..w..........w........... ... [OK] sympy/solvers/tests/test_solveset.py[139] .....f..........fw.................... ..s..........fff...f...............f....f...s................................... ...f...ff...f.......f [OK] sympy/stats/tests/test_compound_rv.py[6] ...... [OK] sympy/stats/tests/test_continuous_rv.py[88] ...w..../usr/lib/python3.10/site-packages/numpy/lib/function_base.py:2387: RuntimeWarning: invalid value encountered in _cdf_single (vectorized) outputs = ufunc(*inputs) /usr/lib/python3.10/site-packages/numpy/lib/function_base.py:2387: RuntimeWarning: invalid value encountered in _cdf_single (vectorized) outputs = ufunc(*inputs) /tmp/B.267c4rwc/BUILD/sympy-1.7.1/sympy/stats/rv.py:1104: UserWarning: The return type of sample has been changed to return an iterator object since version 1.7. For more information see https://github.com/sympy/sympy/issues/19061 warnings.warn(filldedent(message)) ....................w....... .....................f................ww..........s. [OK] sympy/stats/tests/test_discrete_rv.py[21] ..w......w..........s [OK] sympy/stats/tests/test_error_prop.py[2] .. [OK] sympy/stats/tests/test_finite_rv.py[23] ......................s [OK] sympy/stats/tests/test_joint_rv.py[16] ............f..s [OK] sympy/stats/tests/test_matrix_distributions.py[6] .....s [OK] sympy/stats/tests/test_mix.py[4] .... [OK] sympy/stats/tests/test_random_matrix.py[9] ......... [OK] sympy/stats/tests/test_rv.py[32] ...............f................ [OK] sympy/stats/tests/test_stochastic_process.py[8] ........ [OK] sympy/stats/tests/test_symbolic_multivariate.py[3] ... [OK] sympy/stats/tests/test_symbolic_probability.py[4] .... [OK] sympy/strategies/branch/tests/test_core.py[10] .......... [OK] sympy/strategies/branch/tests/test_tools.py[2] .. [OK] sympy/strategies/branch/tests/test_traverse.py[4] .... [OK] sympy/strategies/tests/test_core.py[10] .......... [OK] sympy/strategies/tests/test_rl.py[9] ......... [OK] sympy/strategies/tests/test_tools.py[3] ... [OK] sympy/strategies/tests/test_traverse.py[6] ...... [OK] sympy/strategies/tests/test_tree.py[6] ...... [OK] sympy/tensor/array/tests/test_array_comprehension.py[2] .. [OK] sympy/tensor/array/tests/test_array_derivatives.py[1] . [OK] sympy/tensor/array/tests/test_arrayop.py[7] ....... [OK] sympy/tensor/array/tests/test_immutable_ndim_array.py[18] .................. [OK] sympy/tensor/array/tests/test_mutable_ndim_array.py[15] ............... [OK] sympy/tensor/array/tests/test_ndim_array.py[2] .. [OK] sympy/tensor/array/tests/test_ndim_array_conversions.py[1] . [OK] sympy/tensor/tests/test_functions.py[3] ... [OK] sympy/tensor/tests/test_index_methods.py[15] ............... [OK] sympy/tensor/tests/test_indexed.py[30] .....X........................ [OK] sympy/tensor/tests/test_tensor.py[57] .......................f.................. ............... [OK] sympy/tensor/tests/test_tensor_element.py[1] . [OK] sympy/tensor/tests/test_tensor_operators.py[14] .............. [OK] sympy/testing/tests/test_code_quality.py[7] ....... [OK] sympy/testing/tests/test_module_imports.py[1] f [OK] sympy/testing/tests/test_pytest.py[24] ........................ [OK] sympy/unify/tests/test_rewrite.py[8] ........ [OK] sympy/unify/tests/test_sympy.py[17] ................. [OK] sympy/unify/tests/test_unify.py[8] ........ [OK] sympy/utilities/_compilation/tests/test_compilation.py[1] /usr/lib/python3.10/site-packages/Cython/Compiler/Main.py:369: FutureWarning: Cython directive 'language_level' not set, using 2 for now (Py2). This will change in a later release! File: /tmp/B.267c4rwc/BUILD/tmp/tmp47jl4b9h/_sigmoid.pyx tree = Parsing.p_module(s, pxd, full_module_name) . [OK] sympy/utilities/tests/test_autowrap.py[12] ............ [OK] sympy/utilities/tests/test_codegen.py[56] ...................................... .................. [OK] sympy/utilities/tests/test_codegen_julia.py[32] .....f.......f.................. [OK] sympy/utilities/tests/test_codegen_octave.py[32] .....f.......f................. . [OK] sympy/utilities/tests/test_codegen_rust.py[21] .....f.......f....... [OK] sympy/utilities/tests/test_decorator.py[4] .... [OK] sympy/utilities/tests/test_deprecated.py[2] .f [OK] sympy/utilities/tests/test_enumerative.py[4] .... [OK] sympy/utilities/tests/test_iterables.py[43] .................................... ....... [OK] sympy/utilities/tests/test_lambdify.py[105] ....................sss............. ........s...ssssssssssss............................................. [OK] sympy/utilities/tests/test_misc.py[7] ....... [OK] sympy/utilities/tests/test_pickling.py[43] ...........f..........ff..f.........f fX.... [OK] sympy/utilities/tests/test_source.py[3] ... [OK] sympy/utilities/tests/test_timeutils.py[1] . [OK] sympy/utilities/tests/test_wester.py[397] ......................f..f.f....ffffff fff..fff.....ff....f.f............f....f.ff......ff..f..f..fffff.sf..f........w. .ff.f..f...........f.ffff.f..ff.f.ff.fff.........f...fff......fffffff.....f..f.. f.f....f.....ff.........f.......ff.f..fff.ff......fffff..f.ffffff...wfff......ff fff........fff......f..f...ff.ffff....ff.f...fw.ffffwwww.ffff.f.f...ff..w.ww.... ..f......f.fs.ffff.f....fff..wfff...fff [OK] sympy/vector/tests/test_coordsysrect.py[15] ............... [OK] sympy/vector/tests/test_dyadic.py[2] .. [OK] sympy/vector/tests/test_field_functions.py[9] ......... [OK] sympy/vector/tests/test_functions.py[3] ... [OK] sympy/vector/tests/test_implicitregion.py[4] .... [OK] sympy/vector/tests/test_integrals.py[4] .... [OK] sympy/vector/tests/test_operators.py[4] .... [OK] sympy/vector/tests/test_parametricregion.py[2] .. [OK] sympy/vector/tests/test_printing.py[5] .f... [OK] sympy/vector/tests/test_vector.py[11] ........... [OK] ________________________________ slowest tests _________________________________ sympy/integrals/tests/test_transforms.py::test_issue_8368_7173 - Took 10.107 seconds sympy/core/tests/test_diff.py::test_diff_nth_derivative - Took 10.174 seconds sympy/combinatorics/tests/test_rewriting.py::test_rewriting - Took 10.241 seconds sympy/integrals/tests/test_manual.py::test_manualintegrate_trivial_substitution - Took 10.445 seconds sympy/integrals/tests/test_manual.py::test_manualintegrate_trig_substitution - Took 10.496 seconds sympy/holonomic/tests/test_holonomic.py::test_to_meijerg - Took 10.586 seconds sympy/solvers/ode/tests/test_single.py::test_nth_order_linear_euler_eq_homogeneous - Took 10.735 seconds sympy/solvers/ode/tests/test_ode.py::test_unexpanded_Liouville_ODE - Took 10.750 seconds sympy/solvers/ode/tests/test_ode.py::test_1st_homogeneous_coeff_ode2 - Took 10.810 seconds sympy/series/tests/test_limitseq.py::test_limit_seq - Took 11.024 seconds sympy/simplify/tests/test_hyperexpand.py::test_lerchphi - Took 11.205 seconds sympy/simplify/tests/test_simplify.py::test_nthroot1 - Took 11.265 seconds sympy/stats/tests/test_rv.py::test_Sample - Took 11.361 seconds sympy/solvers/ode/tests/test_single.py::test_almost_linear - Took 11.450 seconds sympy/physics/mechanics/tests/test_kane.py::test_aux - Took 11.462 seconds sympy/functions/special/tests/test_bsplines.py::test_5_points_degree_2 - Took 11.535 seconds sympy/functions/special/tests/test_bsplines.py::test_10_points_degree_1 - Took 11.621 seconds sympy/combinatorics/tests/test_coset_table.py::test_look_ahead - Took 11.628 seconds sympy/integrals/tests/test_manual.py::test_manualintegrate_trigonometry - Took 11.770 seconds sympy/solvers/ode/tests/test_systems.py::test_sysode_linear_neq_order1_type2 - Took 11.796 seconds sympy/stats/tests/test_continuous_rv.py::test_trapezoidal - Took 11.818 seconds sympy/logic/tests/test_boolalg.py::test_relational_simplification - Took 11.825 seconds sympy/functions/special/tests/test_bsplines.py::test_repeated_degree_2 - Took 11.953 seconds sympy/integrals/tests/test_meijerint.py::test_messy - Took 12.102 seconds sympy/integrals/tests/test_transforms.py::test_fourier_transform - Took 12.237 seconds sympy/solvers/ode/tests/test_ode.py::test_nonlinear_2eq_order1 - Took 12.309 seconds sympy/integrals/tests/test_manual.py::test_issue_6746 - Took 12.473 seconds sympy/simplify/tests/test_trigsimp.py::test_trigsimp_groebner - Took 12.557 seconds sympy/solvers/tests/test_solvers.py::test_linear_system_symbols_doesnt_hang_1 - Took 13.281 seconds sympy/vector/tests/test_coordsysrect.py::test_coordinate_vars - Took 13.295 seconds sympy/integrals/tests/test_transforms.py::test_issue_8514 - Took 13.301 seconds sympy/solvers/tests/test_solveset.py::test_linsolve_large_sparse - Took 13.413 seconds sympy/series/tests/test_aseries.py::test_simple - Took 13.441 seconds sympy/solvers/ode/tests/test_single.py::test_nth_order_linear_euler_eq_nonhomogeneous_undetermined_coefficients - Took 13.735 seconds sympy/physics/tests/test_clebsch_gordan.py::test_gaunt - Took 13.939 seconds sympy/concrete/tests/test_sums_products.py::test_evalf_slow_series - Took 14.746 seconds sympy/integrals/tests/test_manual.py::test_manualintegrate_trigpowers - Took 15.073 seconds sympy/utilities/tests/test_wester.py::test_H26 - Took 15.116 seconds sympy/concrete/tests/test_sums_products.py::test_sin_times_absolutely_convergent - Took 15.185 seconds sympy/physics/mechanics/tests/test_kane2.py::test_aux_dep - Took 15.218 seconds sympy/polys/tests/test_ring_series.py::test_rs_series - Took 15.261 seconds sympy/solvers/ode/tests/test_systems.py::test_component_division - Took 15.776 seconds sympy/combinatorics/tests/test_pc_groups.py::test_induced_pcgs - Took 15.877 seconds sympy/integrals/tests/test_manual.py::test_manualintegrate_inversetrig - Took 15.993 seconds sympy/solvers/ode/tests/test_ode.py::test_issue_9446 - Took 16.437 seconds sympy/series/tests/test_limits.py::test_issue_13332 - Took 16.554 seconds sympy/stats/tests/test_compound_rv.py::test_normal_CompoundDist - Took 16.571 seconds sympy/solvers/ode/tests/test_ode.py::test_1st_homogeneous_coeff_ode_check7 - Took 16.670 seconds sympy/concrete/tests/test_sums_products.py::test_issue_14484 - Took 16.918 seconds sympy/external/tests/test_autowrap.py::test_ufuncify_numpy - Took 17.060 seconds sympy/stats/tests/test_finite_rv.py::test_bernoulli - Took 17.406 seconds sympy/solvers/ode/tests/test_ode.py::test_nth_linear_constant_coeff_homogeneous_rootof - Took 17.613 seconds sympy/functions/combinatorial/tests/test_comb_numbers.py::test_bell - Took 17.631 seconds sympy/geometry/tests/test_polygon.py::test_bisectors - Took 18.062 seconds sympy/integrals/tests/test_integrals.py::test_issue_14709b - Took 18.099 seconds sympy/solvers/ode/tests/test_single.py::test_Liouville_ODE - Took 18.698 seconds sympy/stats/tests/test_joint_rv.py::test_GeneralizedMultivariateLogGammaDistribution - Took 18.902 seconds sympy/integrals/tests/test_manual.py::test_issue_15471 - Took 19.106 seconds sympy/integrals/tests/test_integrals.py::test_heurisch_option - Took 19.219 seconds sympy/solvers/ode/tests/test_ode.py::test_issue_11290 - Took 19.604 seconds sympy/stats/tests/test_continuous_rv.py::test_exponential - Took 19.623 seconds sympy/solvers/ode/tests/test_single.py::test_nth_order_linear_euler_eq_nonhomogeneous_variation_of_parameters - Took 19.637 seconds sympy/physics/continuum_mechanics/tests/test_beam.py::test_Beam3D - Took 20.238 seconds sympy/ntheory/tests/test_factor_.py::test_primeomega - Took 20.278 seconds sympy/ntheory/tests/test_factor_.py::test_primenu - Took 20.291 seconds sympy/physics/continuum_mechanics/tests/test_beam.py::test_variable_moment - Took 20.525 seconds sympy/integrals/tests/test_manual.py::test_issue_6799 - Took 21.368 seconds sympy/integrals/tests/test_transforms.py::test_inverse_laplace_transform - Took 22.281 seconds sympy/integrals/tests/test_integrals.py::test_issue_15494 - Took 22.911 seconds sympy/utilities/tests/test_wester.py::test_W19 - Took 22.950 seconds sympy/solvers/ode/tests/test_systems.py::test_higher_order_to_first_order - Took 23.254 seconds sympy/utilities/tests/test_wester.py::test_H25 - Took 23.530 seconds sympy/solvers/ode/tests/test_ode.py::test_2nd_linear_bessel_equation - Took 23.705 seconds sympy/solvers/ode/tests/test_ode.py::test_issue_15996 - Took 24.979 seconds sympy/stats/tests/test_joint_rv.py::test_JointPSpace_marginal_distribution - Took 25.065 seconds sympy/solvers/tests/test_solvers.py::test_solve_args - Took 25.092 seconds sympy/solvers/ode/tests/test_ode.py::test_exact_enhancement - Took 25.582 seconds sympy/integrals/tests/test_manual.py::test_issue_10847 - Took 30.660 seconds sympy/utilities/tests/test_wester.py::test_W9 - Took 30.939 seconds sympy/solvers/ode/tests/test_ode.py::test_solve_ics - Took 31.085 seconds sympy/concrete/tests/test_sums_products.py::test_is_convergent - Took 33.104 seconds sympy/plotting/tests/test_plot.py::test_plot_and_save_4 - Took 34.189 seconds sympy/integrals/tests/test_manual.py::test_issue_13297 - Took 35.386 seconds sympy/solvers/ode/tests/test_single.py::test_nth_algebraic - Took 40.485 seconds sympy/solvers/ode/tests/test_single.py::test_factorable - Took 66.943 seconds sympy/solvers/ode/tests/test_ode.py::test_2nd_2F1_hypergeometric - Took 75.728 seconds sympy/solvers/ode/tests/test_single.py::test_separable - Took 155.531 seconds sympy/ntheory/tests/test_factor_.py::test_factorint - Took 214.503 seconds ________________________________ xpassed tests _________________________________ sympy/codegen/tests/test_fnodes.py: test_ImpliedDoLoop sympy/codegen/tests/test_fnodes.py: test_Subroutine sympy/core/tests/test_args.py: test_sympy__diffgeom__diffgeom__BaseCovarDerivativeOp sympy/polys/tests/test_partfrac.py: test_apart_extension_xfail sympy/printing/tests/test_gtk.py: test_1 sympy/tensor/tests/test_indexed.py: test_Idx_inequalities_current_fails sympy/utilities/tests/test_pickling.py: test_printing3 ________________________________________________________________________________ __________ sympy/core/tests/test_args.py:test_all_classes_are_tested ___________ Traceback (most recent call last): File "/tmp/B.267c4rwc/BUILD/sympy-1.7.1/sympy/core/tests/test_args.py", line 47, in test_all_classes_are_tested mod = __import__(submodule, fromlist=names) File "/tmp/B.267c4rwc/BUILD/sympy-1.7.1/sympy/plotting/pygletplot/managed_window.py", line 1, in <module> from pyglet.window import Window File "/usr/share/python3.10/site-packages/pyglet/window/__init__.py", line 1890, in <module> gl._create_shadow_window() File "/usr/share/python3.10/site-packages/pyglet/gl/__init__.py", line 209, in _create_shadow_window _shadow_window = Window(width=1, height=1, visible=False) File "/usr/share/python3.10/site-packages/pyglet/window/xlib/__init__.py", line 171, in __init__ super(XlibWindow, self).__init__(*args, **kwargs) File "/usr/share/python3.10/site-packages/pyglet/window/__init__.py", line 575, in __init__ display = pyglet.canvas.get_display() File "/usr/share/python3.10/site-packages/pyglet/canvas/__init__.py", line 95, in get_display return Display() File "/usr/share/python3.10/site-packages/pyglet/canvas/xlib.py", line 123, in __init__ raise NoSuchDisplayException('Cannot connect to "%s"' % name) pyglet.canvas.xlib.NoSuchDisplayException: Cannot connect to "None" ________________________________________________________________________________ _____ sympy/external/tests/test_importtools.py:test_no_stdlib_collections ______ Traceback (most recent call last): File "/tmp/B.267c4rwc/BUILD/sympy-1.7.1/sympy/external/tests/test_importtools.py", line 11, in test_no_stdlib_collections matplotlib = import_module('matplotlib', File "/tmp/B.267c4rwc/BUILD/sympy-1.7.1/sympy/external/importtools.py", line 158, in import_module if LooseVersion(modversion) < LooseVersion(min_module_version): File "/usr/share/python3.10/site-packages/setuptools/_distutils/version.py", line 53, in __init__ warnings.warn( DeprecationWarning: distutils Version classes are deprecated. Use packaging.version instead. ________________________________________________________________________________ _____ sympy/external/tests/test_importtools.py:test_no_stdlib_collections2 _____ Traceback (most recent call last): File "/tmp/B.267c4rwc/BUILD/sympy-1.7.1/sympy/external/tests/test_importtools.py", line 23, in test_no_stdlib_collections2 matplotlib = import_module('matplotlib', File "/tmp/B.267c4rwc/BUILD/sympy-1.7.1/sympy/external/importtools.py", line 158, in import_module if LooseVersion(modversion) < LooseVersion(min_module_version): File "/usr/share/python3.10/site-packages/setuptools/_distutils/version.py", line 53, in __init__ warnings.warn( DeprecationWarning: distutils Version classes are deprecated. Use packaging.version instead. ________________________________________________________________________________ _____ sympy/external/tests/test_importtools.py:test_no_stdlib_collections3 _____ Traceback (most recent call last): File "/tmp/B.267c4rwc/BUILD/sympy-1.7.1/sympy/external/tests/test_importtools.py", line 32, in test_no_stdlib_collections3 matplotlib = import_module('matplotlib', File "/tmp/B.267c4rwc/BUILD/sympy-1.7.1/sympy/external/importtools.py", line 158, in import_module if LooseVersion(modversion) < LooseVersion(min_module_version): File "/usr/share/python3.10/site-packages/setuptools/_distutils/version.py", line 53, in __init__ warnings.warn( DeprecationWarning: distutils Version classes are deprecated. Use packaging.version instead. ________________________________________________________________________________ ________ sympy/interactive/tests/test_ipython.py:test_automatic_symbols ________ Traceback (most recent call last): File "/tmp/B.267c4rwc/BUILD/sympy-1.7.1/sympy/interactive/tests/test_ipython.py", line 32, in test_automatic_symbols app = init_ipython_session() File "/tmp/B.267c4rwc/BUILD/sympy-1.7.1/sympy/interactive/session.py", line 237, in init_ipython_session if V(IPython.__version__) >= '0.11': File "/usr/share/python3.10/site-packages/setuptools/_distutils/version.py", line 53, in __init__ warnings.warn( DeprecationWarning: distutils Version classes are deprecated. Use packaging.version instead. ________________________________________________________________________________ _________ sympy/interactive/tests/test_ipython.py:test_int_to_Integer __________ Traceback (most recent call last): File "/tmp/B.267c4rwc/BUILD/sympy-1.7.1/sympy/interactive/tests/test_ipython.py", line 59, in test_int_to_Integer app = init_ipython_session() File "/tmp/B.267c4rwc/BUILD/sympy-1.7.1/sympy/interactive/session.py", line 237, in init_ipython_session if V(IPython.__version__) >= '0.11': File "/usr/share/python3.10/site-packages/setuptools/_distutils/version.py", line 53, in __init__ warnings.warn( DeprecationWarning: distutils Version classes are deprecated. Use packaging.version instead. ________________________________________________________________________________ _____ sympy/interactive/tests/test_ipythonprinting.py:test_ipythonprinting _____ Traceback (most recent call last): File "/tmp/B.267c4rwc/BUILD/sympy-1.7.1/sympy/interactive/tests/test_ipythonprinting.py", line 17, in test_ipythonprinting app = init_ipython_session() File "/tmp/B.267c4rwc/BUILD/sympy-1.7.1/sympy/interactive/session.py", line 237, in init_ipython_session if V(IPython.__version__) >= '0.11': File "/usr/share/python3.10/site-packages/setuptools/_distutils/version.py", line 53, in __init__ warnings.warn( DeprecationWarning: distutils Version classes are deprecated. Use packaging.version instead. ________________________________________________________________________________ __ sympy/interactive/tests/test_ipythonprinting.py:test_print_builtin_option ___ Traceback (most recent call last): File "/tmp/B.267c4rwc/BUILD/sympy-1.7.1/sympy/interactive/tests/test_ipythonprinting.py", line 51, in test_print_builtin_option app = init_ipython_session() File "/tmp/B.267c4rwc/BUILD/sympy-1.7.1/sympy/interactive/session.py", line 237, in init_ipython_session if V(IPython.__version__) >= '0.11': File "/usr/share/python3.10/site-packages/setuptools/_distutils/version.py", line 53, in __init__ warnings.warn( DeprecationWarning: distutils Version classes are deprecated. Use packaging.version instead. ________________________________________________________________________________ ___ sympy/interactive/tests/test_ipythonprinting.py:test_builtin_containers ____ Traceback (most recent call last): File "/tmp/B.267c4rwc/BUILD/sympy-1.7.1/sympy/interactive/tests/test_ipythonprinting.py", line 127, in test_builtin_containers app = init_ipython_session() File "/tmp/B.267c4rwc/BUILD/sympy-1.7.1/sympy/interactive/session.py", line 237, in init_ipython_session if V(IPython.__version__) >= '0.11': File "/usr/share/python3.10/site-packages/setuptools/_distutils/version.py", line 53, in __init__ warnings.warn( DeprecationWarning: distutils Version classes are deprecated. Use packaging.version instead. ________________________________________________________________________________ __ sympy/interactive/tests/test_ipythonprinting.py:test_matplotlib_bad_latex ___ Traceback (most recent call last): File "/tmp/B.267c4rwc/BUILD/sympy-1.7.1/sympy/interactive/tests/test_ipythonprinting.py", line 168, in test_matplotlib_bad_latex app = init_ipython_session() File "/tmp/B.267c4rwc/BUILD/sympy-1.7.1/sympy/interactive/session.py", line 237, in init_ipython_session if V(IPython.__version__) >= '0.11': File "/usr/share/python3.10/site-packages/setuptools/_distutils/version.py", line 53, in __init__ warnings.warn( DeprecationWarning: distutils Version classes are deprecated. Use packaging.version instead. ________________________________________________________________________________ ___ sympy/interactive/tests/test_ipythonprinting.py:test_override_repr_latex ___ Traceback (most recent call last): File "/tmp/B.267c4rwc/BUILD/sympy-1.7.1/sympy/interactive/tests/test_ipythonprinting.py", line 197, in test_override_repr_latex app = init_ipython_session() File "/tmp/B.267c4rwc/BUILD/sympy-1.7.1/sympy/interactive/session.py", line 237, in init_ipython_session if V(IPython.__version__) >= '0.11': File "/usr/share/python3.10/site-packages/setuptools/_distutils/version.py", line 53, in __init__ warnings.warn( DeprecationWarning: distutils Version classes are deprecated. Use packaging.version instead. ________________________________________________________________________________ ___________ sympy/physics/quantum/tests/test_density.py:test_entropy ___________ Traceback (most recent call last): File "/tmp/B.267c4rwc/BUILD/sympy-1.7.1/sympy/physics/quantum/tests/test_density.py", line 169, in test_entropy np = import_module('numpy', min_module_version='1.4.0') File "/tmp/B.267c4rwc/BUILD/sympy-1.7.1/sympy/external/importtools.py", line 158, in import_module if LooseVersion(modversion) < LooseVersion(min_module_version): File "/usr/share/python3.10/site-packages/setuptools/_distutils/version.py", line 53, in __init__ warnings.warn( DeprecationWarning: distutils Version classes are deprecated. Use packaging.version instead. ________________________________________________________________________________ sympy/physics/quantum/tests/test_identitysearch.py:test_is_scalar_sparse_matrix Traceback (most recent call last): File "/tmp/B.267c4rwc/BUILD/sympy-1.7.1/sympy/physics/quantum/tests/test_identitysearch.py", line 320, in test_is_scalar_sparse_matrix assert is_scalar_sparse_matrix(id_gate, numqubits, id_only) is True File "/tmp/B.267c4rwc/BUILD/sympy-1.7.1/sympy/physics/quantum/identitysearch.py", line 84, in is_scalar_sparse_matrix corrected_imag = corrected_imag * np.complex(1j) File "/usr/lib/python3.10/site-packages/numpy/__init__.py", line 299, in __getattr__ warnings.warn(msg, DeprecationWarning, stacklevel=2) DeprecationWarning: `np.complex` is a deprecated alias for the builtin `complex`. To silence this warning, use `complex` by itself. Doing this will not modify any behavior and is safe. If you specifically wanted the numpy scalar type, use `np.complex128` here. Deprecated in NumPy 1.20; for more details and guidance: https://numpy.org/devdocs/release/1.20.0-notes.html#deprecations ________________________________________________________________________________ _____ sympy/physics/quantum/tests/test_identitysearch.py:test_is_reducible _____ Traceback (most recent call last): File "/tmp/B.267c4rwc/BUILD/sympy-1.7.1/sympy/physics/quantum/tests/test_identitysearch.py", line 372, in test_is_reducible assert is_reducible(circuit, nqubits, 1, 3) is True File "/tmp/B.267c4rwc/BUILD/sympy-1.7.1/sympy/physics/quantum/identitysearch.py", line 750, in is_reducible if (is_scalar_matrix(current_circuit, nqubits, False)): File "/tmp/B.267c4rwc/BUILD/sympy-1.7.1/sympy/physics/quantum/identitysearch.py", line 84, in is_scalar_sparse_matrix corrected_imag = corrected_imag * np.complex(1j) File "/usr/lib/python3.10/site-packages/numpy/__init__.py", line 299, in __getattr__ warnings.warn(msg, DeprecationWarning, stacklevel=2) DeprecationWarning: `np.complex` is a deprecated alias for the builtin `complex`. To silence this warning, use `complex` by itself. Doing this will not modify any behavior and is safe. If you specifically wanted the numpy scalar type, use `np.complex128` here. Deprecated in NumPy 1.20; for more details and guidance: https://numpy.org/devdocs/release/1.20.0-notes.html#deprecations ________________________________________________________________________________ _ sympy/physics/quantum/tests/test_identitysearch.py:test_bfs_identity_search __ Traceback (most recent call last): File "/tmp/B.267c4rwc/BUILD/sympy-1.7.1/sympy/physics/quantum/tests/test_identitysearch.py", line 394, in test_bfs_identity_search assert bfs_identity_search(gate_list, 1, max_depth=2) == id_set File "/tmp/B.267c4rwc/BUILD/sympy-1.7.1/sympy/physics/quantum/identitysearch.py", line 822, in bfs_identity_search if (is_scalar_matrix(new_circuit, nqubits, id_only) and File "/tmp/B.267c4rwc/BUILD/sympy-1.7.1/sympy/physics/quantum/identitysearch.py", line 84, in is_scalar_sparse_matrix corrected_imag = corrected_imag * np.complex(1j) File "/usr/lib/python3.10/site-packages/numpy/__init__.py", line 299, in __getattr__ warnings.warn(msg, DeprecationWarning, stacklevel=2) DeprecationWarning: `np.complex` is a deprecated alias for the builtin `complex`. To silence this warning, use `complex` by itself. Doing this will not modify any behavior and is safe. If you specifically wanted the numpy scalar type, use `np.complex128` here. Deprecated in NumPy 1.20; for more details and guidance: https://numpy.org/devdocs/release/1.20.0-notes.html#deprecations ________________________________________________________________________________ sympy/physics/quantum/tests/test_identitysearch.py:test_bfs_identity_search_xfail Traceback (most recent call last): File "/tmp/B.267c4rwc/BUILD/sympy-1.7.1/sympy/physics/quantum/tests/test_identitysearch.py", line 491, in test_bfs_identity_search_xfail assert bfs_identity_search(gate_list, 1, max_depth=3) == id_set File "/tmp/B.267c4rwc/BUILD/sympy-1.7.1/sympy/physics/quantum/identitysearch.py", line 822, in bfs_identity_search if (is_scalar_matrix(new_circuit, nqubits, id_only) and File "/tmp/B.267c4rwc/BUILD/sympy-1.7.1/sympy/physics/quantum/identitysearch.py", line 84, in is_scalar_sparse_matrix corrected_imag = corrected_imag * np.complex(1j) File "/usr/lib/python3.10/site-packages/numpy/__init__.py", line 299, in __getattr__ warnings.warn(msg, DeprecationWarning, stacklevel=2) DeprecationWarning: `np.complex` is a deprecated alias for the builtin `complex`. To silence this warning, use `complex` by itself. Doing this will not modify any behavior and is safe. If you specifically wanted the numpy scalar type, use `np.complex128` here. Deprecated in NumPy 1.20; for more details and guidance: https://numpy.org/devdocs/release/1.20.0-notes.html#deprecations ________________________________________________________________________________ _____ sympy/plotting/intervalmath/tests/test_intervalmath.py:test_hashable _____ Traceback (most recent call last): File "/tmp/B.267c4rwc/BUILD/sympy-1.7.1/sympy/plotting/pygletplot/tests/test_plotting.py", line 7, in <module> pyglet_window = import_module("pyglet.window", catch=(OSError,)) File "/tmp/B.267c4rwc/BUILD/sympy-1.7.1/sympy/external/importtools.py", line 132, in import_module mod = __import__(module, **import_kwargs) File "/usr/share/python3.10/site-packages/pyglet/window/__init__.py", line 1890, in <module> gl._create_shadow_window() File "/usr/share/python3.10/site-packages/pyglet/gl/__init__.py", line 209, in _create_shadow_window _shadow_window = Window(width=1, height=1, visible=False) File "/usr/share/python3.10/site-packages/pyglet/window/xlib/__init__.py", line 171, in __init__ super(XlibWindow, self).__init__(*args, **kwargs) File "/usr/share/python3.10/site-packages/pyglet/window/__init__.py", line 575, in __init__ display = pyglet.canvas.get_display() File "/usr/share/python3.10/site-packages/pyglet/canvas/__init__.py", line 95, in get_display return Display() File "/usr/share/python3.10/site-packages/pyglet/canvas/xlib.py", line 123, in __init__ raise NoSuchDisplayException('Cannot connect to "%s"' % name) pyglet.canvas.xlib.NoSuchDisplayException: Cannot connect to "None" ________________________________________________________________________________ ____________ sympy/plotting/tests/test_plot.py:test_plot_and_save_1 ____________ Traceback (most recent call last): File "/tmp/B.267c4rwc/BUILD/sympy-1.7.1/sympy/plotting/tests/test_plot.py", line 60, in test_plot_and_save_1 p = plot(x, legend=True, label='f1') File "/tmp/B.267c4rwc/BUILD/sympy-1.7.1/sympy/plotting/plot.py", line 1725, in plot plots.show() File "/tmp/B.267c4rwc/BUILD/sympy-1.7.1/sympy/plotting/plot.py", line 218, in show self._backend = self.backend(self) File "/tmp/B.267c4rwc/BUILD/sympy-1.7.1/sympy/plotting/plot.py", line 1442, in __new__ matplotlib = import_module('matplotlib', min_module_version='1.1.0', catch=(RuntimeError,)) File "/tmp/B.267c4rwc/BUILD/sympy-1.7.1/sympy/external/importtools.py", line 158, in import_module if LooseVersion(modversion) < LooseVersion(min_module_version): File "/usr/share/python3.10/site-packages/setuptools/_distutils/version.py", line 53, in __init__ warnings.warn( DeprecationWarning: distutils Version classes are deprecated. Use packaging.version instead. ________________________________________________________________________________ ____________ sympy/plotting/tests/test_plot.py:test_plot_and_save_2 ____________ Traceback (most recent call last): File "/tmp/B.267c4rwc/BUILD/sympy-1.7.1/sympy/plotting/tests/test_plot.py", line 141, in test_plot_and_save_2 p = plot_parametric(sin(x), cos(x)) File "/tmp/B.267c4rwc/BUILD/sympy-1.7.1/sympy/plotting/plot.py", line 1918, in plot_parametric plots.show() File "/tmp/B.267c4rwc/BUILD/sympy-1.7.1/sympy/plotting/plot.py", line 218, in show self._backend = self.backend(self) File "/tmp/B.267c4rwc/BUILD/sympy-1.7.1/sympy/plotting/plot.py", line 1442, in __new__ matplotlib = import_module('matplotlib', min_module_version='1.1.0', catch=(RuntimeError,)) File "/tmp/B.267c4rwc/BUILD/sympy-1.7.1/sympy/external/importtools.py", line 158, in import_module if LooseVersion(modversion) < LooseVersion(min_module_version): File "/usr/share/python3.10/site-packages/setuptools/_distutils/version.py", line 53, in __init__ warnings.warn( DeprecationWarning: distutils Version classes are deprecated. Use packaging.version instead. ________________________________________________________________________________ ____________ sympy/plotting/tests/test_plot.py:test_plot_and_save_3 ____________ Traceback (most recent call last): File "/tmp/B.267c4rwc/BUILD/sympy-1.7.1/sympy/plotting/tests/test_plot.py", line 263, in test_plot_and_save_3 p = plot(sin(x)) File "/tmp/B.267c4rwc/BUILD/sympy-1.7.1/sympy/plotting/plot.py", line 1725, in plot plots.show() File "/tmp/B.267c4rwc/BUILD/sympy-1.7.1/sympy/plotting/plot.py", line 218, in show self._backend = self.backend(self) File "/tmp/B.267c4rwc/BUILD/sympy-1.7.1/sympy/plotting/plot.py", line 1442, in __new__ matplotlib = import_module('matplotlib', min_module_version='1.1.0', catch=(RuntimeError,)) File "/tmp/B.267c4rwc/BUILD/sympy-1.7.1/sympy/external/importtools.py", line 158, in import_module if LooseVersion(modversion) < LooseVersion(min_module_version): File "/usr/share/python3.10/site-packages/setuptools/_distutils/version.py", line 53, in __init__ warnings.warn( DeprecationWarning: distutils Version classes are deprecated. Use packaging.version instead. ________________________________________________________________________________ ____________ sympy/plotting/tests/test_plot.py:test_plot_and_save_5 ____________ Traceback (most recent call last): File "/tmp/B.267c4rwc/BUILD/sympy-1.7.1/sympy/plotting/tests/test_plot.py", line 367, in test_plot_and_save_5 p = plot(s, (y, 2, 10)) File "/tmp/B.267c4rwc/BUILD/sympy-1.7.1/sympy/plotting/plot.py", line 1725, in plot plots.show() File "/tmp/B.267c4rwc/BUILD/sympy-1.7.1/sympy/plotting/plot.py", line 218, in show self._backend = self.backend(self) File "/tmp/B.267c4rwc/BUILD/sympy-1.7.1/sympy/plotting/plot.py", line 1442, in __new__ matplotlib = import_module('matplotlib', min_module_version='1.1.0', catch=(RuntimeError,)) File "/tmp/B.267c4rwc/BUILD/sympy-1.7.1/sympy/external/importtools.py", line 158, in import_module if LooseVersion(modversion) < LooseVersion(min_module_version): File "/usr/share/python3.10/site-packages/setuptools/_distutils/version.py", line 53, in __init__ warnings.warn( DeprecationWarning: distutils Version classes are deprecated. Use packaging.version instead. ________________________________________________________________________________ ____________ sympy/plotting/tests/test_plot.py:test_plot_and_save_6 ____________ Traceback (most recent call last): File "/tmp/B.267c4rwc/BUILD/sympy-1.7.1/sympy/plotting/tests/test_plot.py", line 392, in test_plot_and_save_6 p = plot(sin(x) + I*cos(x)) File "/tmp/B.267c4rwc/BUILD/sympy-1.7.1/sympy/plotting/plot.py", line 1725, in plot plots.show() File "/tmp/B.267c4rwc/BUILD/sympy-1.7.1/sympy/plotting/plot.py", line 218, in show self._backend = self.backend(self) File "/tmp/B.267c4rwc/BUILD/sympy-1.7.1/sympy/plotting/plot.py", line 1442, in __new__ matplotlib = import_module('matplotlib', min_module_version='1.1.0', catch=(RuntimeError,)) File "/tmp/B.267c4rwc/BUILD/sympy-1.7.1/sympy/external/importtools.py", line 158, in import_module if LooseVersion(modversion) < LooseVersion(min_module_version): File "/usr/share/python3.10/site-packages/setuptools/_distutils/version.py", line 53, in __init__ warnings.warn( DeprecationWarning: distutils Version classes are deprecated. Use packaging.version instead. ________________________________________________________________________________ ___________ sympy/plotting/tests/test_plot.py:test_plotgrid_and_save ___________ Traceback (most recent call last): File "/tmp/B.267c4rwc/BUILD/sympy-1.7.1/sympy/plotting/tests/test_plot.py", line 419, in test_plotgrid_and_save p1 = plot(x) File "/tmp/B.267c4rwc/BUILD/sympy-1.7.1/sympy/plotting/plot.py", line 1725, in plot plots.show() File "/tmp/B.267c4rwc/BUILD/sympy-1.7.1/sympy/plotting/plot.py", line 218, in show self._backend = self.backend(self) File "/tmp/B.267c4rwc/BUILD/sympy-1.7.1/sympy/plotting/plot.py", line 1442, in __new__ matplotlib = import_module('matplotlib', min_module_version='1.1.0', catch=(RuntimeError,)) File "/tmp/B.267c4rwc/BUILD/sympy-1.7.1/sympy/external/importtools.py", line 158, in import_module if LooseVersion(modversion) < LooseVersion(min_module_version): File "/usr/share/python3.10/site-packages/setuptools/_distutils/version.py", line 53, in __init__ warnings.warn( DeprecationWarning: distutils Version classes are deprecated. Use packaging.version instead. ________________________________________________________________________________ ___________ sympy/plotting/tests/test_plot.py:test_append_issue_7140 ___________ Traceback (most recent call last): File "/tmp/B.267c4rwc/BUILD/sympy-1.7.1/sympy/plotting/tests/test_plot.py", line 454, in test_append_issue_7140 p1 = plot(x) File "/tmp/B.267c4rwc/BUILD/sympy-1.7.1/sympy/plotting/plot.py", line 1725, in plot plots.show() File "/tmp/B.267c4rwc/BUILD/sympy-1.7.1/sympy/plotting/plot.py", line 218, in show self._backend = self.backend(self) File "/tmp/B.267c4rwc/BUILD/sympy-1.7.1/sympy/plotting/plot.py", line 1442, in __new__ matplotlib = import_module('matplotlib', min_module_version='1.1.0', catch=(RuntimeError,)) File "/tmp/B.267c4rwc/BUILD/sympy-1.7.1/sympy/external/importtools.py", line 158, in import_module if LooseVersion(modversion) < LooseVersion(min_module_version): File "/usr/share/python3.10/site-packages/setuptools/_distutils/version.py", line 53, in __init__ warnings.warn( DeprecationWarning: distutils Version classes are deprecated. Use packaging.version instead. ________________________________________________________________________________ ______________ sympy/plotting/tests/test_plot.py:test_issue_15265 ______________ Traceback (most recent call last): File "/tmp/B.267c4rwc/BUILD/sympy-1.7.1/sympy/plotting/tests/test_plot.py", line 476, in test_issue_15265 p = plot(eqn, xlim=(-S.Pi, S.Pi), ylim=(-1, 1)) File "/tmp/B.267c4rwc/BUILD/sympy-1.7.1/sympy/plotting/plot.py", line 1725, in plot plots.show() File "/tmp/B.267c4rwc/BUILD/sympy-1.7.1/sympy/plotting/plot.py", line 218, in show self._backend = self.backend(self) File "/tmp/B.267c4rwc/BUILD/sympy-1.7.1/sympy/plotting/plot.py", line 1442, in __new__ matplotlib = import_module('matplotlib', min_module_version='1.1.0', catch=(RuntimeError,)) File "/tmp/B.267c4rwc/BUILD/sympy-1.7.1/sympy/external/importtools.py", line 158, in import_module if LooseVersion(modversion) < LooseVersion(min_module_version): File "/usr/share/python3.10/site-packages/setuptools/_distutils/version.py", line 53, in __init__ warnings.warn( DeprecationWarning: distutils Version classes are deprecated. Use packaging.version instead. ________________________________________________________________________________ ______________ sympy/plotting/tests/test_plot.py:test_empty_Plot _______________ Traceback (most recent call last): File "/tmp/B.267c4rwc/BUILD/sympy-1.7.1/sympy/plotting/tests/test_plot.py", line 506, in test_empty_Plot plot() File "/tmp/B.267c4rwc/BUILD/sympy-1.7.1/sympy/plotting/plot.py", line 1725, in plot plots.show() File "/tmp/B.267c4rwc/BUILD/sympy-1.7.1/sympy/plotting/plot.py", line 218, in show self._backend = self.backend(self) File "/tmp/B.267c4rwc/BUILD/sympy-1.7.1/sympy/plotting/plot.py", line 1442, in __new__ matplotlib = import_module('matplotlib', min_module_version='1.1.0', catch=(RuntimeError,)) File "/tmp/B.267c4rwc/BUILD/sympy-1.7.1/sympy/external/importtools.py", line 158, in import_module if LooseVersion(modversion) < LooseVersion(min_module_version): File "/usr/share/python3.10/site-packages/setuptools/_distutils/version.py", line 53, in __init__ warnings.warn( DeprecationWarning: distutils Version classes are deprecated. Use packaging.version instead. ________________________________________________________________________________ ______________ sympy/plotting/tests/test_plot.py:test_issue_17405 ______________ Traceback (most recent call last): File "/tmp/B.267c4rwc/BUILD/sympy-1.7.1/sympy/plotting/tests/test_plot.py", line 520, in test_issue_17405 assert len(p[0].get_segments()) >= 30 File "/tmp/B.267c4rwc/BUILD/sympy-1.7.1/sympy/plotting/plot.py", line 697, in get_segments sample(np.array([self.start, f_start]), File "/tmp/B.267c4rwc/BUILD/sympy-1.7.1/sympy/plotting/plot.py", line 668, in sample sample(p, new_point, depth + 1) File "/tmp/B.267c4rwc/BUILD/sympy-1.7.1/sympy/plotting/plot.py", line 668, in sample sample(p, new_point, depth + 1) File "/tmp/B.267c4rwc/BUILD/sympy-1.7.1/sympy/plotting/plot.py", line 668, in sample sample(p, new_point, depth + 1) [Previous line repeated 3 more times] File "/tmp/B.267c4rwc/BUILD/sympy-1.7.1/sympy/plotting/plot.py", line 690, in sample sample(p, new_point, depth + 1) File "/tmp/B.267c4rwc/BUILD/sympy-1.7.1/sympy/plotting/plot.py", line 690, in sample sample(p, new_point, depth + 1) File "/tmp/B.267c4rwc/BUILD/sympy-1.7.1/sympy/plotting/plot.py", line 690, in sample sample(p, new_point, depth + 1) [Previous line repeated 2 more times] File "/tmp/B.267c4rwc/BUILD/sympy-1.7.1/sympy/plotting/plot.py", line 691, in sample sample(new_point, q, depth + 1) File "/tmp/B.267c4rwc/BUILD/sympy-1.7.1/sympy/plotting/plot.py", line 689, in sample or not flat(p, new_point, q)): File "/tmp/B.267c4rwc/BUILD/sympy-1.7.1/sympy/plotting/plot.py", line 1481, in flat vector_a = (x - y).astype(np.float) File "/usr/lib/python3.10/site-packages/numpy/__init__.py", line 299, in __getattr__ warnings.warn(msg, DeprecationWarning, stacklevel=2) DeprecationWarning: `np.float` is a deprecated alias for the builtin `float`. To silence this warning, use `float` by itself. Doing this will not modify any behavior and is safe. If you specifically wanted the numpy scalar type, use `np.float64` here. Deprecated in NumPy 1.20; for more details and guidance: https://numpy.org/devdocs/release/1.20.0-notes.html#deprecations ________________________________________________________________________________ ___________ sympy/plotting/tests/test_plot.py:test_logplot_PR_16796 ____________ Traceback (most recent call last): File "/tmp/B.267c4rwc/BUILD/sympy-1.7.1/sympy/plotting/tests/test_plot.py", line 531, in test_logplot_PR_16796 assert len(p[0].get_segments()) >= 30 File "/tmp/B.267c4rwc/BUILD/sympy-1.7.1/sympy/plotting/plot.py", line 697, in get_segments sample(np.array([self.start, f_start]), File "/tmp/B.267c4rwc/BUILD/sympy-1.7.1/sympy/plotting/plot.py", line 668, in sample sample(p, new_point, depth + 1) File "/tmp/B.267c4rwc/BUILD/sympy-1.7.1/sympy/plotting/plot.py", line 668, in sample sample(p, new_point, depth + 1) File "/tmp/B.267c4rwc/BUILD/sympy-1.7.1/sympy/plotting/plot.py", line 668, in sample sample(p, new_point, depth + 1) [Previous line repeated 3 more times] File "/tmp/B.267c4rwc/BUILD/sympy-1.7.1/sympy/plotting/plot.py", line 689, in sample or not flat(p, new_point, q)): File "/tmp/B.267c4rwc/BUILD/sympy-1.7.1/sympy/plotting/plot.py", line 1481, in flat vector_a = (x - y).astype(np.float) File "/usr/lib/python3.10/site-packages/numpy/__init__.py", line 299, in __getattr__ warnings.warn(msg, DeprecationWarning, stacklevel=2) DeprecationWarning: `np.float` is a deprecated alias for the builtin `float`. To silence this warning, use `float` by itself. Doing this will not modify any behavior and is safe. If you specifically wanted the numpy scalar type, use `np.float64` here. Deprecated in NumPy 1.20; for more details and guidance: https://numpy.org/devdocs/release/1.20.0-notes.html#deprecations ________________________________________________________________________________ ______________ sympy/plotting/tests/test_plot.py:test_issue_16572 ______________ Traceback (most recent call last): File "/tmp/B.267c4rwc/BUILD/sympy-1.7.1/sympy/plotting/tests/test_plot.py", line 544, in test_issue_16572 assert len(p[0].get_segments()) >= 30 File "/tmp/B.267c4rwc/BUILD/sympy-1.7.1/sympy/plotting/plot.py", line 697, in get_segments sample(np.array([self.start, f_start]), File "/tmp/B.267c4rwc/BUILD/sympy-1.7.1/sympy/plotting/plot.py", line 668, in sample sample(p, new_point, depth + 1) File "/tmp/B.267c4rwc/BUILD/sympy-1.7.1/sympy/plotting/plot.py", line 669, in sample sample(new_point, q, depth + 1) File "/tmp/B.267c4rwc/BUILD/sympy-1.7.1/sympy/plotting/plot.py", line 669, in sample sample(new_point, q, depth + 1) File "/tmp/B.267c4rwc/BUILD/sympy-1.7.1/sympy/plotting/plot.py", line 669, in sample sample(new_point, q, depth + 1) File "/tmp/B.267c4rwc/BUILD/sympy-1.7.1/sympy/plotting/plot.py", line 668, in sample sample(p, new_point, depth + 1) File "/tmp/B.267c4rwc/BUILD/sympy-1.7.1/sympy/plotting/plot.py", line 668, in sample sample(p, new_point, depth + 1) File "/tmp/B.267c4rwc/BUILD/sympy-1.7.1/sympy/plotting/plot.py", line 690, in sample sample(p, new_point, depth + 1) File "/tmp/B.267c4rwc/BUILD/sympy-1.7.1/sympy/plotting/plot.py", line 691, in sample sample(new_point, q, depth + 1) File "/tmp/B.267c4rwc/BUILD/sympy-1.7.1/sympy/plotting/plot.py", line 690, in sample sample(p, new_point, depth + 1) File "/tmp/B.267c4rwc/BUILD/sympy-1.7.1/sympy/plotting/plot.py", line 691, in sample sample(new_point, q, depth + 1) File "/tmp/B.267c4rwc/BUILD/sympy-1.7.1/sympy/plotting/plot.py", line 691, in sample sample(new_point, q, depth + 1) File "/tmp/B.267c4rwc/BUILD/sympy-1.7.1/sympy/plotting/plot.py", line 689, in sample or not flat(p, new_point, q)): File "/tmp/B.267c4rwc/BUILD/sympy-1.7.1/sympy/plotting/plot.py", line 1481, in flat vector_a = (x - y).astype(np.float) File "/usr/lib/python3.10/site-packages/numpy/__init__.py", line 299, in __getattr__ warnings.warn(msg, DeprecationWarning, stacklevel=2) DeprecationWarning: `np.float` is a deprecated alias for the builtin `float`. To silence this warning, use `float` by itself. Doing this will not modify any behavior and is safe. If you specifically wanted the numpy scalar type, use `np.float64` here. Deprecated in NumPy 1.20; for more details and guidance: https://numpy.org/devdocs/release/1.20.0-notes.html#deprecations ________________________________________________________________________________ ______________ sympy/plotting/tests/test_plot.py:test_issue_11865 ______________ Traceback (most recent call last): File "/tmp/B.267c4rwc/BUILD/sympy-1.7.1/sympy/plotting/tests/test_plot.py", line 557, in test_issue_11865 assert len(p[0].get_segments()) >= 30 File "/tmp/B.267c4rwc/BUILD/sympy-1.7.1/sympy/plotting/plot.py", line 697, in get_segments sample(np.array([self.start, f_start]), File "/tmp/B.267c4rwc/BUILD/sympy-1.7.1/sympy/plotting/plot.py", line 668, in sample sample(p, new_point, depth + 1) File "/tmp/B.267c4rwc/BUILD/sympy-1.7.1/sympy/plotting/plot.py", line 668, in sample sample(p, new_point, depth + 1) File "/tmp/B.267c4rwc/BUILD/sympy-1.7.1/sympy/plotting/plot.py", line 668, in sample sample(p, new_point, depth + 1) [Previous line repeated 3 more times] File "/tmp/B.267c4rwc/BUILD/sympy-1.7.1/sympy/plotting/plot.py", line 689, in sample or not flat(p, new_point, q)): File "/tmp/B.267c4rwc/BUILD/sympy-1.7.1/sympy/plotting/plot.py", line 1481, in flat vector_a = (x - y).astype(np.float) File "/usr/lib/python3.10/site-packages/numpy/__init__.py", line 299, in __getattr__ warnings.warn(msg, DeprecationWarning, stacklevel=2) DeprecationWarning: `np.float` is a deprecated alias for the builtin `float`. To silence this warning, use `float` by itself. Doing this will not modify any behavior and is safe. If you specifically wanted the numpy scalar type, use `np.float64` here. Deprecated in NumPy 1.20; for more details and guidance: https://numpy.org/devdocs/release/1.20.0-notes.html#deprecations ________________________________________________________________________________ ______________ sympy/plotting/tests/test_plot.py:test_issue_11461 ______________ Traceback (most recent call last): File "/tmp/B.267c4rwc/BUILD/sympy-1.7.1/sympy/plotting/tests/test_plot.py", line 569, in test_issue_11461 assert len(p[0].get_segments()) >= 30 File "/tmp/B.267c4rwc/BUILD/sympy-1.7.1/sympy/plotting/plot.py", line 697, in get_segments sample(np.array([self.start, f_start]), File "/tmp/B.267c4rwc/BUILD/sympy-1.7.1/sympy/plotting/plot.py", line 668, in sample sample(p, new_point, depth + 1) File "/tmp/B.267c4rwc/BUILD/sympy-1.7.1/sympy/plotting/plot.py", line 668, in sample sample(p, new_point, depth + 1) File "/tmp/B.267c4rwc/BUILD/sympy-1.7.1/sympy/plotting/plot.py", line 668, in sample sample(p, new_point, depth + 1) [Previous line repeated 3 more times] File "/tmp/B.267c4rwc/BUILD/sympy-1.7.1/sympy/plotting/plot.py", line 689, in sample or not flat(p, new_point, q)): File "/tmp/B.267c4rwc/BUILD/sympy-1.7.1/sympy/plotting/plot.py", line 1481, in flat vector_a = (x - y).astype(np.float) File "/usr/lib/python3.10/site-packages/numpy/__init__.py", line 299, in __getattr__ warnings.warn(msg, DeprecationWarning, stacklevel=2) DeprecationWarning: `np.float` is a deprecated alias for the builtin `float`. To silence this warning, use `float` by itself. Doing this will not modify any behavior and is safe. If you specifically wanted the numpy scalar type, use `np.float64` here. Deprecated in NumPy 1.20; for more details and guidance: https://numpy.org/devdocs/release/1.20.0-notes.html#deprecations ________________________________________________________________________________ ______________ sympy/plotting/tests/test_plot.py:test_issue_11764 ______________ Traceback (most recent call last): File "/tmp/B.267c4rwc/BUILD/sympy-1.7.1/sympy/plotting/tests/test_plot.py", line 581, in test_issue_11764 assert len(p[0].get_segments()) >= 30 File "/tmp/B.267c4rwc/BUILD/sympy-1.7.1/sympy/plotting/plot.py", line 836, in get_segments sample(self.start, self.end, start, end, 0) File "/tmp/B.267c4rwc/BUILD/sympy-1.7.1/sympy/plotting/plot.py", line 799, in sample sample(param_p, param_new, p, new_point, depth + 1) File "/tmp/B.267c4rwc/BUILD/sympy-1.7.1/sympy/plotting/plot.py", line 799, in sample sample(param_p, param_new, p, new_point, depth + 1) File "/tmp/B.267c4rwc/BUILD/sympy-1.7.1/sympy/plotting/plot.py", line 799, in sample sample(param_p, param_new, p, new_point, depth + 1) [Previous line repeated 3 more times] File "/tmp/B.267c4rwc/BUILD/sympy-1.7.1/sympy/plotting/plot.py", line 824, in sample or not flat(p, new_point, q)): File "/tmp/B.267c4rwc/BUILD/sympy-1.7.1/sympy/plotting/plot.py", line 1481, in flat vector_a = (x - y).astype(np.float) File "/usr/lib/python3.10/site-packages/numpy/__init__.py", line 299, in __getattr__ warnings.warn(msg, DeprecationWarning, stacklevel=2) DeprecationWarning: `np.float` is a deprecated alias for the builtin `float`. To silence this warning, use `float` by itself. Doing this will not modify any behavior and is safe. If you specifically wanted the numpy scalar type, use `np.float64` here. Deprecated in NumPy 1.20; for more details and guidance: https://numpy.org/devdocs/release/1.20.0-notes.html#deprecations ________________________________________________________________________________ ______________ sympy/plotting/tests/test_plot.py:test_issue_13516 ______________ Traceback (most recent call last): File "/tmp/B.267c4rwc/BUILD/sympy-1.7.1/sympy/plotting/tests/test_plot.py", line 592, in test_issue_13516 assert len(pm[0].get_segments()) >= 30 File "/tmp/B.267c4rwc/BUILD/sympy-1.7.1/sympy/plotting/plot.py", line 697, in get_segments sample(np.array([self.start, f_start]), File "/tmp/B.267c4rwc/BUILD/sympy-1.7.1/sympy/plotting/plot.py", line 668, in sample sample(p, new_point, depth + 1) File "/tmp/B.267c4rwc/BUILD/sympy-1.7.1/sympy/plotting/plot.py", line 668, in sample sample(p, new_point, depth + 1) File "/tmp/B.267c4rwc/BUILD/sympy-1.7.1/sympy/plotting/plot.py", line 668, in sample sample(p, new_point, depth + 1) [Previous line repeated 3 more times] File "/tmp/B.267c4rwc/BUILD/sympy-1.7.1/sympy/plotting/plot.py", line 689, in sample or not flat(p, new_point, q)): File "/tmp/B.267c4rwc/BUILD/sympy-1.7.1/sympy/plotting/plot.py", line 1481, in flat vector_a = (x - y).astype(np.float) File "/usr/lib/python3.10/site-packages/numpy/__init__.py", line 299, in __getattr__ warnings.warn(msg, DeprecationWarning, stacklevel=2) DeprecationWarning: `np.float` is a deprecated alias for the builtin `float`. To silence this warning, use `float` by itself. Doing this will not modify any behavior and is safe. If you specifically wanted the numpy scalar type, use `np.float64` here. Deprecated in NumPy 1.20; for more details and guidance: https://numpy.org/devdocs/release/1.20.0-notes.html#deprecations ________________________________________________________________________________ ______________ sympy/plotting/tests/test_plot.py:test_plot_limits ______________ Traceback (most recent call last): File "/tmp/B.267c4rwc/BUILD/sympy-1.7.1/sympy/plotting/tests/test_plot.py", line 612, in test_plot_limits p = plot(x, x**2, (x, -10, 10)) File "/tmp/B.267c4rwc/BUILD/sympy-1.7.1/sympy/plotting/plot.py", line 1725, in plot plots.show() File "/tmp/B.267c4rwc/BUILD/sympy-1.7.1/sympy/plotting/plot.py", line 218, in show self._backend = self.backend(self) File "/tmp/B.267c4rwc/BUILD/sympy-1.7.1/sympy/plotting/plot.py", line 1442, in __new__ matplotlib = import_module('matplotlib', min_module_version='1.1.0', catch=(RuntimeError,)) File "/tmp/B.267c4rwc/BUILD/sympy-1.7.1/sympy/external/importtools.py", line 158, in import_module if LooseVersion(modversion) < LooseVersion(min_module_version): File "/usr/share/python3.10/site-packages/setuptools/_distutils/version.py", line 53, in __init__ warnings.warn( DeprecationWarning: distutils Version classes are deprecated. Use packaging.version instead. ________________________________________________________________________________ _____ sympy/plotting/tests/test_plot.py:test_plot3d_parametric_line_limits _____ Traceback (most recent call last): File "/tmp/B.267c4rwc/BUILD/sympy-1.7.1/sympy/plotting/tests/test_plot.py", line 631, in test_plot3d_parametric_line_limits p = plot3d_parametric_line(v1, v2) File "/tmp/B.267c4rwc/BUILD/sympy-1.7.1/sympy/plotting/plot.py", line 2036, in plot3d_parametric_line plots.show() File "/tmp/B.267c4rwc/BUILD/sympy-1.7.1/sympy/plotting/plot.py", line 218, in show self._backend = self.backend(self) File "/tmp/B.267c4rwc/BUILD/sympy-1.7.1/sympy/plotting/plot.py", line 1442, in __new__ matplotlib = import_module('matplotlib', min_module_version='1.1.0', catch=(RuntimeError,)) File "/tmp/B.267c4rwc/BUILD/sympy-1.7.1/sympy/external/importtools.py", line 158, in import_module if LooseVersion(modversion) < LooseVersion(min_module_version): File "/usr/share/python3.10/site-packages/setuptools/_distutils/version.py", line 53, in __init__ warnings.warn( DeprecationWarning: distutils Version classes are deprecated. Use packaging.version instead. ________________________________________________________________________________ _______________ sympy/plotting/tests/test_plot.py:test_plot_size _______________ Traceback (most recent call last): File "/tmp/B.267c4rwc/BUILD/sympy-1.7.1/sympy/plotting/tests/test_plot.py", line 663, in test_plot_size p1 = plot(sin(x), backend="matplotlib", size=(8, 4)) File "/tmp/B.267c4rwc/BUILD/sympy-1.7.1/sympy/plotting/plot.py", line 1725, in plot plots.show() File "/tmp/B.267c4rwc/BUILD/sympy-1.7.1/sympy/plotting/plot.py", line 218, in show self._backend = self.backend(self) File "/tmp/B.267c4rwc/BUILD/sympy-1.7.1/sympy/plotting/plot.py", line 1173, in __init__ self.matplotlib = import_module('matplotlib', File "/tmp/B.267c4rwc/BUILD/sympy-1.7.1/sympy/external/importtools.py", line 158, in import_module if LooseVersion(modversion) < LooseVersion(min_module_version): File "/usr/share/python3.10/site-packages/setuptools/_distutils/version.py", line 53, in __init__ warnings.warn( DeprecationWarning: distutils Version classes are deprecated. Use packaging.version instead. ________________________________________________________________________________ ______________ sympy/plotting/tests/test_plot.py:test_issue_20113 ______________ Traceback (most recent call last): File "/tmp/B.267c4rwc/BUILD/sympy-1.7.1/sympy/plotting/tests/test_plot.py", line 687, in test_issue_20113 assert len(p2[0].get_segments()) >= 30 File "/tmp/B.267c4rwc/BUILD/sympy-1.7.1/sympy/plotting/plot.py", line 697, in get_segments sample(np.array([self.start, f_start]), File "/tmp/B.267c4rwc/BUILD/sympy-1.7.1/sympy/plotting/plot.py", line 668, in sample sample(p, new_point, depth + 1) File "/tmp/B.267c4rwc/BUILD/sympy-1.7.1/sympy/plotting/plot.py", line 668, in sample sample(p, new_point, depth + 1) File "/tmp/B.267c4rwc/BUILD/sympy-1.7.1/sympy/plotting/plot.py", line 668, in sample sample(p, new_point, depth + 1) [Previous line repeated 3 more times] File "/tmp/B.267c4rwc/BUILD/sympy-1.7.1/sympy/plotting/plot.py", line 689, in sample or not flat(p, new_point, q)): File "/tmp/B.267c4rwc/BUILD/sympy-1.7.1/sympy/plotting/plot.py", line 1481, in flat vector_a = (x - y).astype(np.float) File "/usr/lib/python3.10/site-packages/numpy/__init__.py", line 299, in __getattr__ warnings.warn(msg, DeprecationWarning, stacklevel=2) DeprecationWarning: `np.float` is a deprecated alias for the builtin `float`. To silence this warning, use `float` by itself. Doing this will not modify any behavior and is safe. If you specifically wanted the numpy scalar type, use `np.float64` here. Deprecated in NumPy 1.20; for more details and guidance: https://numpy.org/devdocs/release/1.20.0-notes.html#deprecations ________________________________________________________________________________ __________ sympy/plotting/tests/test_plot_implicit.py:test_matplotlib __________ Traceback (most recent call last): File "/tmp/B.267c4rwc/BUILD/sympy-1.7.1/sympy/plotting/tests/test_plot_implicit.py", line 72, in test_matplotlib matplotlib = import_module('matplotlib', min_module_version='1.1.0', catch=(RuntimeError,)) File "/tmp/B.267c4rwc/BUILD/sympy-1.7.1/sympy/external/importtools.py", line 158, in import_module if LooseVersion(modversion) < LooseVersion(min_module_version): File "/usr/share/python3.10/site-packages/setuptools/_distutils/version.py", line 53, in __init__ warnings.warn( DeprecationWarning: distutils Version classes are deprecated. Use packaging.version instead. ________________________________________________________________________________ __________ sympy/plotting/tests/test_plot_implicit.py:test_region_and __________ Traceback (most recent call last): File "/tmp/B.267c4rwc/BUILD/sympy-1.7.1/sympy/plotting/tests/test_plot_implicit.py", line 84, in test_region_and matplotlib = import_module('matplotlib', min_module_version='1.1.0', catch=(RuntimeError,)) File "/tmp/B.267c4rwc/BUILD/sympy-1.7.1/sympy/external/importtools.py", line 158, in import_module if LooseVersion(modversion) < LooseVersion(min_module_version): File "/usr/share/python3.10/site-packages/setuptools/_distutils/version.py", line 53, in __init__ warnings.warn( DeprecationWarning: distutils Version classes are deprecated. Use packaging.version instead. tests finished: 9267 passed, 260 skipped, 350 expected to fail, 7 expected to fail but passed, 39 exceptions, in 4475.82 seconds DO *NOT* COMMIT! ============================= test process starts ============================== executable: /usr/bin/python3 (3.10.4-final-0) [CPython] architecture: 32-bit cache: yes ground types: python numpy: 1.22.2 hash randomization: on (PYTHONHASHSEED=2698231997) sympy/abc.py[1] . [OK] sympy/algebras/quaternion.py[14] .............. [OK] sympy/assumptions/ask.py[39] ....................................... [OK] sympy/assumptions/assume.py[5] ..... [OK] sympy/assumptions/refine.py[9] ......... [OK] sympy/assumptions/sathandlers.py[3] ... [OK] sympy/assumptions/handlers/calculus.py[2] .. [OK] sympy/assumptions/handlers/order.py[1] . [OK] sympy/calculus/euler.py[1] . [OK] sympy/calculus/finite_diff.py[4] .... [OK] sympy/calculus/singularities.py[6] ...... [OK] sympy/calculus/util.py[16] ................ [OK] sympy/categories/baseclasses.py[23] ....................... [OK] sympy/categories/diagram_drawing.py[11] Traceback (most recent call last): File "/usr/share/python3.10/site-packages/pyglet/__init__.py", line 367, in __setattr__ setattr(self._module, name, value) AttributeError: 'NoneType' object has no attribute 'Window' During handling of the above exception, another exception occurred: Traceback (most recent call last): File "<string>", line 1, in <module> File "/tmp/B.267c4rwc/BUILD/sympy-1.7.1/sympy/testing/runtests.py", line 834, in _doctest failed = not t.test() File "/tmp/B.267c4rwc/BUILD/sympy-1.7.1/sympy/testing/runtests.py", line 1391, in test self.test_file(f) File "/tmp/B.267c4rwc/BUILD/sympy-1.7.1/sympy/testing/runtests.py", line 1446, in test_file self._check_dependencies(**test.globs['_doctest_depends_on']) File "/tmp/B.267c4rwc/BUILD/sympy-1.7.1/sympy/testing/runtests.py", line 1596, in _check_dependencies pyglet.window.Window = DummyWindow File "/usr/share/python3.10/site-packages/pyglet/__init__.py", line 373, in __setattr__ __import__(import_name) File "/usr/share/python3.10/site-packages/pyglet/window/__init__.py", line 1890, in <module> gl._create_shadow_window() File "/usr/share/python3.10/site-packages/pyglet/gl/__init__.py", line 209, in _create_shadow_window _shadow_window = Window(width=1, height=1, visible=False) File "/usr/share/python3.10/site-packages/pyglet/window/xlib/__init__.py", line 171, in __init__ super(XlibWindow, self).__init__(*args, **kwargs) File "/usr/share/python3.10/site-packages/pyglet/window/__init__.py", line 575, in __init__ display = pyglet.canvas.get_display() File "/usr/share/python3.10/site-packages/pyglet/canvas/__init__.py", line 95, in get_display return Display() File "/usr/share/python3.10/site-packages/pyglet/canvas/xlib.py", line 123, in __init__ raise NoSuchDisplayException('Cannot connect to "%s"' % name) pyglet.canvas.xlib.NoSuchDisplayException: Cannot connect to "None" Testing Examples -------------------------------------------------------------------------------- beginner.basic [PASS] beginner.differentiation [PASS] beginner.expansion [PASS] beginner.functions [PASS] beginner.limits_examples [PASS] beginner.precision [PASS] beginner.print_pretty [PASS] beginner.series [PASS] beginner.substitution [PASS] intermediate.coupled_cluster [PASS] intermediate.differential_equations [PASS] intermediate.infinite_1d_box [PASS] intermediate.partial_differential_eqs [PASS] intermediate.trees [PASS] intermediate.vandermonde [PASS] advanced.curvilinear_coordinates [PASS] advanced.dense_coding_example [PASS] advanced.fem [PASS] advanced.gibbs_phenomenon [PASS] advanced.grover_example [PASS] advanced.hydrogen [PASS] advanced.pidigits [PASS] advanced.qft [PASS] advanced.relativity [PASS] -------------------------------------------------------------------------------- ALL EXAMPLES PASSED error: Bad exit status from /tmp/B.267c4rwc/BUILD/tmp/rpm-tmp.q5H4kV (%build) RPM build errors: Could not canonicalize hostname: nereid Bad exit status from /tmp/B.267c4rwc/BUILD/tmp/rpm-tmp.q5H4kV (%build) ended at: Sun May 1 12:32:47 2022, done in 1:17:54.174333 error: No files produced. + chmod -R u+rwX /tmp/B.267c4rwc/BUILD + rm -rf /tmp/B.267c4rwc/tmp /tmp/B.267c4rwc/BUILD + rm -rf /tmp/B.267c4rwc Begin-PLD-Builder-Info Build-Time: user:4677.42s sys:19.00s real:4699.54s (faults io:144 non-io:2192066) End-PLD-Builder-Info
[Back to list of logs] [View rpm -qa of builder]