FailedOk

th/SRPMS[OK]
th/x32[OK]
th/i686[OK]
th/x86_64[OK]

ac/SRPMS[OK]
ac/i386[OK]
ac/i586[OK]
ac/i686[OK]
ac/alpha[OK]
ac/amd64[OK]
ac/athlon[OK]
ac/ppc[OK]
ac/sparc[OK]
ac/sparc64[OK]

Advanced Search
main()
Powered by PLD Linux
(c) 2002-2021 PLD Team
$Revision: 1.37 $
Powered by Real Operating System.
Your IP: 34.207.230.188

python3-numpy 8f16db32-d693-49fa-9a4b-f328f4c6bc80

Status:Failed
Source URL:https://buildlogs.pld-linux.org/pld/th/i686/FAIL/python3-numpy,8f16db32-d693-49fa-9a4b-f328f4c6bc80.bz2
text/plain URL:View!
full text:View!
rpm -qa of builder:View!
Date:2021/11/21 06:29:37
Runtime:0:13:28.481971

Toc:

  • error 1
  • /tmp/B.ixzp66fn/BUILD/tmp/tmp3ivcwr_d/source.c:6: undefined reference to `cblas_ddot'
  • error 2
  • collect2: error: ld returned 1 exit status
  • error 3
  • E numpy.linalg.LinAlgError: SVD did not converge
  • error 4
  • error: Bad exit status from /tmp/B.ixzp66fn/BUILD/tmp/rpm-tmp.4Tf1C3 (%build)
  • error 5
  • RPM build errors:
  • error 6
  • error: No files produced.

Content:

+ umask 022
+ cd /tmp/B.ixzp66fn/BUILD
+ cd /tmp/B.ixzp66fn/BUILD
+ rm -rf numpy-1.19.4
+ /bin/gzip -dc /tmp/B.ixzp66fn/numpy-1.19.4.tar.gz
+ /bin/tar -xof -
+ STATUS=0 
+ '[' 0 -ne 0 ']'
+ cd numpy-1.19.4
+ /bin/chmod -Rf a+rX,u+w,g-w,o-w .
+ RPM_EC=0 
+ jobs -p
+ exit 0
Executing(%build): /bin/sh -e /tmp/B.ixzp66fn/BUILD/tmp/rpm-tmp.4Tf1C3
TMP=/home/users/builder/tmp
HOME=/home/users/builder
PATH=/home/users/builder/GNUstep/Tools:/bin:/usr/bin:/usr/local/bin:/home/users/builder/bin
TMPDIR=/tmp/B.ixzp66fn/BUILD/tmp
+ umask 022
+ cd /tmp/B.ixzp66fn/BUILD
+ cd numpy-1.19.4
+ CFLAGS='-O2 -fwrapv -pipe -Wformat -Werror=format-security -gdwarf-4 -fno-debug-types-section -fvar-tracking-assignments -g2 -Wp,-D_FORTIFY_SOURCE=2 -fstack-protector-strong --param=ssp-buffer-size=4 -Werror=trampolines -fomit-frame-pointer -march=i686 -fasynchronous-unwind-tables -mtune=pentium4 -gdwarf-4 -fno-debug-types-section -fvar-tracking-assignments -g2  -fPIC' 
+ LDFLAGS='-Wl,--as-needed -Wl,--no-copy-dt-needed-entries -Wl,-z,relro -Wl,-z,combreloc  -shared' 
+ LDFLAGS='-Wl,--as-needed -Wl,--no-copy-dt-needed-entries -Wl,-z,relro -Wl,-z,combreloc  -shared' 
+ export LDFLAGS
+ CFLAGS='-O2 -fwrapv -pipe -Wformat -Werror=format-security -gdwarf-4 -fno-debug-types-section -fvar-tracking-assignments -g2 -Wp,-D_FORTIFY_SOURCE=2 -fstack-protector-strong --param=ssp-buffer-size=4 -Werror=trampolines -fomit-frame-pointer -march=i686 -fasynchronous-unwind-tables -mtune=pentium4 -gdwarf-4 -fno-debug-types-section -fvar-tracking-assignments -g2  -fPIC' 
+ export CFLAGS
+ CXXFLAGS=' -O2 -fwrapv -pipe -Wformat -Werror=format-security -gdwarf-4 -fno-debug-types-section -fvar-tracking-assignments -g2 -Wp,-D_FORTIFY_SOURCE=2 -fstack-protector-strong --param=ssp-buffer-size=4 -Werror=trampolines -fomit-frame-pointer -march=i686 -fasynchronous-unwind-tables -mtune=pentium4 -gdwarf-4 -fno-debug-types-section -fvar-tracking-assignments -g2 ' 
+ export CXXFLAGS
+ CC=i686-pld-linux-gcc 
+ export CC
+ CXX=i686-pld-linux-g++ 
+ export CXX
+ /usr/bin/python3 setup.py build '--build-base=build-3'
Running from numpy source directory.
Processing numpy/random/_bounded_integers.pxd.in
Processing numpy/random/_bounded_integers.pyx.in
Processing numpy/random/_common.pyx
Processing numpy/random/_generator.pyx
Processing numpy/random/_mt19937.pyx
Processing numpy/random/_pcg64.pyx
Processing numpy/random/_philox.pyx
Processing numpy/random/_sfc64.pyx
Processing numpy/random/bit_generator.pyx
Processing numpy/random/mtrand.pyx
Cythonizing sources
blas_opt_info:
blas_mkl_info:
customize UnixCCompiler
  libraries mkl_rt not found in ['/usr/local/lib', '/usr/lib', '/usr/lib/']
  NOT AVAILABLE

blis_info:
  libraries blis not found in ['/usr/local/lib', '/usr/lib', '/usr/lib/']
  NOT AVAILABLE

openblas_info:
  libraries openblas not found in ['/usr/local/lib', '/usr/lib', '/usr/lib/']
  NOT AVAILABLE

atlas_3_10_blas_threads_info:
Setting PTATLAS=ATLAS
  libraries tatlas not found in ['/usr/local/lib', '/usr/lib', '/usr/lib/']
  NOT AVAILABLE

atlas_3_10_blas_info:
  libraries satlas not found in ['/usr/local/lib', '/usr/lib', '/usr/lib/']
  NOT AVAILABLE

atlas_blas_threads_info:
Setting PTATLAS=ATLAS
  libraries ptf77blas,ptcblas,atlas not found in ['/usr/local/lib', '/usr/lib', '/usr/lib/']
  NOT AVAILABLE

atlas_blas_info:
  libraries f77blas,cblas,atlas not found in ['/usr/local/lib', '/usr/lib', '/usr/lib/']
  NOT AVAILABLE

accelerate_info:
  NOT AVAILABLE

/tmp/B.ixzp66fn/BUILD/numpy-1.19.4/numpy/distutils/system_info.py:1914: UserWarning: 
    Optimized (vendor) Blas libraries are not found.
    Falls back to netlib Blas library which has worse performance.
    A better performance should be easily gained by switching
    Blas library.
  if self._calc_info(blas):
blas_info:
C compiler: i686-pld-linux-gcc -Wno-unused-result -Wsign-compare -DNDEBUG -O2 -fwrapv -pipe -Wformat -Werror=format-security -gdwarf-4 -fno-debug-types-section -fvar-tracking-assignments -g2 -Wp,-D_FORTIFY_SOURCE=2 -fstack-protector-strong --param=ssp-buffer-size=4 -Werror=trampolines -fomit-frame-pointer -march=i686 -fasynchronous-unwind-tables -mtune=pentium4 -gdwarf-4 -fno-debug-types-section -fvar-tracking-assignments -g2 -O2 -fwrapv -pipe -Wformat -Werror=format-security -gdwarf-4 -fno-debug-types-section -fvar-tracking-assignments -g2 -Wp,-D_FORTIFY_SOURCE=2 -fstack-protector-strong --param=ssp-buffer-size=4 -Werror=trampolines -fomit-frame-pointer -march=i686 -fasynchronous-unwind-tables -mtune=pentium4 -gdwarf-4 -fno-debug-types-section -fvar-tracking-assignments -g2 -O2 -fwrapv -pipe -Wformat -Werror=format-security -gdwarf-4 -fno-debug-types-section -fvar-tracking-assignments -g2 -Wp,-D_FORTIFY_SOURCE=2 -fstack-protector-strong --param=ssp-buffer-size=4 -Werror=trampolines -fomit-frame-pointer -march=i686 -fasynchronous-unwind-tables -mtune=pentium4 -gdwarf-4 -fno-debug-types-section -fvar-tracking-assignments -g2 -fPIC -fPIC

creating /tmp/B.ixzp66fn/BUILD/tmp/tmp3ivcwr_d/tmp
creating /tmp/B.ixzp66fn/BUILD/tmp/tmp3ivcwr_d/tmp/B.ixzp66fn
creating /tmp/B.ixzp66fn/BUILD/tmp/tmp3ivcwr_d/tmp/B.ixzp66fn/BUILD
creating /tmp/B.ixzp66fn/BUILD/tmp/tmp3ivcwr_d/tmp/B.ixzp66fn/BUILD/tmp
creating /tmp/B.ixzp66fn/BUILD/tmp/tmp3ivcwr_d/tmp/B.ixzp66fn/BUILD/tmp/tmp3ivcwr_d
compile options: '-I/usr/local/include -I/usr/include -c'
i686-pld-linux-gcc: /tmp/B.ixzp66fn/BUILD/tmp/tmp3ivcwr_d/source.c
i686-pld-linux-gcc /tmp/B.ixzp66fn/BUILD/tmp/tmp3ivcwr_d/tmp/B.ixzp66fn/BUILD/tmp/tmp3ivcwr_d/source.o -L/usr/lib -lblas -o /tmp/B.ixzp66fn/BUILD/tmp/tmp3ivcwr_d/a.out
/usr/bin/ld: /tmp/B.ixzp66fn/BUILD/tmp/tmp3ivcwr_d/tmp/B.ixzp66fn/BUILD/tmp/tmp3ivcwr_d/source.o: in function `main':
/tmp/B.ixzp66fn/BUILD/tmp/tmp3ivcwr_d/source.c:6: undefined reference to `cblas_ddot'
collect2: error: ld returned 1 exit status
i686-pld-linux-gcc /tmp/B.ixzp66fn/BUILD/tmp/tmp3ivcwr_d/tmp/B.ixzp66fn/BUILD/tmp/tmp3ivcwr_d/source.o -L/usr/lib -lcblas -lblas -o /tmp/B.ixzp66fn/BUILD/tmp/tmp3ivcwr_d/a.out
  FOUND:
    libraries = ['cblas', 'blas', 'blas']
    library_dirs = ['/usr/lib']
    include_dirs = ['/usr/local/include', '/usr/include']
    language = c
    define_macros = [('HAVE_CBLAS', None)]

  FOUND:
    define_macros = [('NO_ATLAS_INFO', 1), ('HAVE_CBLAS', None)]
    libraries = ['cblas', 'blas', 'blas']
    library_dirs = ['/usr/lib']
    include_dirs = ['/usr/local/include', '/usr/include']
    language = c

non-existing path in 'numpy/distutils': 'site.cfg'
lapack_opt_info:
lapack_mkl_info:
  libraries mkl_rt not found in ['/usr/local/lib', '/usr/lib', '/usr/lib/']
  NOT AVAILABLE

openblas_lapack_info:
  libraries openblas not found in ['/usr/local/lib', '/usr/lib', '/usr/lib/']
  NOT AVAILABLE

openblas_clapack_info:
  libraries openblas,lapack not found in ['/usr/local/lib', '/usr/lib', '/usr/lib/']
  NOT AVAILABLE

flame_info:
  libraries flame not found in ['/usr/local/lib', '/usr/lib', '/usr/lib/']
  NOT AVAILABLE

atlas_3_10_threads_info:
Setting PTATLAS=ATLAS
  libraries lapack_atlas not found in /usr/local/lib
  libraries tatlas,tatlas not found in /usr/local/lib
  libraries lapack_atlas not found in /usr/lib
  libraries tatlas,tatlas not found in /usr/lib
  libraries lapack_atlas not found in /usr/lib/
  libraries tatlas,tatlas not found in /usr/lib/
<class 'numpy.distutils.system_info.atlas_3_10_threads_info'>
  NOT AVAILABLE

atlas_3_10_info:
  libraries lapack_atlas not found in /usr/local/lib
  libraries satlas,satlas not found in /usr/local/lib
  libraries lapack_atlas not found in /usr/lib
  libraries satlas,satlas not found in /usr/lib
  libraries lapack_atlas not found in /usr/lib/
  libraries satlas,satlas not found in /usr/lib/
<class 'numpy.distutils.system_info.atlas_3_10_info'>
  NOT AVAILABLE

atlas_threads_info:
Setting PTATLAS=ATLAS
  libraries lapack_atlas not found in /usr/local/lib
  libraries ptf77blas,ptcblas,atlas not found in /usr/local/lib
  libraries lapack_atlas not found in /usr/lib
  libraries ptf77blas,ptcblas,atlas not found in /usr/lib
  libraries lapack_atlas not found in /usr/lib/
  libraries ptf77blas,ptcblas,atlas not found in /usr/lib/
<class 'numpy.distutils.system_info.atlas_threads_info'>
  NOT AVAILABLE

atlas_info:
  libraries lapack_atlas not found in /usr/local/lib
  libraries f77blas,cblas,atlas not found in /usr/local/lib
  libraries lapack_atlas not found in /usr/lib
  libraries f77blas,cblas,atlas not found in /usr/lib
  libraries lapack_atlas not found in /usr/lib/
  libraries f77blas,cblas,atlas not found in /usr/lib/
<class 'numpy.distutils.system_info.atlas_info'>
  NOT AVAILABLE

lapack_info:
  FOUND:
    libraries = ['lapack', 'lapack']
    library_dirs = ['/usr/lib']
    language = f77

  FOUND:
    libraries = ['lapack', 'lapack', 'cblas', 'blas', 'blas']
    library_dirs = ['/usr/lib']
    language = c
    define_macros = [('NO_ATLAS_INFO', 1), ('HAVE_CBLAS', None)]
    include_dirs = ['/usr/local/include', '/usr/include']

/usr/lib/python3.9/distutils/dist.py:274: UserWarning: Unknown distribution option: 'define_macros'
  warnings.warn(msg)
running build
running config_cc
unifing config_cc, config, build_clib, build_ext, build commands --compiler options
running config_fc
unifing config_fc, config, build_clib, build_ext, build commands --fcompiler options
running build_src
build_src
building py_modules sources
creating build-3
creating build-3/src.linux-i686-3.9
creating build-3/src.linux-i686-3.9/numpy
creating build-3/src.linux-i686-3.9/numpy/distutils
building library "npymath" sources
creating build-3/src.linux-i686-3.9/numpy/core
creating build-3/src.linux-i686-3.9/numpy/core/src
creating build-3/src.linux-i686-3.9/numpy/core/src/npymath
conv_template:> build-3/src.linux-i686-3.9/numpy/core/src/npymath/npy_math_internal.h
  adding 'build-3/src.linux-i686-3.9/numpy/core/src/npymath' to include_dirs.
conv_template:> build-3/src.linux-i686-3.9/numpy/core/src/npymath/ieee754.c
conv_template:> build-3/src.linux-i686-3.9/numpy/core/src/npymath/npy_math_complex.c
None - nothing done with h_files = ['build-3/src.linux-i686-3.9/numpy/core/src/npymath/npy_math_internal.h']
building library "npysort" sources
creating build-3/src.linux-i686-3.9/numpy/core/src/common
conv_template:> build-3/src.linux-i686-3.9/numpy/core/src/common/npy_sort.h
  adding 'build-3/src.linux-i686-3.9/numpy/core/src/common' to include_dirs.
creating build-3/src.linux-i686-3.9/numpy/core/src/npysort
conv_template:> build-3/src.linux-i686-3.9/numpy/core/src/npysort/quicksort.c
conv_template:> build-3/src.linux-i686-3.9/numpy/core/src/npysort/mergesort.c
conv_template:> build-3/src.linux-i686-3.9/numpy/core/src/npysort/timsort.c
conv_template:> build-3/src.linux-i686-3.9/numpy/core/src/npysort/heapsort.c
conv_template:> build-3/src.linux-i686-3.9/numpy/core/src/npysort/radixsort.c
conv_template:> build-3/src.linux-i686-3.9/numpy/core/src/common/npy_partition.h
conv_template:> build-3/src.linux-i686-3.9/numpy/core/src/npysort/selection.c
conv_template:> build-3/src.linux-i686-3.9/numpy/core/src/common/npy_binsearch.h
conv_template:> build-3/src.linux-i686-3.9/numpy/core/src/npysort/binsearch.c
None - nothing done with h_files = ['build-3/src.linux-i686-3.9/numpy/core/src/common/npy_sort.h', 'build-3/src.linux-i686-3.9/numpy/core/src/common/npy_partition.h', 'build-3/src.linux-i686-3.9/numpy/core/src/common/npy_binsearch.h']
building library "npyrandom" sources
building extension "numpy.core._multiarray_tests" sources
creating build-3/src.linux-i686-3.9/numpy/core/src/multiarray
conv_template:> build-3/src.linux-i686-3.9/numpy/core/src/multiarray/_multiarray_tests.c
building extension "numpy.core._multiarray_umath" sources
conv_template:> build-3/src.linux-i686-3.9/numpy/core/src/multiarray/arraytypes.c
conv_template:> build-3/src.linux-i686-3.9/numpy/core/src/multiarray/einsum.c
conv_template:> build-3/src.linux-i686-3.9/numpy/core/src/multiarray/lowlevel_strided_loops.c
conv_template:> build-3/src.linux-i686-3.9/numpy/core/src/multiarray/nditer_templ.c
conv_template:> build-3/src.linux-i686-3.9/numpy/core/src/multiarray/scalartypes.c
creating build-3/src.linux-i686-3.9/numpy/core/src/umath
conv_template:> build-3/src.linux-i686-3.9/numpy/core/src/umath/funcs.inc
  adding 'build-3/src.linux-i686-3.9/numpy/core/src/umath' to include_dirs.
conv_template:> build-3/src.linux-i686-3.9/numpy/core/src/umath/simd.inc
conv_template:> build-3/src.linux-i686-3.9/numpy/core/src/umath/loops.h
conv_template:> build-3/src.linux-i686-3.9/numpy/core/src/umath/loops.c
conv_template:> build-3/src.linux-i686-3.9/numpy/core/src/umath/matmul.h
conv_template:> build-3/src.linux-i686-3.9/numpy/core/src/umath/matmul.c
conv_template:> build-3/src.linux-i686-3.9/numpy/core/src/umath/clip.h
conv_template:> build-3/src.linux-i686-3.9/numpy/core/src/umath/clip.c
conv_template:> build-3/src.linux-i686-3.9/numpy/core/src/umath/scalarmath.c
  adding 'build-3/src.linux-i686-3.9/numpy/core/src/npymath' to include_dirs.
conv_template:> build-3/src.linux-i686-3.9/numpy/core/src/common/templ_common.h
  adding 'build-3/src.linux-i686-3.9/numpy/core/src/common' to include_dirs.
conv_template:> build-3/src.linux-i686-3.9/numpy/core/src/common/npy_cpu_features.c
numpy.core - nothing done with h_files = ['build-3/src.linux-i686-3.9/numpy/core/src/umath/funcs.inc', 'build-3/src.linux-i686-3.9/numpy/core/src/umath/simd.inc', 'build-3/src.linux-i686-3.9/numpy/core/src/umath/loops.h', 'build-3/src.linux-i686-3.9/numpy/core/src/umath/matmul.h', 'build-3/src.linux-i686-3.9/numpy/core/src/umath/clip.h', 'build-3/src.linux-i686-3.9/numpy/core/src/npymath/npy_math_internal.h', 'build-3/src.linux-i686-3.9/numpy/core/src/common/templ_common.h', 'build-3/src.linux-i686-3.9/numpy/core/include/numpy/config.h', 'build-3/src.linux-i686-3.9/numpy/core/include/numpy/_numpyconfig.h', 'build-3/src.linux-i686-3.9/numpy/core/include/numpy/__multiarray_api.h', 'build-3/src.linux-i686-3.9/numpy/core/include/numpy/__ufunc_api.h']
building extension "numpy.core._umath_tests" sources
conv_template:> build-3/src.linux-i686-3.9/numpy/core/src/umath/_umath_tests.c
building extension "numpy.core._rational_tests" sources
conv_template:> build-3/src.linux-i686-3.9/numpy/core/src/umath/_rational_tests.c
building extension "numpy.core._struct_ufunc_tests" sources
conv_template:> build-3/src.linux-i686-3.9/numpy/core/src/umath/_struct_ufunc_tests.c
building extension "numpy.core._operand_flag_tests" sources
conv_template:> build-3/src.linux-i686-3.9/numpy/core/src/umath/_operand_flag_tests.c
building extension "numpy.fft._pocketfft_internal" sources
building extension "numpy.linalg.lapack_lite" sources
creating build-3/src.linux-i686-3.9/numpy/linalg
building extension "numpy.linalg._umath_linalg" sources
conv_template:> build-3/src.linux-i686-3.9/numpy/linalg/umath_linalg.c
building extension "numpy.random._mt19937" sources
building extension "numpy.random._philox" sources
building extension "numpy.random._pcg64" sources
building extension "numpy.random._sfc64" sources
building extension "numpy.random._common" sources
building extension "numpy.random.bit_generator" sources
building extension "numpy.random._generator" sources
building extension "numpy.random._bounded_integers" sources
building extension "numpy.random.mtrand" sources
building data_files sources
build_src: building npy-pkg config files
running build_py
creating build-3/lib.linux-i686-3.9
creating build-3/lib.linux-i686-3.9/numpy
copying numpy/__init__.py -> build-3/lib.linux-i686-3.9/numpy
copying numpy/_distributor_init.py -> build-3/lib.linux-i686-3.9/numpy
copying numpy/_globals.py -> build-3/lib.linux-i686-3.9/numpy
copying numpy/_pytesttester.py -> build-3/lib.linux-i686-3.9/numpy
copying numpy/conftest.py -> build-3/lib.linux-i686-3.9/numpy
copying numpy/ctypeslib.py -> build-3/lib.linux-i686-3.9/numpy
copying numpy/dual.py -> build-3/lib.linux-i686-3.9/numpy
copying numpy/matlib.py -> build-3/lib.linux-i686-3.9/numpy
copying numpy/setup.py -> build-3/lib.linux-i686-3.9/numpy
copying numpy/version.py -> build-3/lib.linux-i686-3.9/numpy
copying build-3/src.linux-i686-3.9/numpy/__config__.py -> build-3/lib.linux-i686-3.9/numpy
creating build-3/lib.linux-i686-3.9/numpy/compat
copying numpy/compat/__init__.py -> build-3/lib.linux-i686-3.9/numpy/compat
copying numpy/compat/_inspect.py -> build-3/lib.linux-i686-3.9/numpy/compat
copying numpy/compat/py3k.py -> build-3/lib.linux-i686-3.9/numpy/compat
copying numpy/compat/setup.py -> build-3/lib.linux-i686-3.9/numpy/compat
creating build-3/lib.linux-i686-3.9/numpy/compat/tests
copying numpy/compat/tests/__init__.py -> build-3/lib.linux-i686-3.9/numpy/compat/tests
copying numpy/compat/tests/test_compat.py -> build-3/lib.linux-i686-3.9/numpy/compat/tests
creating build-3/lib.linux-i686-3.9/numpy/core
copying numpy/core/__init__.py -> build-3/lib.linux-i686-3.9/numpy/core
copying numpy/core/_add_newdocs.py -> build-3/lib.linux-i686-3.9/numpy/core
copying numpy/core/_asarray.py -> build-3/lib.linux-i686-3.9/numpy/core
copying numpy/core/_dtype.py -> build-3/lib.linux-i686-3.9/numpy/core
copying numpy/core/_dtype_ctypes.py -> build-3/lib.linux-i686-3.9/numpy/core
copying numpy/core/_exceptions.py -> build-3/lib.linux-i686-3.9/numpy/core
copying numpy/core/_internal.py -> build-3/lib.linux-i686-3.9/numpy/core
copying numpy/core/_methods.py -> build-3/lib.linux-i686-3.9/numpy/core
copying numpy/core/_string_helpers.py -> build-3/lib.linux-i686-3.9/numpy/core
copying numpy/core/_type_aliases.py -> build-3/lib.linux-i686-3.9/numpy/core
copying numpy/core/_ufunc_config.py -> build-3/lib.linux-i686-3.9/numpy/core
copying numpy/core/arrayprint.py -> build-3/lib.linux-i686-3.9/numpy/core
copying numpy/core/cversions.py -> build-3/lib.linux-i686-3.9/numpy/core
copying numpy/core/defchararray.py -> build-3/lib.linux-i686-3.9/numpy/core
copying numpy/core/einsumfunc.py -> build-3/lib.linux-i686-3.9/numpy/core
copying numpy/core/fromnumeric.py -> build-3/lib.linux-i686-3.9/numpy/core
copying numpy/core/function_base.py -> build-3/lib.linux-i686-3.9/numpy/core
copying numpy/core/getlimits.py -> build-3/lib.linux-i686-3.9/numpy/core
copying numpy/core/machar.py -> build-3/lib.linux-i686-3.9/numpy/core
copying numpy/core/memmap.py -> build-3/lib.linux-i686-3.9/numpy/core
copying numpy/core/multiarray.py -> build-3/lib.linux-i686-3.9/numpy/core
copying numpy/core/numeric.py -> build-3/lib.linux-i686-3.9/numpy/core
copying numpy/core/numerictypes.py -> build-3/lib.linux-i686-3.9/numpy/core
copying numpy/core/overrides.py -> build-3/lib.linux-i686-3.9/numpy/core
copying numpy/core/records.py -> build-3/lib.linux-i686-3.9/numpy/core
copying numpy/core/setup.py -> build-3/lib.linux-i686-3.9/numpy/core
copying numpy/core/setup_common.py -> build-3/lib.linux-i686-3.9/numpy/core
copying numpy/core/shape_base.py -> build-3/lib.linux-i686-3.9/numpy/core
copying numpy/core/umath.py -> build-3/lib.linux-i686-3.9/numpy/core
copying numpy/core/umath_tests.py -> build-3/lib.linux-i686-3.9/numpy/core
copying numpy/core/code_generators/generate_numpy_api.py -> build-3/lib.linux-i686-3.9/numpy/core
creating build-3/lib.linux-i686-3.9/numpy/core/tests
copying numpy/core/tests/__init__.py -> build-3/lib.linux-i686-3.9/numpy/core/tests
copying numpy/core/tests/_locales.py -> build-3/lib.linux-i686-3.9/numpy/core/tests
copying numpy/core/tests/test__exceptions.py -> build-3/lib.linux-i686-3.9/numpy/core/tests
copying numpy/core/tests/test_abc.py -> build-3/lib.linux-i686-3.9/numpy/core/tests
copying numpy/core/tests/test_api.py -> build-3/lib.linux-i686-3.9/numpy/core/tests
copying numpy/core/tests/test_arrayprint.py -> build-3/lib.linux-i686-3.9/numpy/core/tests
copying numpy/core/tests/test_conversion_utils.py -> build-3/lib.linux-i686-3.9/numpy/core/tests
copying numpy/core/tests/test_cpu_features.py -> build-3/lib.linux-i686-3.9/numpy/core/tests
copying numpy/core/tests/test_datetime.py -> build-3/lib.linux-i686-3.9/numpy/core/tests
copying numpy/core/tests/test_defchararray.py -> build-3/lib.linux-i686-3.9/numpy/core/tests
copying numpy/core/tests/test_deprecations.py -> build-3/lib.linux-i686-3.9/numpy/core/tests
copying numpy/core/tests/test_dtype.py -> build-3/lib.linux-i686-3.9/numpy/core/tests
copying numpy/core/tests/test_einsum.py -> build-3/lib.linux-i686-3.9/numpy/core/tests
copying numpy/core/tests/test_errstate.py -> build-3/lib.linux-i686-3.9/numpy/core/tests
copying numpy/core/tests/test_extint128.py -> build-3/lib.linux-i686-3.9/numpy/core/tests
copying numpy/core/tests/test_function_base.py -> build-3/lib.linux-i686-3.9/numpy/core/tests
copying numpy/core/tests/test_getlimits.py -> build-3/lib.linux-i686-3.9/numpy/core/tests
copying numpy/core/tests/test_half.py -> build-3/lib.linux-i686-3.9/numpy/core/tests
copying numpy/core/tests/test_indexerrors.py -> build-3/lib.linux-i686-3.9/numpy/core/tests
copying numpy/core/tests/test_indexing.py -> build-3/lib.linux-i686-3.9/numpy/core/tests
copying numpy/core/tests/test_item_selection.py -> build-3/lib.linux-i686-3.9/numpy/core/tests
copying numpy/core/tests/test_longdouble.py -> build-3/lib.linux-i686-3.9/numpy/core/tests
copying numpy/core/tests/test_machar.py -> build-3/lib.linux-i686-3.9/numpy/core/tests
copying numpy/core/tests/test_mem_overlap.py -> build-3/lib.linux-i686-3.9/numpy/core/tests
copying numpy/core/tests/test_memmap.py -> build-3/lib.linux-i686-3.9/numpy/core/tests
copying numpy/core/tests/test_multiarray.py -> build-3/lib.linux-i686-3.9/numpy/core/tests
copying numpy/core/tests/test_nditer.py -> build-3/lib.linux-i686-3.9/numpy/core/tests
copying numpy/core/tests/test_numeric.py -> build-3/lib.linux-i686-3.9/numpy/core/tests
copying numpy/core/tests/test_numerictypes.py -> build-3/lib.linux-i686-3.9/numpy/core/tests
copying numpy/core/tests/test_overrides.py -> build-3/lib.linux-i686-3.9/numpy/core/tests
copying numpy/core/tests/test_print.py -> build-3/lib.linux-i686-3.9/numpy/core/tests
copying numpy/core/tests/test_protocols.py -> build-3/lib.linux-i686-3.9/numpy/core/tests
copying numpy/core/tests/test_records.py -> build-3/lib.linux-i686-3.9/numpy/core/tests
copying numpy/core/tests/test_regression.py -> build-3/lib.linux-i686-3.9/numpy/core/tests
copying numpy/core/tests/test_scalar_ctors.py -> build-3/lib.linux-i686-3.9/numpy/core/tests
copying numpy/core/tests/test_scalar_methods.py -> build-3/lib.linux-i686-3.9/numpy/core/tests
copying numpy/core/tests/test_scalarbuffer.py -> build-3/lib.linux-i686-3.9/numpy/core/tests
copying numpy/core/tests/test_scalarinherit.py -> build-3/lib.linux-i686-3.9/numpy/core/tests
copying numpy/core/tests/test_scalarmath.py -> build-3/lib.linux-i686-3.9/numpy/core/tests
copying numpy/core/tests/test_scalarprint.py -> build-3/lib.linux-i686-3.9/numpy/core/tests
copying numpy/core/tests/test_shape_base.py -> build-3/lib.linux-i686-3.9/numpy/core/tests
copying numpy/core/tests/test_ufunc.py -> build-3/lib.linux-i686-3.9/numpy/core/tests
copying numpy/core/tests/test_umath.py -> build-3/lib.linux-i686-3.9/numpy/core/tests
copying numpy/core/tests/test_umath_accuracy.py -> build-3/lib.linux-i686-3.9/numpy/core/tests
copying numpy/core/tests/test_umath_complex.py -> build-3/lib.linux-i686-3.9/numpy/core/tests
copying numpy/core/tests/test_unicode.py -> build-3/lib.linux-i686-3.9/numpy/core/tests
creating build-3/lib.linux-i686-3.9/numpy/distutils
copying numpy/distutils/__init__.py -> build-3/lib.linux-i686-3.9/numpy/distutils
copying numpy/distutils/_shell_utils.py -> build-3/lib.linux-i686-3.9/numpy/distutils
copying numpy/distutils/ccompiler.py -> build-3/lib.linux-i686-3.9/numpy/distutils
copying numpy/distutils/conv_template.py -> build-3/lib.linux-i686-3.9/numpy/distutils
copying numpy/distutils/core.py -> build-3/lib.linux-i686-3.9/numpy/distutils
copying numpy/distutils/cpuinfo.py -> build-3/lib.linux-i686-3.9/numpy/distutils
copying numpy/distutils/exec_command.py -> build-3/lib.linux-i686-3.9/numpy/distutils
copying numpy/distutils/extension.py -> build-3/lib.linux-i686-3.9/numpy/distutils
copying numpy/distutils/from_template.py -> build-3/lib.linux-i686-3.9/numpy/distutils
copying numpy/distutils/intelccompiler.py -> build-3/lib.linux-i686-3.9/numpy/distutils
copying numpy/distutils/lib2def.py -> build-3/lib.linux-i686-3.9/numpy/distutils
copying numpy/distutils/line_endings.py -> build-3/lib.linux-i686-3.9/numpy/distutils
copying numpy/distutils/log.py -> build-3/lib.linux-i686-3.9/numpy/distutils
copying numpy/distutils/mingw32ccompiler.py -> build-3/lib.linux-i686-3.9/numpy/distutils
copying numpy/distutils/misc_util.py -> build-3/lib.linux-i686-3.9/numpy/distutils
copying numpy/distutils/msvc9compiler.py -> build-3/lib.linux-i686-3.9/numpy/distutils
copying numpy/distutils/msvccompiler.py -> build-3/lib.linux-i686-3.9/numpy/distutils
copying numpy/distutils/npy_pkg_config.py -> build-3/lib.linux-i686-3.9/numpy/distutils
copying numpy/distutils/numpy_distribution.py -> build-3/lib.linux-i686-3.9/numpy/distutils
copying numpy/distutils/pathccompiler.py -> build-3/lib.linux-i686-3.9/numpy/distutils
copying numpy/distutils/setup.py -> build-3/lib.linux-i686-3.9/numpy/distutils
copying numpy/distutils/system_info.py -> build-3/lib.linux-i686-3.9/numpy/distutils
copying numpy/distutils/unixccompiler.py -> build-3/lib.linux-i686-3.9/numpy/distutils
copying build-3/src.linux-i686-3.9/numpy/distutils/__config__.py -> build-3/lib.linux-i686-3.9/numpy/distutils
creating build-3/lib.linux-i686-3.9/numpy/distutils/command
copying numpy/distutils/command/__init__.py -> build-3/lib.linux-i686-3.9/numpy/distutils/command
copying numpy/distutils/command/autodist.py -> build-3/lib.linux-i686-3.9/numpy/distutils/command
copying numpy/distutils/command/bdist_rpm.py -> build-3/lib.linux-i686-3.9/numpy/distutils/command
copying numpy/distutils/command/build.py -> build-3/lib.linux-i686-3.9/numpy/distutils/command
copying numpy/distutils/command/build_clib.py -> build-3/lib.linux-i686-3.9/numpy/distutils/command
copying numpy/distutils/command/build_ext.py -> build-3/lib.linux-i686-3.9/numpy/distutils/command
copying numpy/distutils/command/build_py.py -> build-3/lib.linux-i686-3.9/numpy/distutils/command
copying numpy/distutils/command/build_scripts.py -> build-3/lib.linux-i686-3.9/numpy/distutils/command
copying numpy/distutils/command/build_src.py -> build-3/lib.linux-i686-3.9/numpy/distutils/command
copying numpy/distutils/command/config.py -> build-3/lib.linux-i686-3.9/numpy/distutils/command
copying numpy/distutils/command/config_compiler.py -> build-3/lib.linux-i686-3.9/numpy/distutils/command
copying numpy/distutils/command/develop.py -> build-3/lib.linux-i686-3.9/numpy/distutils/command
copying numpy/distutils/command/egg_info.py -> build-3/lib.linux-i686-3.9/numpy/distutils/command
copying numpy/distutils/command/install.py -> build-3/lib.linux-i686-3.9/numpy/distutils/command
copying numpy/distutils/command/install_clib.py -> build-3/lib.linux-i686-3.9/numpy/distutils/command
copying numpy/distutils/command/install_data.py -> build-3/lib.linux-i686-3.9/numpy/distutils/command
copying numpy/distutils/command/install_headers.py -> build-3/lib.linux-i686-3.9/numpy/distutils/command
copying numpy/distutils/command/sdist.py -> build-3/lib.linux-i686-3.9/numpy/distutils/command
creating build-3/lib.linux-i686-3.9/numpy/distutils/fcompiler
copying numpy/distutils/fcompiler/__init__.py -> build-3/lib.linux-i686-3.9/numpy/distutils/fcompiler
copying numpy/distutils/fcompiler/absoft.py -> build-3/lib.linux-i686-3.9/numpy/distutils/fcompiler
copying numpy/distutils/fcompiler/compaq.py -> build-3/lib.linux-i686-3.9/numpy/distutils/fcompiler
copying numpy/distutils/fcompiler/environment.py -> build-3/lib.linux-i686-3.9/numpy/distutils/fcompiler
copying numpy/distutils/fcompiler/g95.py -> build-3/lib.linux-i686-3.9/numpy/distutils/fcompiler
copying numpy/distutils/fcompiler/gnu.py -> build-3/lib.linux-i686-3.9/numpy/distutils/fcompiler
copying numpy/distutils/fcompiler/hpux.py -> build-3/lib.linux-i686-3.9/numpy/distutils/fcompiler
copying numpy/distutils/fcompiler/ibm.py -> build-3/lib.linux-i686-3.9/numpy/distutils/fcompiler
copying numpy/distutils/fcompiler/intel.py -> build-3/lib.linux-i686-3.9/numpy/distutils/fcompiler
copying numpy/distutils/fcompiler/lahey.py -> build-3/lib.linux-i686-3.9/numpy/distutils/fcompiler
copying numpy/distutils/fcompiler/mips.py -> build-3/lib.linux-i686-3.9/numpy/distutils/fcompiler
copying numpy/distutils/fcompiler/nag.py -> build-3/lib.linux-i686-3.9/numpy/distutils/fcompiler
copying numpy/distutils/fcompiler/none.py -> build-3/lib.linux-i686-3.9/numpy/distutils/fcompiler
copying numpy/distutils/fcompiler/nv.py -> build-3/lib.linux-i686-3.9/numpy/distutils/fcompiler
copying numpy/distutils/fcompiler/pathf95.py -> build-3/lib.linux-i686-3.9/numpy/distutils/fcompiler
copying numpy/distutils/fcompiler/pg.py -> build-3/lib.linux-i686-3.9/numpy/distutils/fcompiler
copying numpy/distutils/fcompiler/sun.py -> build-3/lib.linux-i686-3.9/numpy/distutils/fcompiler
copying numpy/distutils/fcompiler/vast.py -> build-3/lib.linux-i686-3.9/numpy/distutils/fcompiler
creating build-3/lib.linux-i686-3.9/numpy/distutils/tests
copying numpy/distutils/tests/__init__.py -> build-3/lib.linux-i686-3.9/numpy/distutils/tests
copying numpy/distutils/tests/test_exec_command.py -> build-3/lib.linux-i686-3.9/numpy/distutils/tests
copying numpy/distutils/tests/test_fcompiler.py -> build-3/lib.linux-i686-3.9/numpy/distutils/tests
copying numpy/distutils/tests/test_fcompiler_gnu.py -> build-3/lib.linux-i686-3.9/numpy/distutils/tests
copying numpy/distutils/tests/test_fcompiler_intel.py -> build-3/lib.linux-i686-3.9/numpy/distutils/tests
copying numpy/distutils/tests/test_fcompiler_nagfor.py -> build-3/lib.linux-i686-3.9/numpy/distutils/tests
copying numpy/distutils/tests/test_from_template.py -> build-3/lib.linux-i686-3.9/numpy/distutils/tests
copying numpy/distutils/tests/test_mingw32ccompiler.py -> build-3/lib.linux-i686-3.9/numpy/distutils/tests
copying numpy/distutils/tests/test_misc_util.py -> build-3/lib.linux-i686-3.9/numpy/distutils/tests
copying numpy/distutils/tests/test_npy_pkg_config.py -> build-3/lib.linux-i686-3.9/numpy/distutils/tests
copying numpy/distutils/tests/test_shell_utils.py -> build-3/lib.linux-i686-3.9/numpy/distutils/tests
copying numpy/distutils/tests/test_system_info.py -> build-3/lib.linux-i686-3.9/numpy/distutils/tests
creating build-3/lib.linux-i686-3.9/numpy/doc
copying numpy/doc/__init__.py -> build-3/lib.linux-i686-3.9/numpy/doc
copying numpy/doc/basics.py -> build-3/lib.linux-i686-3.9/numpy/doc
copying numpy/doc/broadcasting.py -> build-3/lib.linux-i686-3.9/numpy/doc
copying numpy/doc/byteswapping.py -> build-3/lib.linux-i686-3.9/numpy/doc
copying numpy/doc/constants.py -> build-3/lib.linux-i686-3.9/numpy/doc
copying numpy/doc/creation.py -> build-3/lib.linux-i686-3.9/numpy/doc
copying numpy/doc/dispatch.py -> build-3/lib.linux-i686-3.9/numpy/doc
copying numpy/doc/glossary.py -> build-3/lib.linux-i686-3.9/numpy/doc
copying numpy/doc/indexing.py -> build-3/lib.linux-i686-3.9/numpy/doc
copying numpy/doc/internals.py -> build-3/lib.linux-i686-3.9/numpy/doc
copying numpy/doc/misc.py -> build-3/lib.linux-i686-3.9/numpy/doc
copying numpy/doc/structured_arrays.py -> build-3/lib.linux-i686-3.9/numpy/doc
copying numpy/doc/subclassing.py -> build-3/lib.linux-i686-3.9/numpy/doc
copying numpy/doc/ufuncs.py -> build-3/lib.linux-i686-3.9/numpy/doc
creating build-3/lib.linux-i686-3.9/numpy/f2py
copying numpy/f2py/__init__.py -> build-3/lib.linux-i686-3.9/numpy/f2py
copying numpy/f2py/__main__.py -> build-3/lib.linux-i686-3.9/numpy/f2py
copying numpy/f2py/__version__.py -> build-3/lib.linux-i686-3.9/numpy/f2py
copying numpy/f2py/auxfuncs.py -> build-3/lib.linux-i686-3.9/numpy/f2py
copying numpy/f2py/capi_maps.py -> build-3/lib.linux-i686-3.9/numpy/f2py
copying numpy/f2py/cb_rules.py -> build-3/lib.linux-i686-3.9/numpy/f2py
copying numpy/f2py/cfuncs.py -> build-3/lib.linux-i686-3.9/numpy/f2py
copying numpy/f2py/common_rules.py -> build-3/lib.linux-i686-3.9/numpy/f2py
copying numpy/f2py/crackfortran.py -> build-3/lib.linux-i686-3.9/numpy/f2py
copying numpy/f2py/diagnose.py -> build-3/lib.linux-i686-3.9/numpy/f2py
copying numpy/f2py/f2py2e.py -> build-3/lib.linux-i686-3.9/numpy/f2py
copying numpy/f2py/f2py_testing.py -> build-3/lib.linux-i686-3.9/numpy/f2py
copying numpy/f2py/f90mod_rules.py -> build-3/lib.linux-i686-3.9/numpy/f2py
copying numpy/f2py/func2subr.py -> build-3/lib.linux-i686-3.9/numpy/f2py
copying numpy/f2py/rules.py -> build-3/lib.linux-i686-3.9/numpy/f2py
copying numpy/f2py/setup.py -> build-3/lib.linux-i686-3.9/numpy/f2py
copying numpy/f2py/use_rules.py -> build-3/lib.linux-i686-3.9/numpy/f2py
creating build-3/lib.linux-i686-3.9/numpy/f2py/tests
copying numpy/f2py/tests/__init__.py -> build-3/lib.linux-i686-3.9/numpy/f2py/tests
copying numpy/f2py/tests/test_array_from_pyobj.py -> build-3/lib.linux-i686-3.9/numpy/f2py/tests
copying numpy/f2py/tests/test_assumed_shape.py -> build-3/lib.linux-i686-3.9/numpy/f2py/tests
copying numpy/f2py/tests/test_block_docstring.py -> build-3/lib.linux-i686-3.9/numpy/f2py/tests
copying numpy/f2py/tests/test_callback.py -> build-3/lib.linux-i686-3.9/numpy/f2py/tests
copying numpy/f2py/tests/test_common.py -> build-3/lib.linux-i686-3.9/numpy/f2py/tests
copying numpy/f2py/tests/test_compile_function.py -> build-3/lib.linux-i686-3.9/numpy/f2py/tests
copying numpy/f2py/tests/test_crackfortran.py -> build-3/lib.linux-i686-3.9/numpy/f2py/tests
copying numpy/f2py/tests/test_kind.py -> build-3/lib.linux-i686-3.9/numpy/f2py/tests
copying numpy/f2py/tests/test_mixed.py -> build-3/lib.linux-i686-3.9/numpy/f2py/tests
copying numpy/f2py/tests/test_parameter.py -> build-3/lib.linux-i686-3.9/numpy/f2py/tests
copying numpy/f2py/tests/test_quoted_character.py -> build-3/lib.linux-i686-3.9/numpy/f2py/tests
copying numpy/f2py/tests/test_regression.py -> build-3/lib.linux-i686-3.9/numpy/f2py/tests
copying numpy/f2py/tests/test_return_character.py -> build-3/lib.linux-i686-3.9/numpy/f2py/tests
copying numpy/f2py/tests/test_return_complex.py -> build-3/lib.linux-i686-3.9/numpy/f2py/tests
copying numpy/f2py/tests/test_return_integer.py -> build-3/lib.linux-i686-3.9/numpy/f2py/tests
copying numpy/f2py/tests/test_return_logical.py -> build-3/lib.linux-i686-3.9/numpy/f2py/tests
copying numpy/f2py/tests/test_return_real.py -> build-3/lib.linux-i686-3.9/numpy/f2py/tests
copying numpy/f2py/tests/test_semicolon_split.py -> build-3/lib.linux-i686-3.9/numpy/f2py/tests
copying numpy/f2py/tests/test_size.py -> build-3/lib.linux-i686-3.9/numpy/f2py/tests
copying numpy/f2py/tests/test_string.py -> build-3/lib.linux-i686-3.9/numpy/f2py/tests
copying numpy/f2py/tests/util.py -> build-3/lib.linux-i686-3.9/numpy/f2py/tests
creating build-3/lib.linux-i686-3.9/numpy/fft
copying numpy/fft/__init__.py -> build-3/lib.linux-i686-3.9/numpy/fft
copying numpy/fft/_pocketfft.py -> build-3/lib.linux-i686-3.9/numpy/fft
copying numpy/fft/helper.py -> build-3/lib.linux-i686-3.9/numpy/fft
copying numpy/fft/setup.py -> build-3/lib.linux-i686-3.9/numpy/fft
creating build-3/lib.linux-i686-3.9/numpy/fft/tests
copying numpy/fft/tests/__init__.py -> build-3/lib.linux-i686-3.9/numpy/fft/tests
copying numpy/fft/tests/test_helper.py -> build-3/lib.linux-i686-3.9/numpy/fft/tests
copying numpy/fft/tests/test_pocketfft.py -> build-3/lib.linux-i686-3.9/numpy/fft/tests
creating build-3/lib.linux-i686-3.9/numpy/lib
copying numpy/lib/__init__.py -> build-3/lib.linux-i686-3.9/numpy/lib
copying numpy/lib/_datasource.py -> build-3/lib.linux-i686-3.9/numpy/lib
copying numpy/lib/_iotools.py -> build-3/lib.linux-i686-3.9/numpy/lib
copying numpy/lib/_version.py -> build-3/lib.linux-i686-3.9/numpy/lib
copying numpy/lib/arraypad.py -> build-3/lib.linux-i686-3.9/numpy/lib
copying numpy/lib/arraysetops.py -> build-3/lib.linux-i686-3.9/numpy/lib
copying numpy/lib/arrayterator.py -> build-3/lib.linux-i686-3.9/numpy/lib
copying numpy/lib/financial.py -> build-3/lib.linux-i686-3.9/numpy/lib
copying numpy/lib/format.py -> build-3/lib.linux-i686-3.9/numpy/lib
copying numpy/lib/function_base.py -> build-3/lib.linux-i686-3.9/numpy/lib
copying numpy/lib/histograms.py -> build-3/lib.linux-i686-3.9/numpy/lib
copying numpy/lib/index_tricks.py -> build-3/lib.linux-i686-3.9/numpy/lib
copying numpy/lib/mixins.py -> build-3/lib.linux-i686-3.9/numpy/lib
copying numpy/lib/nanfunctions.py -> build-3/lib.linux-i686-3.9/numpy/lib
copying numpy/lib/npyio.py -> build-3/lib.linux-i686-3.9/numpy/lib
copying numpy/lib/polynomial.py -> build-3/lib.linux-i686-3.9/numpy/lib
copying numpy/lib/recfunctions.py -> build-3/lib.linux-i686-3.9/numpy/lib
copying numpy/lib/scimath.py -> build-3/lib.linux-i686-3.9/numpy/lib
copying numpy/lib/setup.py -> build-3/lib.linux-i686-3.9/numpy/lib
copying numpy/lib/shape_base.py -> build-3/lib.linux-i686-3.9/numpy/lib
copying numpy/lib/stride_tricks.py -> build-3/lib.linux-i686-3.9/numpy/lib
copying numpy/lib/twodim_base.py -> build-3/lib.linux-i686-3.9/numpy/lib
copying numpy/lib/type_check.py -> build-3/lib.linux-i686-3.9/numpy/lib
copying numpy/lib/ufunclike.py -> build-3/lib.linux-i686-3.9/numpy/lib
copying numpy/lib/user_array.py -> build-3/lib.linux-i686-3.9/numpy/lib
copying numpy/lib/utils.py -> build-3/lib.linux-i686-3.9/numpy/lib
creating build-3/lib.linux-i686-3.9/numpy/lib/tests
copying numpy/lib/tests/__init__.py -> build-3/lib.linux-i686-3.9/numpy/lib/tests
copying numpy/lib/tests/test__datasource.py -> build-3/lib.linux-i686-3.9/numpy/lib/tests
copying numpy/lib/tests/test__iotools.py -> build-3/lib.linux-i686-3.9/numpy/lib/tests
copying numpy/lib/tests/test__version.py -> build-3/lib.linux-i686-3.9/numpy/lib/tests
copying numpy/lib/tests/test_arraypad.py -> build-3/lib.linux-i686-3.9/numpy/lib/tests
copying numpy/lib/tests/test_arraysetops.py -> build-3/lib.linux-i686-3.9/numpy/lib/tests
copying numpy/lib/tests/test_arrayterator.py -> build-3/lib.linux-i686-3.9/numpy/lib/tests
copying numpy/lib/tests/test_financial.py -> build-3/lib.linux-i686-3.9/numpy/lib/tests
copying numpy/lib/tests/test_format.py -> build-3/lib.linux-i686-3.9/numpy/lib/tests
copying numpy/lib/tests/test_function_base.py -> build-3/lib.linux-i686-3.9/numpy/lib/tests
copying numpy/lib/tests/test_histograms.py -> build-3/lib.linux-i686-3.9/numpy/lib/tests
copying numpy/lib/tests/test_index_tricks.py -> build-3/lib.linux-i686-3.9/numpy/lib/tests
copying numpy/lib/tests/test_io.py -> build-3/lib.linux-i686-3.9/numpy/lib/tests
copying numpy/lib/tests/test_mixins.py -> build-3/lib.linux-i686-3.9/numpy/lib/tests
copying numpy/lib/tests/test_nanfunctions.py -> build-3/lib.linux-i686-3.9/numpy/lib/tests
copying numpy/lib/tests/test_packbits.py -> build-3/lib.linux-i686-3.9/numpy/lib/tests
copying numpy/lib/tests/test_polynomial.py -> build-3/lib.linux-i686-3.9/numpy/lib/tests
copying numpy/lib/tests/test_recfunctions.py -> build-3/lib.linux-i686-3.9/numpy/lib/tests
copying numpy/lib/tests/test_regression.py -> build-3/lib.linux-i686-3.9/numpy/lib/tests
copying numpy/lib/tests/test_shape_base.py -> build-3/lib.linux-i686-3.9/numpy/lib/tests
copying numpy/lib/tests/test_stride_tricks.py -> build-3/lib.linux-i686-3.9/numpy/lib/tests
copying numpy/lib/tests/test_twodim_base.py -> build-3/lib.linux-i686-3.9/numpy/lib/tests
copying numpy/lib/tests/test_type_check.py -> build-3/lib.linux-i686-3.9/numpy/lib/tests
copying numpy/lib/tests/test_ufunclike.py -> build-3/lib.linux-i686-3.9/numpy/lib/tests
copying numpy/lib/tests/test_utils.py -> build-3/lib.linux-i686-3.9/numpy/lib/tests
creating build-3/lib.linux-i686-3.9/numpy/linalg
copying numpy/linalg/__init__.py -> build-3/lib.linux-i686-3.9/numpy/linalg
copying numpy/linalg/linalg.py -> build-3/lib.linux-i686-3.9/numpy/linalg
copying numpy/linalg/setup.py -> build-3/lib.linux-i686-3.9/numpy/linalg
creating build-3/lib.linux-i686-3.9/numpy/linalg/tests
copying numpy/linalg/tests/__init__.py -> build-3/lib.linux-i686-3.9/numpy/linalg/tests
copying numpy/linalg/tests/test_build.py -> build-3/lib.linux-i686-3.9/numpy/linalg/tests
copying numpy/linalg/tests/test_deprecations.py -> build-3/lib.linux-i686-3.9/numpy/linalg/tests
copying numpy/linalg/tests/test_linalg.py -> build-3/lib.linux-i686-3.9/numpy/linalg/tests
copying numpy/linalg/tests/test_regression.py -> build-3/lib.linux-i686-3.9/numpy/linalg/tests
creating build-3/lib.linux-i686-3.9/numpy/ma
copying numpy/ma/__init__.py -> build-3/lib.linux-i686-3.9/numpy/ma
copying numpy/ma/bench.py -> build-3/lib.linux-i686-3.9/numpy/ma
copying numpy/ma/core.py -> build-3/lib.linux-i686-3.9/numpy/ma
copying numpy/ma/extras.py -> build-3/lib.linux-i686-3.9/numpy/ma
copying numpy/ma/mrecords.py -> build-3/lib.linux-i686-3.9/numpy/ma
copying numpy/ma/setup.py -> build-3/lib.linux-i686-3.9/numpy/ma
copying numpy/ma/testutils.py -> build-3/lib.linux-i686-3.9/numpy/ma
copying numpy/ma/timer_comparison.py -> build-3/lib.linux-i686-3.9/numpy/ma
creating build-3/lib.linux-i686-3.9/numpy/ma/tests
copying numpy/ma/tests/__init__.py -> build-3/lib.linux-i686-3.9/numpy/ma/tests
copying numpy/ma/tests/test_core.py -> build-3/lib.linux-i686-3.9/numpy/ma/tests
copying numpy/ma/tests/test_deprecations.py -> build-3/lib.linux-i686-3.9/numpy/ma/tests
copying numpy/ma/tests/test_extras.py -> build-3/lib.linux-i686-3.9/numpy/ma/tests
copying numpy/ma/tests/test_mrecords.py -> build-3/lib.linux-i686-3.9/numpy/ma/tests
copying numpy/ma/tests/test_old_ma.py -> build-3/lib.linux-i686-3.9/numpy/ma/tests
copying numpy/ma/tests/test_regression.py -> build-3/lib.linux-i686-3.9/numpy/ma/tests
copying numpy/ma/tests/test_subclassing.py -> build-3/lib.linux-i686-3.9/numpy/ma/tests
creating build-3/lib.linux-i686-3.9/numpy/matrixlib
copying numpy/matrixlib/__init__.py -> build-3/lib.linux-i686-3.9/numpy/matrixlib
copying numpy/matrixlib/defmatrix.py -> build-3/lib.linux-i686-3.9/numpy/matrixlib
copying numpy/matrixlib/setup.py -> build-3/lib.linux-i686-3.9/numpy/matrixlib
creating build-3/lib.linux-i686-3.9/numpy/matrixlib/tests
copying numpy/matrixlib/tests/__init__.py -> build-3/lib.linux-i686-3.9/numpy/matrixlib/tests
copying numpy/matrixlib/tests/test_defmatrix.py -> build-3/lib.linux-i686-3.9/numpy/matrixlib/tests
copying numpy/matrixlib/tests/test_interaction.py -> build-3/lib.linux-i686-3.9/numpy/matrixlib/tests
copying numpy/matrixlib/tests/test_masked_matrix.py -> build-3/lib.linux-i686-3.9/numpy/matrixlib/tests
copying numpy/matrixlib/tests/test_matrix_linalg.py -> build-3/lib.linux-i686-3.9/numpy/matrixlib/tests
copying numpy/matrixlib/tests/test_multiarray.py -> build-3/lib.linux-i686-3.9/numpy/matrixlib/tests
copying numpy/matrixlib/tests/test_numeric.py -> build-3/lib.linux-i686-3.9/numpy/matrixlib/tests
copying numpy/matrixlib/tests/test_regression.py -> build-3/lib.linux-i686-3.9/numpy/matrixlib/tests
creating build-3/lib.linux-i686-3.9/numpy/polynomial
copying numpy/polynomial/__init__.py -> build-3/lib.linux-i686-3.9/numpy/polynomial
copying numpy/polynomial/_polybase.py -> build-3/lib.linux-i686-3.9/numpy/polynomial
copying numpy/polynomial/chebyshev.py -> build-3/lib.linux-i686-3.9/numpy/polynomial
copying numpy/polynomial/hermite.py -> build-3/lib.linux-i686-3.9/numpy/polynomial
copying numpy/polynomial/hermite_e.py -> build-3/lib.linux-i686-3.9/numpy/polynomial
copying numpy/polynomial/laguerre.py -> build-3/lib.linux-i686-3.9/numpy/polynomial
copying numpy/polynomial/legendre.py -> build-3/lib.linux-i686-3.9/numpy/polynomial
copying numpy/polynomial/polynomial.py -> build-3/lib.linux-i686-3.9/numpy/polynomial
copying numpy/polynomial/polyutils.py -> build-3/lib.linux-i686-3.9/numpy/polynomial
copying numpy/polynomial/setup.py -> build-3/lib.linux-i686-3.9/numpy/polynomial
creating build-3/lib.linux-i686-3.9/numpy/polynomial/tests
copying numpy/polynomial/tests/__init__.py -> build-3/lib.linux-i686-3.9/numpy/polynomial/tests
copying numpy/polynomial/tests/test_chebyshev.py -> build-3/lib.linux-i686-3.9/numpy/polynomial/tests
copying numpy/polynomial/tests/test_classes.py -> build-3/lib.linux-i686-3.9/numpy/polynomial/tests
copying numpy/polynomial/tests/test_hermite.py -> build-3/lib.linux-i686-3.9/numpy/polynomial/tests
copying numpy/polynomial/tests/test_hermite_e.py -> build-3/lib.linux-i686-3.9/numpy/polynomial/tests
copying numpy/polynomial/tests/test_laguerre.py -> build-3/lib.linux-i686-3.9/numpy/polynomial/tests
copying numpy/polynomial/tests/test_legendre.py -> build-3/lib.linux-i686-3.9/numpy/polynomial/tests
copying numpy/polynomial/tests/test_polynomial.py -> build-3/lib.linux-i686-3.9/numpy/polynomial/tests
copying numpy/polynomial/tests/test_polyutils.py -> build-3/lib.linux-i686-3.9/numpy/polynomial/tests
copying numpy/polynomial/tests/test_printing.py -> build-3/lib.linux-i686-3.9/numpy/polynomial/tests
creating build-3/lib.linux-i686-3.9/numpy/random
copying numpy/random/__init__.py -> build-3/lib.linux-i686-3.9/numpy/random
copying numpy/random/_pickle.py -> build-3/lib.linux-i686-3.9/numpy/random
copying numpy/random/setup.py -> build-3/lib.linux-i686-3.9/numpy/random
creating build-3/lib.linux-i686-3.9/numpy/random/tests
copying numpy/random/tests/__init__.py -> build-3/lib.linux-i686-3.9/numpy/random/tests
copying numpy/random/tests/test_direct.py -> build-3/lib.linux-i686-3.9/numpy/random/tests
copying numpy/random/tests/test_extending.py -> build-3/lib.linux-i686-3.9/numpy/random/tests
copying numpy/random/tests/test_generator_mt19937.py -> build-3/lib.linux-i686-3.9/numpy/random/tests
copying numpy/random/tests/test_generator_mt19937_regressions.py -> build-3/lib.linux-i686-3.9/numpy/random/tests
copying numpy/random/tests/test_random.py -> build-3/lib.linux-i686-3.9/numpy/random/tests
copying numpy/random/tests/test_randomstate.py -> build-3/lib.linux-i686-3.9/numpy/random/tests
copying numpy/random/tests/test_randomstate_regression.py -> build-3/lib.linux-i686-3.9/numpy/random/tests
copying numpy/random/tests/test_regression.py -> build-3/lib.linux-i686-3.9/numpy/random/tests
copying numpy/random/tests/test_seed_sequence.py -> build-3/lib.linux-i686-3.9/numpy/random/tests
copying numpy/random/tests/test_smoke.py -> build-3/lib.linux-i686-3.9/numpy/random/tests
creating build-3/lib.linux-i686-3.9/numpy/testing
copying numpy/testing/__init__.py -> build-3/lib.linux-i686-3.9/numpy/testing
copying numpy/testing/print_coercion_tables.py -> build-3/lib.linux-i686-3.9/numpy/testing
copying numpy/testing/setup.py -> build-3/lib.linux-i686-3.9/numpy/testing
copying numpy/testing/utils.py -> build-3/lib.linux-i686-3.9/numpy/testing
creating build-3/lib.linux-i686-3.9/numpy/testing/_private
copying numpy/testing/_private/__init__.py -> build-3/lib.linux-i686-3.9/numpy/testing/_private
copying numpy/testing/_private/decorators.py -> build-3/lib.linux-i686-3.9/numpy/testing/_private
copying numpy/testing/_private/noseclasses.py -> build-3/lib.linux-i686-3.9/numpy/testing/_private
copying numpy/testing/_private/nosetester.py -> build-3/lib.linux-i686-3.9/numpy/testing/_private
copying numpy/testing/_private/parameterized.py -> build-3/lib.linux-i686-3.9/numpy/testing/_private
copying numpy/testing/_private/utils.py -> build-3/lib.linux-i686-3.9/numpy/testing/_private
creating build-3/lib.linux-i686-3.9/numpy/testing/tests
copying numpy/testing/tests/__init__.py -> build-3/lib.linux-i686-3.9/numpy/testing/tests
copying numpy/testing/tests/test_decorators.py -> build-3/lib.linux-i686-3.9/numpy/testing/tests
copying numpy/testing/tests/test_doctesting.py -> build-3/lib.linux-i686-3.9/numpy/testing/tests
copying numpy/testing/tests/test_utils.py -> build-3/lib.linux-i686-3.9/numpy/testing/tests
creating build-3/lib.linux-i686-3.9/numpy/tests
copying numpy/tests/__init__.py -> build-3/lib.linux-i686-3.9/numpy/tests
copying numpy/tests/test_ctypeslib.py -> build-3/lib.linux-i686-3.9/numpy/tests
copying numpy/tests/test_matlib.py -> build-3/lib.linux-i686-3.9/numpy/tests
copying numpy/tests/test_numpy_version.py -> build-3/lib.linux-i686-3.9/numpy/tests
copying numpy/tests/test_public_api.py -> build-3/lib.linux-i686-3.9/numpy/tests
copying numpy/tests/test_reloading.py -> build-3/lib.linux-i686-3.9/numpy/tests
copying numpy/tests/test_scripts.py -> build-3/lib.linux-i686-3.9/numpy/tests
copying numpy/tests/test_warnings.py -> build-3/lib.linux-i686-3.9/numpy/tests
running build_clib
customize UnixCCompiler
customize UnixCCompiler using new_build_clib
building 'npymath' library
compiling C sources
C compiler: i686-pld-linux-gcc -Wno-unused-result -Wsign-compare -DNDEBUG -O2 -fwrapv -pipe -Wformat -Werror=format-security -gdwarf-4 -fno-debug-types-section -fvar-tracking-assignments -g2 -Wp,-D_FORTIFY_SOURCE=2 -fstack-protector-strong --param=ssp-buffer-size=4 -Werror=trampolines -fomit-frame-pointer -march=i686 -fasynchronous-unwind-tables -mtune=pentium4 -gdwarf-4 -fno-debug-types-section -fvar-tracking-assignments -g2 -O2 -fwrapv -pipe -Wformat -Werror=format-security -gdwarf-4 -fno-debug-types-section -fvar-tracking-assignments -g2 -Wp,-D_FORTIFY_SOURCE=2 -fstack-protector-strong --param=ssp-buffer-size=4 -Werror=trampolines -fomit-frame-pointer -march=i686 -fasynchronous-unwind-tables -mtune=pentium4 -gdwarf-4 -fno-debug-types-section -fvar-tracking-assignments -g2 -O2 -fwrapv -pipe -Wformat -Werror=format-security -gdwarf-4 -fno-debug-types-section -fvar-tracking-assignments -g2 -Wp,-D_FORTIFY_SOURCE=2 -fstack-protector-strong --param=ssp-buffer-size=4 -Werror=trampolines -fomit-frame-pointer -march=i686 -fasynchronous-unwind-tables -mtune=pentium4 -gdwarf-4 -fno-debug-types-section -fvar-tracking-assignments -g2 -fPIC -fPIC

creating build-3/temp.linux-i686-3.9
creating build-3/temp.linux-i686-3.9/numpy
creating build-3/temp.linux-i686-3.9/numpy/core
creating build-3/temp.linux-i686-3.9/numpy/core/src
creating build-3/temp.linux-i686-3.9/numpy/core/src/npymath
creating build-3/temp.linux-i686-3.9/build-3
creating build-3/temp.linux-i686-3.9/build-3/src.linux-i686-3.9
creating build-3/temp.linux-i686-3.9/build-3/src.linux-i686-3.9/numpy
creating build-3/temp.linux-i686-3.9/build-3/src.linux-i686-3.9/numpy/core
creating build-3/temp.linux-i686-3.9/build-3/src.linux-i686-3.9/numpy/core/src
creating build-3/temp.linux-i686-3.9/build-3/src.linux-i686-3.9/numpy/core/src/npymath
compile options: '-Ibuild-3/src.linux-i686-3.9/numpy/core/src/npymath -Inumpy/core/include -Ibuild-3/src.linux-i686-3.9/numpy/core/include/numpy -Inumpy/core/src/common -Inumpy/core/src -Inumpy/core -Inumpy/core/src/npymath -Inumpy/core/src/multiarray -Inumpy/core/src/umath -Inumpy/core/src/npysort -I/usr/include/python3.9 -Ibuild-3/src.linux-i686-3.9/numpy/core/src/common -Ibuild-3/src.linux-i686-3.9/numpy/core/src/npymath -c'
extra options: '-std=c99'
i686-pld-linux-gcc: numpy/core/src/npymath/npy_math.c
i686-pld-linux-gcc: build-3/src.linux-i686-3.9/numpy/core/src/npymath/ieee754.c
i686-pld-linux-gcc: build-3/src.linux-i686-3.9/numpy/core/src/npymath/npy_math_complex.c
i686-pld-linux-gcc: numpy/core/src/npymath/halffloat.c
ar: adding 4 object files to build-3/temp.linux-i686-3.9/libnpymath.a
building 'npysort' library
compiling C sources
C compiler: i686-pld-linux-gcc -Wno-unused-result -Wsign-compare -DNDEBUG -O2 -fwrapv -pipe -Wformat -Werror=format-security -gdwarf-4 -fno-debug-types-section -fvar-tracking-assignments -g2 -Wp,-D_FORTIFY_SOURCE=2 -fstack-protector-strong --param=ssp-buffer-size=4 -Werror=trampolines -fomit-frame-pointer -march=i686 -fasynchronous-unwind-tables -mtune=pentium4 -gdwarf-4 -fno-debug-types-section -fvar-tracking-assignments -g2 -O2 -fwrapv -pipe -Wformat -Werror=format-security -gdwarf-4 -fno-debug-types-section -fvar-tracking-assignments -g2 -Wp,-D_FORTIFY_SOURCE=2 -fstack-protector-strong --param=ssp-buffer-size=4 -Werror=trampolines -fomit-frame-pointer -march=i686 -fasynchronous-unwind-tables -mtune=pentium4 -gdwarf-4 -fno-debug-types-section -fvar-tracking-assignments -g2 -O2 -fwrapv -pipe -Wformat -Werror=format-security -gdwarf-4 -fno-debug-types-section -fvar-tracking-assignments -g2 -Wp,-D_FORTIFY_SOURCE=2 -fstack-protector-strong --param=ssp-buffer-size=4 -Werror=trampolines -fomit-frame-pointer -march=i686 -fasynchronous-unwind-tables -mtune=pentium4 -gdwarf-4 -fno-debug-types-section -fvar-tracking-assignments -g2 -fPIC -fPIC

creating build-3/temp.linux-i686-3.9/build-3/src.linux-i686-3.9/numpy/core/src/npysort
compile options: '-Ibuild-3/src.linux-i686-3.9/numpy/core/src/common -Inumpy/core/include -Ibuild-3/src.linux-i686-3.9/numpy/core/include/numpy -Inumpy/core/src/common -Inumpy/core/src -Inumpy/core -Inumpy/core/src/npymath -Inumpy/core/src/multiarray -Inumpy/core/src/umath -Inumpy/core/src/npysort -I/usr/include/python3.9 -Ibuild-3/src.linux-i686-3.9/numpy/core/src/common -Ibuild-3/src.linux-i686-3.9/numpy/core/src/npymath -c'
extra options: '-std=c99'
i686-pld-linux-gcc: build-3/src.linux-i686-3.9/numpy/core/src/npysort/quicksort.c
i686-pld-linux-gcc: build-3/src.linux-i686-3.9/numpy/core/src/npysort/mergesort.c
i686-pld-linux-gcc: build-3/src.linux-i686-3.9/numpy/core/src/npysort/timsort.c
i686-pld-linux-gcc: build-3/src.linux-i686-3.9/numpy/core/src/npysort/heapsort.c
i686-pld-linux-gcc: build-3/src.linux-i686-3.9/numpy/core/src/npysort/radixsort.c
i686-pld-linux-gcc: build-3/src.linux-i686-3.9/numpy/core/src/npysort/binsearch.c
i686-pld-linux-gcc: build-3/src.linux-i686-3.9/numpy/core/src/npysort/selection.c
ar: adding 7 object files to build-3/temp.linux-i686-3.9/libnpysort.a
building 'npyrandom' library
compiling C sources
C compiler: i686-pld-linux-gcc -Wno-unused-result -Wsign-compare -DNDEBUG -O2 -fwrapv -pipe -Wformat -Werror=format-security -gdwarf-4 -fno-debug-types-section -fvar-tracking-assignments -g2 -Wp,-D_FORTIFY_SOURCE=2 -fstack-protector-strong --param=ssp-buffer-size=4 -Werror=trampolines -fomit-frame-pointer -march=i686 -fasynchronous-unwind-tables -mtune=pentium4 -gdwarf-4 -fno-debug-types-section -fvar-tracking-assignments -g2 -O2 -fwrapv -pipe -Wformat -Werror=format-security -gdwarf-4 -fno-debug-types-section -fvar-tracking-assignments -g2 -Wp,-D_FORTIFY_SOURCE=2 -fstack-protector-strong --param=ssp-buffer-size=4 -Werror=trampolines -fomit-frame-pointer -march=i686 -fasynchronous-unwind-tables -mtune=pentium4 -gdwarf-4 -fno-debug-types-section -fvar-tracking-assignments -g2 -O2 -fwrapv -pipe -Wformat -Werror=format-security -gdwarf-4 -fno-debug-types-section -fvar-tracking-assignments -g2 -Wp,-D_FORTIFY_SOURCE=2 -fstack-protector-strong --param=ssp-buffer-size=4 -Werror=trampolines -fomit-frame-pointer -march=i686 -fasynchronous-unwind-tables -mtune=pentium4 -gdwarf-4 -fno-debug-types-section -fvar-tracking-assignments -g2 -fPIC -fPIC

creating build-3/temp.linux-i686-3.9/numpy/random
creating build-3/temp.linux-i686-3.9/numpy/random/src
creating build-3/temp.linux-i686-3.9/numpy/random/src/distributions
compile options: '-Inumpy/core/include -Ibuild-3/src.linux-i686-3.9/numpy/core/include/numpy -Inumpy/core/src/common -Inumpy/core/src -Inumpy/core -Inumpy/core/src/npymath -Inumpy/core/src/multiarray -Inumpy/core/src/umath -Inumpy/core/src/npysort -I/usr/include/python3.9 -Ibuild-3/src.linux-i686-3.9/numpy/core/src/common -Ibuild-3/src.linux-i686-3.9/numpy/core/src/npymath -c'
extra options: '-std=c99'
i686-pld-linux-gcc: numpy/random/src/distributions/logfactorial.c
i686-pld-linux-gcc: numpy/random/src/distributions/distributions.c
i686-pld-linux-gcc: numpy/random/src/distributions/random_mvhg_count.c
i686-pld-linux-gcc: numpy/random/src/distributions/random_hypergeometric.c
i686-pld-linux-gcc: numpy/random/src/distributions/random_mvhg_marginals.c
ar: adding 5 object files to build-3/temp.linux-i686-3.9/libnpyrandom.a
running build_ext
customize UnixCCompiler
customize UnixCCompiler using new_build_ext
building 'numpy.core._multiarray_tests' extension
compiling C sources
C compiler: i686-pld-linux-gcc -Wno-unused-result -Wsign-compare -DNDEBUG -O2 -fwrapv -pipe -Wformat -Werror=format-security -gdwarf-4 -fno-debug-types-section -fvar-tracking-assignments -g2 -Wp,-D_FORTIFY_SOURCE=2 -fstack-protector-strong --param=ssp-buffer-size=4 -Werror=trampolines -fomit-frame-pointer -march=i686 -fasynchronous-unwind-tables -mtune=pentium4 -gdwarf-4 -fno-debug-types-section -fvar-tracking-assignments -g2 -O2 -fwrapv -pipe -Wformat -Werror=format-security -gdwarf-4 -fno-debug-types-section -fvar-tracking-assignments -g2 -Wp,-D_FORTIFY_SOURCE=2 -fstack-protector-strong --param=ssp-buffer-size=4 -Werror=trampolines -fomit-frame-pointer -march=i686 -fasynchronous-unwind-tables -mtune=pentium4 -gdwarf-4 -fno-debug-types-section -fvar-tracking-assignments -g2 -O2 -fwrapv -pipe -Wformat -Werror=format-security -gdwarf-4 -fno-debug-types-section -fvar-tracking-assignments -g2 -Wp,-D_FORTIFY_SOURCE=2 -fstack-protector-strong --param=ssp-buffer-size=4 -Werror=trampolines -fomit-frame-pointer -march=i686 -fasynchronous-unwind-tables -mtune=pentium4 -gdwarf-4 -fno-debug-types-section -fvar-tracking-assignments -g2 -fPIC -fPIC

creating build-3/temp.linux-i686-3.9/build-3/src.linux-i686-3.9/numpy/core/src/multiarray
creating build-3/temp.linux-i686-3.9/numpy/core/src/common
compile options: '-DNPY_INTERNAL_BUILD=1 -DHAVE_NPY_CONFIG_H=1 -D_FILE_OFFSET_BITS=64 -D_LARGEFILE_SOURCE=1 -D_LARGEFILE64_SOURCE=1 -Inumpy/core/include -Ibuild-3/src.linux-i686-3.9/numpy/core/include/numpy -Inumpy/core/src/common -Inumpy/core/src -Inumpy/core -Inumpy/core/src/npymath -Inumpy/core/src/multiarray -Inumpy/core/src/umath -Inumpy/core/src/npysort -I/usr/include/python3.9 -Ibuild-3/src.linux-i686-3.9/numpy/core/src/common -Ibuild-3/src.linux-i686-3.9/numpy/core/src/npymath -c'
extra options: '-std=c99'
i686-pld-linux-gcc: build-3/src.linux-i686-3.9/numpy/core/src/multiarray/_multiarray_tests.c
i686-pld-linux-gcc: numpy/core/src/common/mem_overlap.c
numpy/core/src/multiarray/_multiarray_tests.c.src: In function 'array_solve_diophantine':
numpy/core/src/multiarray/_multiarray_tests.c.src:1152:29: warning: comparison of integer expressions of different signedness: 'Py_ssize_t' {aka 'int'} and 'unsigned int' [-Wsign-compare]
 1152 |     if (PyTuple_GET_SIZE(U) != nterms) {
      |                             ^~
i686-pld-linux-gcc -shared -Wl,--as-needed -Wl,--no-copy-dt-needed-entries -Wl,-z,relro -Wl,-z,combreloc -Wl,--as-needed -Wl,--no-copy-dt-needed-entries -Wl,-z,relro -Wl,-z,combreloc -shared -O2 -fwrapv -pipe -Wformat -Werror=format-security -gdwarf-4 -fno-debug-types-section -fvar-tracking-assignments -g2 -Wp,-D_FORTIFY_SOURCE=2 -fstack-protector-strong --param=ssp-buffer-size=4 -Werror=trampolines -fomit-frame-pointer -march=i686 -fasynchronous-unwind-tables -mtune=pentium4 -gdwarf-4 -fno-debug-types-section -fvar-tracking-assignments -g2 -fPIC build-3/temp.linux-i686-3.9/build-3/src.linux-i686-3.9/numpy/core/src/multiarray/_multiarray_tests.o build-3/temp.linux-i686-3.9/numpy/core/src/common/mem_overlap.o -L/usr/lib -Lbuild-3/temp.linux-i686-3.9 -lnpymath -o build-3/lib.linux-i686-3.9/numpy/core/_multiarray_tests.cpython-39-i386-linux-gnu.so
building 'numpy.core._multiarray_umath' extension
compiling C sources
C compiler: i686-pld-linux-gcc -Wno-unused-result -Wsign-compare -DNDEBUG -O2 -fwrapv -pipe -Wformat -Werror=format-security -gdwarf-4 -fno-debug-types-section -fvar-tracking-assignments -g2 -Wp,-D_FORTIFY_SOURCE=2 -fstack-protector-strong --param=ssp-buffer-size=4 -Werror=trampolines -fomit-frame-pointer -march=i686 -fasynchronous-unwind-tables -mtune=pentium4 -gdwarf-4 -fno-debug-types-section -fvar-tracking-assignments -g2 -O2 -fwrapv -pipe -Wformat -Werror=format-security -gdwarf-4 -fno-debug-types-section -fvar-tracking-assignments -g2 -Wp,-D_FORTIFY_SOURCE=2 -fstack-protector-strong --param=ssp-buffer-size=4 -Werror=trampolines -fomit-frame-pointer -march=i686 -fasynchronous-unwind-tables -mtune=pentium4 -gdwarf-4 -fno-debug-types-section -fvar-tracking-assignments -g2 -O2 -fwrapv -pipe -Wformat -Werror=format-security -gdwarf-4 -fno-debug-types-section -fvar-tracking-assignments -g2 -Wp,-D_FORTIFY_SOURCE=2 -fstack-protector-strong --param=ssp-buffer-size=4 -Werror=trampolines -fomit-frame-pointer -march=i686 -fasynchronous-unwind-tables -mtune=pentium4 -gdwarf-4 -fno-debug-types-section -fvar-tracking-assignments -g2 -fPIC -fPIC

creating build-3/temp.linux-i686-3.9/numpy/core/src/multiarray
creating build-3/temp.linux-i686-3.9/numpy/core/src/umath
creating build-3/temp.linux-i686-3.9/build-3/src.linux-i686-3.9/numpy/core/src/umath
creating build-3/temp.linux-i686-3.9/build-3/src.linux-i686-3.9/numpy/core/src/common
compile options: '-DNPY_INTERNAL_BUILD=1 -DHAVE_NPY_CONFIG_H=1 -D_FILE_OFFSET_BITS=64 -D_LARGEFILE_SOURCE=1 -D_LARGEFILE64_SOURCE=1 -DNO_ATLAS_INFO=1 -DHAVE_CBLAS -I/usr/local/include -I/usr/include -Ibuild-3/src.linux-i686-3.9/numpy/core/src/umath -Ibuild-3/src.linux-i686-3.9/numpy/core/src/npymath -Ibuild-3/src.linux-i686-3.9/numpy/core/src/common -Inumpy/core/include -Ibuild-3/src.linux-i686-3.9/numpy/core/include/numpy -Inumpy/core/src/common -Inumpy/core/src -Inumpy/core -Inumpy/core/src/npymath -Inumpy/core/src/multiarray -Inumpy/core/src/umath -Inumpy/core/src/npysort -I/usr/include/python3.9 -Ibuild-3/src.linux-i686-3.9/numpy/core/src/common -Ibuild-3/src.linux-i686-3.9/numpy/core/src/npymath -c'
extra options: '-std=c99'
i686-pld-linux-gcc: numpy/core/src/multiarray/alloc.c
i686-pld-linux-gcc: numpy/core/src/multiarray/array_assign_scalar.c
i686-pld-linux-gcc: numpy/core/src/multiarray/common.c
i686-pld-linux-gcc: numpy/core/src/multiarray/datetime_strings.c
i686-pld-linux-gcc: numpy/core/src/multiarray/buffer.c
i686-pld-linux-gcc: numpy/core/src/multiarray/conversion_utils.c
i686-pld-linux-gcc: build-3/src.linux-i686-3.9/numpy/core/src/multiarray/einsum.c
i686-pld-linux-gcc: numpy/core/src/multiarray/descriptor.c
i686-pld-linux-gcc: numpy/core/src/multiarray/arrayobject.c
i686-pld-linux-gcc: numpy/core/src/multiarray/array_assign_array.c
i686-pld-linux-gcc: numpy/core/src/multiarray/ctors.c
i686-pld-linux-gcc: numpy/core/src/multiarray/convert.c
i686-pld-linux-gcc: numpy/core/src/multiarray/calculation.c
i686-pld-linux-gcc: numpy/core/src/multiarray/arrayfunction_override.c
i686-pld-linux-gcc: numpy/core/src/multiarray/datetime_busday.c
i686-pld-linux-gcc: numpy/core/src/multiarray/convert_datatype.c
i686-pld-linux-gcc: numpy/core/src/multiarray/hashdescr.c
i686-pld-linux-gcc: numpy/core/src/multiarray/item_selection.c
i686-pld-linux-gcc: numpy/core/src/multiarray/compiled_base.c
i686-pld-linux-gcc: numpy/core/src/multiarray/datetime_busdaycal.c
i686-pld-linux-gcc: numpy/core/src/multiarray/dragon4.c
i686-pld-linux-gcc: build-3/src.linux-i686-3.9/numpy/core/src/multiarray/arraytypes.c
i686-pld-linux-gcc: build-3/src.linux-i686-3.9/numpy/core/src/multiarray/lowlevel_strided_loops.c
i686-pld-linux-gcc: numpy/core/src/multiarray/multiarraymodule.c
i686-pld-linux-gcc: numpy/core/src/multiarray/datetime.c
i686-pld-linux-gcc: numpy/core/src/multiarray/dtype_transfer.c
i686-pld-linux-gcc: numpy/core/src/multiarray/nditer_constr.c
i686-pld-linux-gcc: numpy/core/src/multiarray/iterators.c
i686-pld-linux-gcc: numpy/core/src/multiarray/refcount.c
i686-pld-linux-gcc: numpy/core/src/multiarray/scalarapi.c
i686-pld-linux-gcc: numpy/core/src/multiarray/nditer_pywrap.c
i686-pld-linux-gcc: numpy/core/src/multiarray/sequence.c
i686-pld-linux-gcc: numpy/core/src/multiarray/shape.c
i686-pld-linux-gcc: build-3/src.linux-i686-3.9/numpy/core/src/multiarray/scalartypes.c
i686-pld-linux-gcc: numpy/core/src/multiarray/temp_elide.c
i686-pld-linux-gcc: numpy/core/src/multiarray/typeinfo.c
i686-pld-linux-gcc: numpy/core/src/multiarray/vdot.c
i686-pld-linux-gcc: numpy/core/src/multiarray/number.c
i686-pld-linux-gcc: numpy/core/src/multiarray/usertypes.c
i686-pld-linux-gcc: numpy/core/src/umath/umathmodule.c
i686-pld-linux-gcc: build-3/src.linux-i686-3.9/numpy/core/src/umath/loops.c
i686-pld-linux-gcc: numpy/core/src/umath/reduction.c
i686-pld-linux-gcc: numpy/core/src/umath/ufunc_object.c
i686-pld-linux-gcc: numpy/core/src/umath/ufunc_type_resolution.c
i686-pld-linux-gcc: build-3/src.linux-i686-3.9/numpy/core/src/multiarray/nditer_templ.c
i686-pld-linux-gcc: numpy/core/src/multiarray/flagsobject.c
i686-pld-linux-gcc: numpy/core/src/multiarray/getset.c
i686-pld-linux-gcc: numpy/core/src/umath/override.c
i686-pld-linux-gcc: numpy/core/src/multiarray/strfuncs.c
i686-pld-linux-gcc: numpy/core/src/npymath/npy_math.c
i686-pld-linux-gcc: build-3/src.linux-i686-3.9/numpy/core/src/npymath/ieee754.c
i686-pld-linux-gcc: numpy/core/src/multiarray/nditer_api.c
i686-pld-linux-gcc: numpy/core/src/common/array_assign.c
i686-pld-linux-gcc: build-3/src.linux-i686-3.9/numpy/core/src/npymath/npy_math_complex.c
i686-pld-linux-gcc: numpy/core/src/common/mem_overlap.c
i686-pld-linux-gcc: numpy/core/src/common/ucsnarrow.c
i686-pld-linux-gcc: numpy/core/src/common/ufunc_override.c
i686-pld-linux-gcc: numpy/core/src/npymath/halffloat.c
i686-pld-linux-gcc: numpy/core/src/common/numpyos.c
i686-pld-linux-gcc: build-3/src.linux-i686-3.9/numpy/core/src/common/npy_cpu_features.c
i686-pld-linux-gcc: numpy/core/src/umath/extobj.c
i686-pld-linux-gcc: numpy/core/src/common/npy_longdouble.c
i686-pld-linux-gcc: build-3/src.linux-i686-3.9/numpy/core/src/umath/scalarmath.c
i686-pld-linux-gcc: numpy/core/src/common/cblasfuncs.c
i686-pld-linux-gcc: numpy/core/src/common/python_xerbla.c
i686-pld-linux-gcc: numpy/core/src/multiarray/mapping.c
i686-pld-linux-gcc: numpy/core/src/multiarray/methods.c
i686-pld-linux-gcc: build-3/src.linux-i686-3.9/numpy/core/src/umath/matmul.c
i686-pld-linux-gcc: build-3/src.linux-i686-3.9/numpy/core/src/umath/clip.c
i686-pld-linux-gcc -shared -Wl,--as-needed -Wl,--no-copy-dt-needed-entries -Wl,-z,relro -Wl,-z,combreloc -Wl,--as-needed -Wl,--no-copy-dt-needed-entries -Wl,-z,relro -Wl,-z,combreloc -shared -O2 -fwrapv -pipe -Wformat -Werror=format-security -gdwarf-4 -fno-debug-types-section -fvar-tracking-assignments -g2 -Wp,-D_FORTIFY_SOURCE=2 -fstack-protector-strong --param=ssp-buffer-size=4 -Werror=trampolines -fomit-frame-pointer -march=i686 -fasynchronous-unwind-tables -mtune=pentium4 -gdwarf-4 -fno-debug-types-section -fvar-tracking-assignments -g2 -fPIC build-3/temp.linux-i686-3.9/numpy/core/src/multiarray/alloc.o build-3/temp.linux-i686-3.9/numpy/core/src/multiarray/arrayobject.o build-3/temp.linux-i686-3.9/build-3/src.linux-i686-3.9/numpy/core/src/multiarray/arraytypes.o build-3/temp.linux-i686-3.9/numpy/core/src/multiarray/array_assign_scalar.o build-3/temp.linux-i686-3.9/numpy/core/src/multiarray/array_assign_array.o build-3/temp.linux-i686-3.9/numpy/core/src/multiarray/arrayfunction_override.o build-3/temp.linux-i686-3.9/numpy/core/src/multiarray/buffer.o build-3/temp.linux-i686-3.9/numpy/core/src/multiarray/calculation.o build-3/temp.linux-i686-3.9/numpy/core/src/multiarray/compiled_base.o build-3/temp.linux-i686-3.9/numpy/core/src/multiarray/common.o build-3/temp.linux-i686-3.9/numpy/core/src/multiarray/convert.o build-3/temp.linux-i686-3.9/numpy/core/src/multiarray/convert_datatype.o build-3/temp.linux-i686-3.9/numpy/core/src/multiarray/conversion_utils.o build-3/temp.linux-i686-3.9/numpy/core/src/multiarray/ctors.o build-3/temp.linux-i686-3.9/numpy/core/src/multiarray/datetime.o build-3/temp.linux-i686-3.9/numpy/core/src/multiarray/datetime_strings.o build-3/temp.linux-i686-3.9/numpy/core/src/multiarray/datetime_busday.o build-3/temp.linux-i686-3.9/numpy/core/src/multiarray/datetime_busdaycal.o build-3/temp.linux-i686-3.9/numpy/core/src/multiarray/descriptor.o build-3/temp.linux-i686-3.9/numpy/core/src/multiarray/dragon4.o build-3/temp.linux-i686-3.9/numpy/core/src/multiarray/dtype_transfer.o build-3/temp.linux-i686-3.9/build-3/src.linux-i686-3.9/numpy/core/src/multiarray/einsum.o build-3/temp.linux-i686-3.9/numpy/core/src/multiarray/flagsobject.o build-3/temp.linux-i686-3.9/numpy/core/src/multiarray/getset.o build-3/temp.linux-i686-3.9/numpy/core/src/multiarray/hashdescr.o build-3/temp.linux-i686-3.9/numpy/core/src/multiarray/item_selection.o build-3/temp.linux-i686-3.9/numpy/core/src/multiarray/iterators.o build-3/temp.linux-i686-3.9/build-3/src.linux-i686-3.9/numpy/core/src/multiarray/lowlevel_strided_loops.o build-3/temp.linux-i686-3.9/numpy/core/src/multiarray/mapping.o build-3/temp.linux-i686-3.9/numpy/core/src/multiarray/methods.o build-3/temp.linux-i686-3.9/numpy/core/src/multiarray/multiarraymodule.o build-3/temp.linux-i686-3.9/build-3/src.linux-i686-3.9/numpy/core/src/multiarray/nditer_templ.o build-3/temp.linux-i686-3.9/numpy/core/src/multiarray/nditer_api.o build-3/temp.linux-i686-3.9/numpy/core/src/multiarray/nditer_constr.o build-3/temp.linux-i686-3.9/numpy/core/src/multiarray/nditer_pywrap.o build-3/temp.linux-i686-3.9/numpy/core/src/multiarray/number.o build-3/temp.linux-i686-3.9/numpy/core/src/multiarray/refcount.o build-3/temp.linux-i686-3.9/numpy/core/src/multiarray/sequence.o build-3/temp.linux-i686-3.9/numpy/core/src/multiarray/shape.o build-3/temp.linux-i686-3.9/numpy/core/src/multiarray/scalarapi.o build-3/temp.linux-i686-3.9/build-3/src.linux-i686-3.9/numpy/core/src/multiarray/scalartypes.o build-3/temp.linux-i686-3.9/numpy/core/src/multiarray/strfuncs.o build-3/temp.linux-i686-3.9/numpy/core/src/multiarray/temp_elide.o build-3/temp.linux-i686-3.9/numpy/core/src/multiarray/typeinfo.o build-3/temp.linux-i686-3.9/numpy/core/src/multiarray/usertypes.o build-3/temp.linux-i686-3.9/numpy/core/src/multiarray/vdot.o build-3/temp.linux-i686-3.9/numpy/core/src/umath/umathmodule.o build-3/temp.linux-i686-3.9/numpy/core/src/umath/reduction.o build-3/temp.linux-i686-3.9/build-3/src.linux-i686-3.9/numpy/core/src/umath/loops.o build-3/temp.linux-i686-3.9/build-3/src.linux-i686-3.9/numpy/core/src/umath/matmul.o build-3/temp.linux-i686-3.9/build-3/src.linux-i686-3.9/numpy/core/src/umath/clip.o build-3/temp.linux-i686-3.9/numpy/core/src/umath/ufunc_object.o build-3/temp.linux-i686-3.9/numpy/core/src/umath/extobj.o build-3/temp.linux-i686-3.9/build-3/src.linux-i686-3.9/numpy/core/src/umath/scalarmath.o build-3/temp.linux-i686-3.9/numpy/core/src/umath/ufunc_type_resolution.o build-3/temp.linux-i686-3.9/numpy/core/src/umath/override.o build-3/temp.linux-i686-3.9/numpy/core/src/npymath/npy_math.o build-3/temp.linux-i686-3.9/build-3/src.linux-i686-3.9/numpy/core/src/npymath/ieee754.o build-3/temp.linux-i686-3.9/build-3/src.linux-i686-3.9/numpy/core/src/npymath/npy_math_complex.o build-3/temp.linux-i686-3.9/numpy/core/src/npymath/halffloat.o build-3/temp.linux-i686-3.9/numpy/core/src/common/array_assign.o build-3/temp.linux-i686-3.9/numpy/core/src/common/mem_overlap.o build-3/temp.linux-i686-3.9/numpy/core/src/common/npy_longdouble.o build-3/temp.linux-i686-3.9/numpy/core/src/common/ucsnarrow.o build-3/temp.linux-i686-3.9/numpy/core/src/common/ufunc_override.o build-3/temp.linux-i686-3.9/numpy/core/src/common/numpyos.o build-3/temp.linux-i686-3.9/build-3/src.linux-i686-3.9/numpy/core/src/common/npy_cpu_features.o build-3/temp.linux-i686-3.9/numpy/core/src/common/cblasfuncs.o build-3/temp.linux-i686-3.9/numpy/core/src/common/python_xerbla.o -L/usr/lib -L/usr/lib -Lbuild-3/temp.linux-i686-3.9 -lnpymath -lnpysort -lcblas -lblas -lblas -lm -o build-3/lib.linux-i686-3.9/numpy/core/_multiarray_umath.cpython-39-i386-linux-gnu.so
building 'numpy.core._umath_tests' extension
compiling C sources
C compiler: i686-pld-linux-gcc -Wno-unused-result -Wsign-compare -DNDEBUG -O2 -fwrapv -pipe -Wformat -Werror=format-security -gdwarf-4 -fno-debug-types-section -fvar-tracking-assignments -g2 -Wp,-D_FORTIFY_SOURCE=2 -fstack-protector-strong --param=ssp-buffer-size=4 -Werror=trampolines -fomit-frame-pointer -march=i686 -fasynchronous-unwind-tables -mtune=pentium4 -gdwarf-4 -fno-debug-types-section -fvar-tracking-assignments -g2 -O2 -fwrapv -pipe -Wformat -Werror=format-security -gdwarf-4 -fno-debug-types-section -fvar-tracking-assignments -g2 -Wp,-D_FORTIFY_SOURCE=2 -fstack-protector-strong --param=ssp-buffer-size=4 -Werror=trampolines -fomit-frame-pointer -march=i686 -fasynchronous-unwind-tables -mtune=pentium4 -gdwarf-4 -fno-debug-types-section -fvar-tracking-assignments -g2 -O2 -fwrapv -pipe -Wformat -Werror=format-security -gdwarf-4 -fno-debug-types-section -fvar-tracking-assignments -g2 -Wp,-D_FORTIFY_SOURCE=2 -fstack-protector-strong --param=ssp-buffer-size=4 -Werror=trampolines -fomit-frame-pointer -march=i686 -fasynchronous-unwind-tables -mtune=pentium4 -gdwarf-4 -fno-debug-types-section -fvar-tracking-assignments -g2 -fPIC -fPIC

compile options: '-DNPY_INTERNAL_BUILD=1 -DHAVE_NPY_CONFIG_H=1 -D_FILE_OFFSET_BITS=64 -D_LARGEFILE_SOURCE=1 -D_LARGEFILE64_SOURCE=1 -Inumpy/core/include -Ibuild-3/src.linux-i686-3.9/numpy/core/include/numpy -Inumpy/core/src/common -Inumpy/core/src -Inumpy/core -Inumpy/core/src/npymath -Inumpy/core/src/multiarray -Inumpy/core/src/umath -Inumpy/core/src/npysort -I/usr/include/python3.9 -Ibuild-3/src.linux-i686-3.9/numpy/core/src/common -Ibuild-3/src.linux-i686-3.9/numpy/core/src/npymath -c'
extra options: '-std=c99'
i686-pld-linux-gcc: build-3/src.linux-i686-3.9/numpy/core/src/umath/_umath_tests.c
i686-pld-linux-gcc -shared -Wl,--as-needed -Wl,--no-copy-dt-needed-entries -Wl,-z,relro -Wl,-z,combreloc -Wl,--as-needed -Wl,--no-copy-dt-needed-entries -Wl,-z,relro -Wl,-z,combreloc -shared -O2 -fwrapv -pipe -Wformat -Werror=format-security -gdwarf-4 -fno-debug-types-section -fvar-tracking-assignments -g2 -Wp,-D_FORTIFY_SOURCE=2 -fstack-protector-strong --param=ssp-buffer-size=4 -Werror=trampolines -fomit-frame-pointer -march=i686 -fasynchronous-unwind-tables -mtune=pentium4 -gdwarf-4 -fno-debug-types-section -fvar-tracking-assignments -g2 -fPIC build-3/temp.linux-i686-3.9/build-3/src.linux-i686-3.9/numpy/core/src/umath/_umath_tests.o -L/usr/lib -Lbuild-3/temp.linux-i686-3.9 -o build-3/lib.linux-i686-3.9/numpy/core/_umath_tests.cpython-39-i386-linux-gnu.so
building 'numpy.core._rational_tests' extension
compiling C sources
C compiler: i686-pld-linux-gcc -Wno-unused-result -Wsign-compare -DNDEBUG -O2 -fwrapv -pipe -Wformat -Werror=format-security -gdwarf-4 -fno-debug-types-section -fvar-tracking-assignments -g2 -Wp,-D_FORTIFY_SOURCE=2 -fstack-protector-strong --param=ssp-buffer-size=4 -Werror=trampolines -fomit-frame-pointer -march=i686 -fasynchronous-unwind-tables -mtune=pentium4 -gdwarf-4 -fno-debug-types-section -fvar-tracking-assignments -g2 -O2 -fwrapv -pipe -Wformat -Werror=format-security -gdwarf-4 -fno-debug-types-section -fvar-tracking-assignments -g2 -Wp,-D_FORTIFY_SOURCE=2 -fstack-protector-strong --param=ssp-buffer-size=4 -Werror=trampolines -fomit-frame-pointer -march=i686 -fasynchronous-unwind-tables -mtune=pentium4 -gdwarf-4 -fno-debug-types-section -fvar-tracking-assignments -g2 -O2 -fwrapv -pipe -Wformat -Werror=format-security -gdwarf-4 -fno-debug-types-section -fvar-tracking-assignments -g2 -Wp,-D_FORTIFY_SOURCE=2 -fstack-protector-strong --param=ssp-buffer-size=4 -Werror=trampolines -fomit-frame-pointer -march=i686 -fasynchronous-unwind-tables -mtune=pentium4 -gdwarf-4 -fno-debug-types-section -fvar-tracking-assignments -g2 -fPIC -fPIC

compile options: '-DNPY_INTERNAL_BUILD=1 -DHAVE_NPY_CONFIG_H=1 -D_FILE_OFFSET_BITS=64 -D_LARGEFILE_SOURCE=1 -D_LARGEFILE64_SOURCE=1 -Inumpy/core/include -Ibuild-3/src.linux-i686-3.9/numpy/core/include/numpy -Inumpy/core/src/common -Inumpy/core/src -Inumpy/core -Inumpy/core/src/npymath -Inumpy/core/src/multiarray -Inumpy/core/src/umath -Inumpy/core/src/npysort -I/usr/include/python3.9 -Ibuild-3/src.linux-i686-3.9/numpy/core/src/common -Ibuild-3/src.linux-i686-3.9/numpy/core/src/npymath -c'
extra options: '-std=c99'
i686-pld-linux-gcc: build-3/src.linux-i686-3.9/numpy/core/src/umath/_rational_tests.c
i686-pld-linux-gcc -shared -Wl,--as-needed -Wl,--no-copy-dt-needed-entries -Wl,-z,relro -Wl,-z,combreloc -Wl,--as-needed -Wl,--no-copy-dt-needed-entries -Wl,-z,relro -Wl,-z,combreloc -shared -O2 -fwrapv -pipe -Wformat -Werror=format-security -gdwarf-4 -fno-debug-types-section -fvar-tracking-assignments -g2 -Wp,-D_FORTIFY_SOURCE=2 -fstack-protector-strong --param=ssp-buffer-size=4 -Werror=trampolines -fomit-frame-pointer -march=i686 -fasynchronous-unwind-tables -mtune=pentium4 -gdwarf-4 -fno-debug-types-section -fvar-tracking-assignments -g2 -fPIC build-3/temp.linux-i686-3.9/build-3/src.linux-i686-3.9/numpy/core/src/umath/_rational_tests.o -L/usr/lib -Lbuild-3/temp.linux-i686-3.9 -o build-3/lib.linux-i686-3.9/numpy/core/_rational_tests.cpython-39-i386-linux-gnu.so
building 'numpy.core._struct_ufunc_tests' extension
compiling C sources
C compiler: i686-pld-linux-gcc -Wno-unused-result -Wsign-compare -DNDEBUG -O2 -fwrapv -pipe -Wformat -Werror=format-security -gdwarf-4 -fno-debug-types-section -fvar-tracking-assignments -g2 -Wp,-D_FORTIFY_SOURCE=2 -fstack-protector-strong --param=ssp-buffer-size=4 -Werror=trampolines -fomit-frame-pointer -march=i686 -fasynchronous-unwind-tables -mtune=pentium4 -gdwarf-4 -fno-debug-types-section -fvar-tracking-assignments -g2 -O2 -fwrapv -pipe -Wformat -Werror=format-security -gdwarf-4 -fno-debug-types-section -fvar-tracking-assignments -g2 -Wp,-D_FORTIFY_SOURCE=2 -fstack-protector-strong --param=ssp-buffer-size=4 -Werror=trampolines -fomit-frame-pointer -march=i686 -fasynchronous-unwind-tables -mtune=pentium4 -gdwarf-4 -fno-debug-types-section -fvar-tracking-assignments -g2 -O2 -fwrapv -pipe -Wformat -Werror=format-security -gdwarf-4 -fno-debug-types-section -fvar-tracking-assignments -g2 -Wp,-D_FORTIFY_SOURCE=2 -fstack-protector-strong --param=ssp-buffer-size=4 -Werror=trampolines -fomit-frame-pointer -march=i686 -fasynchronous-unwind-tables -mtune=pentium4 -gdwarf-4 -fno-debug-types-section -fvar-tracking-assignments -g2 -fPIC -fPIC

compile options: '-DNPY_INTERNAL_BUILD=1 -DHAVE_NPY_CONFIG_H=1 -D_FILE_OFFSET_BITS=64 -D_LARGEFILE_SOURCE=1 -D_LARGEFILE64_SOURCE=1 -Inumpy/core/include -Ibuild-3/src.linux-i686-3.9/numpy/core/include/numpy -Inumpy/core/src/common -Inumpy/core/src -Inumpy/core -Inumpy/core/src/npymath -Inumpy/core/src/multiarray -Inumpy/core/src/umath -Inumpy/core/src/npysort -I/usr/include/python3.9 -Ibuild-3/src.linux-i686-3.9/numpy/core/src/common -Ibuild-3/src.linux-i686-3.9/numpy/core/src/npymath -c'
extra options: '-std=c99'
i686-pld-linux-gcc: build-3/src.linux-i686-3.9/numpy/core/src/umath/_struct_ufunc_tests.c
i686-pld-linux-gcc -shared -Wl,--as-needed -Wl,--no-copy-dt-needed-entries -Wl,-z,relro -Wl,-z,combreloc -Wl,--as-needed -Wl,--no-copy-dt-needed-entries -Wl,-z,relro -Wl,-z,combreloc -shared -O2 -fwrapv -pipe -Wformat -Werror=format-security -gdwarf-4 -fno-debug-types-section -fvar-tracking-assignments -g2 -Wp,-D_FORTIFY_SOURCE=2 -fstack-protector-strong --param=ssp-buffer-size=4 -Werror=trampolines -fomit-frame-pointer -march=i686 -fasynchronous-unwind-tables -mtune=pentium4 -gdwarf-4 -fno-debug-types-section -fvar-tracking-assignments -g2 -fPIC build-3/temp.linux-i686-3.9/build-3/src.linux-i686-3.9/numpy/core/src/umath/_struct_ufunc_tests.o -L/usr/lib -Lbuild-3/temp.linux-i686-3.9 -o build-3/lib.linux-i686-3.9/numpy/core/_struct_ufunc_tests.cpython-39-i386-linux-gnu.so
building 'numpy.core._operand_flag_tests' extension
compiling C sources
C compiler: i686-pld-linux-gcc -Wno-unused-result -Wsign-compare -DNDEBUG -O2 -fwrapv -pipe -Wformat -Werror=format-security -gdwarf-4 -fno-debug-types-section -fvar-tracking-assignments -g2 -Wp,-D_FORTIFY_SOURCE=2 -fstack-protector-strong --param=ssp-buffer-size=4 -Werror=trampolines -fomit-frame-pointer -march=i686 -fasynchronous-unwind-tables -mtune=pentium4 -gdwarf-4 -fno-debug-types-section -fvar-tracking-assignments -g2 -O2 -fwrapv -pipe -Wformat -Werror=format-security -gdwarf-4 -fno-debug-types-section -fvar-tracking-assignments -g2 -Wp,-D_FORTIFY_SOURCE=2 -fstack-protector-strong --param=ssp-buffer-size=4 -Werror=trampolines -fomit-frame-pointer -march=i686 -fasynchronous-unwind-tables -mtune=pentium4 -gdwarf-4 -fno-debug-types-section -fvar-tracking-assignments -g2 -O2 -fwrapv -pipe -Wformat -Werror=format-security -gdwarf-4 -fno-debug-types-section -fvar-tracking-assignments -g2 -Wp,-D_FORTIFY_SOURCE=2 -fstack-protector-strong --param=ssp-buffer-size=4 -Werror=trampolines -fomit-frame-pointer -march=i686 -fasynchronous-unwind-tables -mtune=pentium4 -gdwarf-4 -fno-debug-types-section -fvar-tracking-assignments -g2 -fPIC -fPIC

compile options: '-DNPY_INTERNAL_BUILD=1 -DHAVE_NPY_CONFIG_H=1 -D_FILE_OFFSET_BITS=64 -D_LARGEFILE_SOURCE=1 -D_LARGEFILE64_SOURCE=1 -Inumpy/core/include -Ibuild-3/src.linux-i686-3.9/numpy/core/include/numpy -Inumpy/core/src/common -Inumpy/core/src -Inumpy/core -Inumpy/core/src/npymath -Inumpy/core/src/multiarray -Inumpy/core/src/umath -Inumpy/core/src/npysort -I/usr/include/python3.9 -Ibuild-3/src.linux-i686-3.9/numpy/core/src/common -Ibuild-3/src.linux-i686-3.9/numpy/core/src/npymath -c'
extra options: '-std=c99'
i686-pld-linux-gcc: build-3/src.linux-i686-3.9/numpy/core/src/umath/_operand_flag_tests.c
i686-pld-linux-gcc -shared -Wl,--as-needed -Wl,--no-copy-dt-needed-entries -Wl,-z,relro -Wl,-z,combreloc -Wl,--as-needed -Wl,--no-copy-dt-needed-entries -Wl,-z,relro -Wl,-z,combreloc -shared -O2 -fwrapv -pipe -Wformat -Werror=format-security -gdwarf-4 -fno-debug-types-section -fvar-tracking-assignments -g2 -Wp,-D_FORTIFY_SOURCE=2 -fstack-protector-strong --param=ssp-buffer-size=4 -Werror=trampolines -fomit-frame-pointer -march=i686 -fasynchronous-unwind-tables -mtune=pentium4 -gdwarf-4 -fno-debug-types-section -fvar-tracking-assignments -g2 -fPIC build-3/temp.linux-i686-3.9/build-3/src.linux-i686-3.9/numpy/core/src/umath/_operand_flag_tests.o -L/usr/lib -Lbuild-3/temp.linux-i686-3.9 -o build-3/lib.linux-i686-3.9/numpy/core/_operand_flag_tests.cpython-39-i386-linux-gnu.so
building 'numpy.fft._pocketfft_internal' extension
compiling C sources
C compiler: i686-pld-linux-gcc -Wno-unused-result -Wsign-compare -DNDEBUG -O2 -fwrapv -pipe -Wformat -Werror=format-security -gdwarf-4 -fno-debug-types-section -fvar-tracking-assignments -g2 -Wp,-D_FORTIFY_SOURCE=2 -fstack-protector-strong --param=ssp-buffer-size=4 -Werror=trampolines -fomit-frame-pointer -march=i686 -fasynchronous-unwind-tables -mtune=pentium4 -gdwarf-4 -fno-debug-types-section -fvar-tracking-assignments -g2 -O2 -fwrapv -pipe -Wformat -Werror=format-security -gdwarf-4 -fno-debug-types-section -fvar-tracking-assignments -g2 -Wp,-D_FORTIFY_SOURCE=2 -fstack-protector-strong --param=ssp-buffer-size=4 -Werror=trampolines -fomit-frame-pointer -march=i686 -fasynchronous-unwind-tables -mtune=pentium4 -gdwarf-4 -fno-debug-types-section -fvar-tracking-assignments -g2 -O2 -fwrapv -pipe -Wformat -Werror=format-security -gdwarf-4 -fno-debug-types-section -fvar-tracking-assignments -g2 -Wp,-D_FORTIFY_SOURCE=2 -fstack-protector-strong --param=ssp-buffer-size=4 -Werror=trampolines -fomit-frame-pointer -march=i686 -fasynchronous-unwind-tables -mtune=pentium4 -gdwarf-4 -fno-debug-types-section -fvar-tracking-assignments -g2 -fPIC -fPIC

creating build-3/temp.linux-i686-3.9/numpy/fft
compile options: '-Inumpy/core/include -Ibuild-3/src.linux-i686-3.9/numpy/core/include/numpy -Inumpy/core/src/common -Inumpy/core/src -Inumpy/core -Inumpy/core/src/npymath -Inumpy/core/src/multiarray -Inumpy/core/src/umath -Inumpy/core/src/npysort -I/usr/include/python3.9 -Ibuild-3/src.linux-i686-3.9/numpy/core/src/common -Ibuild-3/src.linux-i686-3.9/numpy/core/src/npymath -c'
extra options: '-std=c99'
i686-pld-linux-gcc: numpy/fft/_pocketfft.c
i686-pld-linux-gcc -shared -Wl,--as-needed -Wl,--no-copy-dt-needed-entries -Wl,-z,relro -Wl,-z,combreloc -Wl,--as-needed -Wl,--no-copy-dt-needed-entries -Wl,-z,relro -Wl,-z,combreloc -shared -O2 -fwrapv -pipe -Wformat -Werror=format-security -gdwarf-4 -fno-debug-types-section -fvar-tracking-assignments -g2 -Wp,-D_FORTIFY_SOURCE=2 -fstack-protector-strong --param=ssp-buffer-size=4 -Werror=trampolines -fomit-frame-pointer -march=i686 -fasynchronous-unwind-tables -mtune=pentium4 -gdwarf-4 -fno-debug-types-section -fvar-tracking-assignments -g2 -fPIC build-3/temp.linux-i686-3.9/numpy/fft/_pocketfft.o -L/usr/lib -Lbuild-3/temp.linux-i686-3.9 -o build-3/lib.linux-i686-3.9/numpy/fft/_pocketfft_internal.cpython-39-i386-linux-gnu.so
building 'numpy.linalg.lapack_lite' extension
compiling C sources
C compiler: i686-pld-linux-gcc -Wno-unused-result -Wsign-compare -DNDEBUG -O2 -fwrapv -pipe -Wformat -Werror=format-security -gdwarf-4 -fno-debug-types-section -fvar-tracking-assignments -g2 -Wp,-D_FORTIFY_SOURCE=2 -fstack-protector-strong --param=ssp-buffer-size=4 -Werror=trampolines -fomit-frame-pointer -march=i686 -fasynchronous-unwind-tables -mtune=pentium4 -gdwarf-4 -fno-debug-types-section -fvar-tracking-assignments -g2 -O2 -fwrapv -pipe -Wformat -Werror=format-security -gdwarf-4 -fno-debug-types-section -fvar-tracking-assignments -g2 -Wp,-D_FORTIFY_SOURCE=2 -fstack-protector-strong --param=ssp-buffer-size=4 -Werror=trampolines -fomit-frame-pointer -march=i686 -fasynchronous-unwind-tables -mtune=pentium4 -gdwarf-4 -fno-debug-types-section -fvar-tracking-assignments -g2 -O2 -fwrapv -pipe -Wformat -Werror=format-security -gdwarf-4 -fno-debug-types-section -fvar-tracking-assignments -g2 -Wp,-D_FORTIFY_SOURCE=2 -fstack-protector-strong --param=ssp-buffer-size=4 -Werror=trampolines -fomit-frame-pointer -march=i686 -fasynchronous-unwind-tables -mtune=pentium4 -gdwarf-4 -fno-debug-types-section -fvar-tracking-assignments -g2 -fPIC -fPIC

creating build-3/temp.linux-i686-3.9/numpy/linalg
creating build-3/temp.linux-i686-3.9/numpy/linalg/lapack_lite
compile options: '-DNO_ATLAS_INFO=1 -DHAVE_CBLAS -I/usr/local/include -I/usr/include -Inumpy/core/include -Ibuild-3/src.linux-i686-3.9/numpy/core/include/numpy -Inumpy/core/src/common -Inumpy/core/src -Inumpy/core -Inumpy/core/src/npymath -Inumpy/core/src/multiarray -Inumpy/core/src/umath -Inumpy/core/src/npysort -I/usr/include/python3.9 -Ibuild-3/src.linux-i686-3.9/numpy/core/src/common -Ibuild-3/src.linux-i686-3.9/numpy/core/src/npymath -c'
extra options: '-std=c99'
i686-pld-linux-gcc: numpy/linalg/lapack_litemodule.c
i686-pld-linux-gcc: numpy/linalg/lapack_lite/python_xerbla.c
i686-pld-linux-gcc -shared -Wl,--as-needed -Wl,--no-copy-dt-needed-entries -Wl,-z,relro -Wl,-z,combreloc -Wl,--as-needed -Wl,--no-copy-dt-needed-entries -Wl,-z,relro -Wl,-z,combreloc -shared -O2 -fwrapv -pipe -Wformat -Werror=format-security -gdwarf-4 -fno-debug-types-section -fvar-tracking-assignments -g2 -Wp,-D_FORTIFY_SOURCE=2 -fstack-protector-strong --param=ssp-buffer-size=4 -Werror=trampolines -fomit-frame-pointer -march=i686 -fasynchronous-unwind-tables -mtune=pentium4 -gdwarf-4 -fno-debug-types-section -fvar-tracking-assignments -g2 -fPIC build-3/temp.linux-i686-3.9/numpy/linalg/lapack_litemodule.o build-3/temp.linux-i686-3.9/numpy/linalg/lapack_lite/python_xerbla.o -L/usr/lib -L/usr/lib -Lbuild-3/temp.linux-i686-3.9 -llapack -llapack -lcblas -lblas -lblas -o build-3/lib.linux-i686-3.9/numpy/linalg/lapack_lite.cpython-39-i386-linux-gnu.so
building 'numpy.linalg._umath_linalg' extension
compiling C sources
C compiler: i686-pld-linux-gcc -Wno-unused-result -Wsign-compare -DNDEBUG -O2 -fwrapv -pipe -Wformat -Werror=format-security -gdwarf-4 -fno-debug-types-section -fvar-tracking-assignments -g2 -Wp,-D_FORTIFY_SOURCE=2 -fstack-protector-strong --param=ssp-buffer-size=4 -Werror=trampolines -fomit-frame-pointer -march=i686 -fasynchronous-unwind-tables -mtune=pentium4 -gdwarf-4 -fno-debug-types-section -fvar-tracking-assignments -g2 -O2 -fwrapv -pipe -Wformat -Werror=format-security -gdwarf-4 -fno-debug-types-section -fvar-tracking-assignments -g2 -Wp,-D_FORTIFY_SOURCE=2 -fstack-protector-strong --param=ssp-buffer-size=4 -Werror=trampolines -fomit-frame-pointer -march=i686 -fasynchronous-unwind-tables -mtune=pentium4 -gdwarf-4 -fno-debug-types-section -fvar-tracking-assignments -g2 -O2 -fwrapv -pipe -Wformat -Werror=format-security -gdwarf-4 -fno-debug-types-section -fvar-tracking-assignments -g2 -Wp,-D_FORTIFY_SOURCE=2 -fstack-protector-strong --param=ssp-buffer-size=4 -Werror=trampolines -fomit-frame-pointer -march=i686 -fasynchronous-unwind-tables -mtune=pentium4 -gdwarf-4 -fno-debug-types-section -fvar-tracking-assignments -g2 -fPIC -fPIC

creating build-3/temp.linux-i686-3.9/build-3/src.linux-i686-3.9/numpy/linalg
compile options: '-DNO_ATLAS_INFO=1 -DHAVE_CBLAS -I/usr/local/include -I/usr/include -Inumpy/core/include -Ibuild-3/src.linux-i686-3.9/numpy/core/include/numpy -Inumpy/core/src/common -Inumpy/core/src -Inumpy/core -Inumpy/core/src/npymath -Inumpy/core/src/multiarray -Inumpy/core/src/umath -Inumpy/core/src/npysort -I/usr/include/python3.9 -Ibuild-3/src.linux-i686-3.9/numpy/core/src/common -Ibuild-3/src.linux-i686-3.9/numpy/core/src/npymath -c'
extra options: '-std=c99'
i686-pld-linux-gcc: build-3/src.linux-i686-3.9/numpy/linalg/umath_linalg.c
i686-pld-linux-gcc -shared -Wl,--as-needed -Wl,--no-copy-dt-needed-entries -Wl,-z,relro -Wl,-z,combreloc -Wl,--as-needed -Wl,--no-copy-dt-needed-entries -Wl,-z,relro -Wl,-z,combreloc -shared -O2 -fwrapv -pipe -Wformat -Werror=format-security -gdwarf-4 -fno-debug-types-section -fvar-tracking-assignments -g2 -Wp,-D_FORTIFY_SOURCE=2 -fstack-protector-strong --param=ssp-buffer-size=4 -Werror=trampolines -fomit-frame-pointer -march=i686 -fasynchronous-unwind-tables -mtune=pentium4 -gdwarf-4 -fno-debug-types-section -fvar-tracking-assignments -g2 -fPIC build-3/temp.linux-i686-3.9/build-3/src.linux-i686-3.9/numpy/linalg/umath_linalg.o build-3/temp.linux-i686-3.9/numpy/linalg/lapack_lite/python_xerbla.o -L/usr/lib -L/usr/lib -Lbuild-3/temp.linux-i686-3.9 -lnpymath -llapack -llapack -lcblas -lblas -lblas -o build-3/lib.linux-i686-3.9/numpy/linalg/_umath_linalg.cpython-39-i386-linux-gnu.so
building 'numpy.random._mt19937' extension
compiling C sources
C compiler: i686-pld-linux-gcc -Wno-unused-result -Wsign-compare -DNDEBUG -O2 -fwrapv -pipe -Wformat -Werror=format-security -gdwarf-4 -fno-debug-types-section -fvar-tracking-assignments -g2 -Wp,-D_FORTIFY_SOURCE=2 -fstack-protector-strong --param=ssp-buffer-size=4 -Werror=trampolines -fomit-frame-pointer -march=i686 -fasynchronous-unwind-tables -mtune=pentium4 -gdwarf-4 -fno-debug-types-section -fvar-tracking-assignments -g2 -O2 -fwrapv -pipe -Wformat -Werror=format-security -gdwarf-4 -fno-debug-types-section -fvar-tracking-assignments -g2 -Wp,-D_FORTIFY_SOURCE=2 -fstack-protector-strong --param=ssp-buffer-size=4 -Werror=trampolines -fomit-frame-pointer -march=i686 -fasynchronous-unwind-tables -mtune=pentium4 -gdwarf-4 -fno-debug-types-section -fvar-tracking-assignments -g2 -O2 -fwrapv -pipe -Wformat -Werror=format-security -gdwarf-4 -fno-debug-types-section -fvar-tracking-assignments -g2 -Wp,-D_FORTIFY_SOURCE=2 -fstack-protector-strong --param=ssp-buffer-size=4 -Werror=trampolines -fomit-frame-pointer -march=i686 -fasynchronous-unwind-tables -mtune=pentium4 -gdwarf-4 -fno-debug-types-section -fvar-tracking-assignments -g2 -fPIC -fPIC

creating build-3/temp.linux-i686-3.9/numpy/random/src/mt19937
compile options: '-D_FILE_OFFSET_BITS=64 -D_LARGEFILE_SOURCE=1 -D_LARGEFILE64_SOURCE=1 -DNPY_NO_DEPRECATED_API=0 -Inumpy/random -Inumpy/random/src -Inumpy/random/src/mt19937 -Inumpy/core/include -Ibuild-3/src.linux-i686-3.9/numpy/core/include/numpy -Inumpy/core/src/common -Inumpy/core/src -Inumpy/core -Inumpy/core/src/npymath -Inumpy/core/src/multiarray -Inumpy/core/src/umath -Inumpy/core/src/npysort -I/usr/include/python3.9 -Ibuild-3/src.linux-i686-3.9/numpy/core/src/common -Ibuild-3/src.linux-i686-3.9/numpy/core/src/npymath -c'
extra options: '-U__GNUC_GNU_INLINE__ -std=c99'
i686-pld-linux-gcc: numpy/random/src/mt19937/mt19937.c
i686-pld-linux-gcc: numpy/random/_mt19937.c
i686-pld-linux-gcc: numpy/random/src/mt19937/mt19937-jump.c
i686-pld-linux-gcc -shared -Wl,--as-needed -Wl,--no-copy-dt-needed-entries -Wl,-z,relro -Wl,-z,combreloc -Wl,--as-needed -Wl,--no-copy-dt-needed-entries -Wl,-z,relro -Wl,-z,combreloc -shared -O2 -fwrapv -pipe -Wformat -Werror=format-security -gdwarf-4 -fno-debug-types-section -fvar-tracking-assignments -g2 -Wp,-D_FORTIFY_SOURCE=2 -fstack-protector-strong --param=ssp-buffer-size=4 -Werror=trampolines -fomit-frame-pointer -march=i686 -fasynchronous-unwind-tables -mtune=pentium4 -gdwarf-4 -fno-debug-types-section -fvar-tracking-assignments -g2 -fPIC build-3/temp.linux-i686-3.9/numpy/random/_mt19937.o build-3/temp.linux-i686-3.9/numpy/random/src/mt19937/mt19937.o build-3/temp.linux-i686-3.9/numpy/random/src/mt19937/mt19937-jump.o -L/usr/lib -Lbuild-3/temp.linux-i686-3.9 -lnpyrandom -lm -o build-3/lib.linux-i686-3.9/numpy/random/_mt19937.cpython-39-i386-linux-gnu.so
building 'numpy.random._philox' extension
compiling C sources
C compiler: i686-pld-linux-gcc -Wno-unused-result -Wsign-compare -DNDEBUG -O2 -fwrapv -pipe -Wformat -Werror=format-security -gdwarf-4 -fno-debug-types-section -fvar-tracking-assignments -g2 -Wp,-D_FORTIFY_SOURCE=2 -fstack-protector-strong --param=ssp-buffer-size=4 -Werror=trampolines -fomit-frame-pointer -march=i686 -fasynchronous-unwind-tables -mtune=pentium4 -gdwarf-4 -fno-debug-types-section -fvar-tracking-assignments -g2 -O2 -fwrapv -pipe -Wformat -Werror=format-security -gdwarf-4 -fno-debug-types-section -fvar-tracking-assignments -g2 -Wp,-D_FORTIFY_SOURCE=2 -fstack-protector-strong --param=ssp-buffer-size=4 -Werror=trampolines -fomit-frame-pointer -march=i686 -fasynchronous-unwind-tables -mtune=pentium4 -gdwarf-4 -fno-debug-types-section -fvar-tracking-assignments -g2 -O2 -fwrapv -pipe -Wformat -Werror=format-security -gdwarf-4 -fno-debug-types-section -fvar-tracking-assignments -g2 -Wp,-D_FORTIFY_SOURCE=2 -fstack-protector-strong --param=ssp-buffer-size=4 -Werror=trampolines -fomit-frame-pointer -march=i686 -fasynchronous-unwind-tables -mtune=pentium4 -gdwarf-4 -fno-debug-types-section -fvar-tracking-assignments -g2 -fPIC -fPIC

creating build-3/temp.linux-i686-3.9/numpy/random/src/philox
compile options: '-D_FILE_OFFSET_BITS=64 -D_LARGEFILE_SOURCE=1 -D_LARGEFILE64_SOURCE=1 -DNPY_NO_DEPRECATED_API=0 -Inumpy/random -Inumpy/random/src -Inumpy/random/src/philox -Inumpy/core/include -Ibuild-3/src.linux-i686-3.9/numpy/core/include/numpy -Inumpy/core/src/common -Inumpy/core/src -Inumpy/core -Inumpy/core/src/npymath -Inumpy/core/src/multiarray -Inumpy/core/src/umath -Inumpy/core/src/npysort -I/usr/include/python3.9 -Ibuild-3/src.linux-i686-3.9/numpy/core/src/common -Ibuild-3/src.linux-i686-3.9/numpy/core/src/npymath -c'
extra options: '-U__GNUC_GNU_INLINE__ -std=c99'
i686-pld-linux-gcc: numpy/random/_philox.c
i686-pld-linux-gcc: numpy/random/src/philox/philox.c
i686-pld-linux-gcc -shared -Wl,--as-needed -Wl,--no-copy-dt-needed-entries -Wl,-z,relro -Wl,-z,combreloc -Wl,--as-needed -Wl,--no-copy-dt-needed-entries -Wl,-z,relro -Wl,-z,combreloc -shared -O2 -fwrapv -pipe -Wformat -Werror=format-security -gdwarf-4 -fno-debug-types-section -fvar-tracking-assignments -g2 -Wp,-D_FORTIFY_SOURCE=2 -fstack-protector-strong --param=ssp-buffer-size=4 -Werror=trampolines -fomit-frame-pointer -march=i686 -fasynchronous-unwind-tables -mtune=pentium4 -gdwarf-4 -fno-debug-types-section -fvar-tracking-assignments -g2 -fPIC build-3/temp.linux-i686-3.9/numpy/random/_philox.o build-3/temp.linux-i686-3.9/numpy/random/src/philox/philox.o -L/usr/lib -Lbuild-3/temp.linux-i686-3.9 -lnpyrandom -lm -o build-3/lib.linux-i686-3.9/numpy/random/_philox.cpython-39-i386-linux-gnu.so
building 'numpy.random._pcg64' extension
compiling C sources
C compiler: i686-pld-linux-gcc -Wno-unused-result -Wsign-compare -DNDEBUG -O2 -fwrapv -pipe -Wformat -Werror=format-security -gdwarf-4 -fno-debug-types-section -fvar-tracking-assignments -g2 -Wp,-D_FORTIFY_SOURCE=2 -fstack-protector-strong --param=ssp-buffer-size=4 -Werror=trampolines -fomit-frame-pointer -march=i686 -fasynchronous-unwind-tables -mtune=pentium4 -gdwarf-4 -fno-debug-types-section -fvar-tracking-assignments -g2 -O2 -fwrapv -pipe -Wformat -Werror=format-security -gdwarf-4 -fno-debug-types-section -fvar-tracking-assignments -g2 -Wp,-D_FORTIFY_SOURCE=2 -fstack-protector-strong --param=ssp-buffer-size=4 -Werror=trampolines -fomit-frame-pointer -march=i686 -fasynchronous-unwind-tables -mtune=pentium4 -gdwarf-4 -fno-debug-types-section -fvar-tracking-assignments -g2 -O2 -fwrapv -pipe -Wformat -Werror=format-security -gdwarf-4 -fno-debug-types-section -fvar-tracking-assignments -g2 -Wp,-D_FORTIFY_SOURCE=2 -fstack-protector-strong --param=ssp-buffer-size=4 -Werror=trampolines -fomit-frame-pointer -march=i686 -fasynchronous-unwind-tables -mtune=pentium4 -gdwarf-4 -fno-debug-types-section -fvar-tracking-assignments -g2 -fPIC -fPIC

creating build-3/temp.linux-i686-3.9/numpy/random/src/pcg64
compile options: '-D_FILE_OFFSET_BITS=64 -D_LARGEFILE_SOURCE=1 -D_LARGEFILE64_SOURCE=1 -DNPY_NO_DEPRECATED_API=0 -Inumpy/random -Inumpy/random/src -Inumpy/random/src/pcg64 -Inumpy/core/include -Ibuild-3/src.linux-i686-3.9/numpy/core/include/numpy -Inumpy/core/src/common -Inumpy/core/src -Inumpy/core -Inumpy/core/src/npymath -Inumpy/core/src/multiarray -Inumpy/core/src/umath -Inumpy/core/src/npysort -I/usr/include/python3.9 -Ibuild-3/src.linux-i686-3.9/numpy/core/src/common -Ibuild-3/src.linux-i686-3.9/numpy/core/src/npymath -c'
extra options: '-U__GNUC_GNU_INLINE__ -std=c99'
i686-pld-linux-gcc: numpy/random/_pcg64.c
i686-pld-linux-gcc: numpy/random/src/pcg64/pcg64.c
i686-pld-linux-gcc -shared -Wl,--as-needed -Wl,--no-copy-dt-needed-entries -Wl,-z,relro -Wl,-z,combreloc -Wl,--as-needed -Wl,--no-copy-dt-needed-entries -Wl,-z,relro -Wl,-z,combreloc -shared -O2 -fwrapv -pipe -Wformat -Werror=format-security -gdwarf-4 -fno-debug-types-section -fvar-tracking-assignments -g2 -Wp,-D_FORTIFY_SOURCE=2 -fstack-protector-strong --param=ssp-buffer-size=4 -Werror=trampolines -fomit-frame-pointer -march=i686 -fasynchronous-unwind-tables -mtune=pentium4 -gdwarf-4 -fno-debug-types-section -fvar-tracking-assignments -g2 -fPIC build-3/temp.linux-i686-3.9/numpy/random/_pcg64.o build-3/temp.linux-i686-3.9/numpy/random/src/pcg64/pcg64.o -L/usr/lib -Lbuild-3/temp.linux-i686-3.9 -lnpyrandom -lm -o build-3/lib.linux-i686-3.9/numpy/random/_pcg64.cpython-39-i386-linux-gnu.so
building 'numpy.random._sfc64' extension
compiling C sources
C compiler: i686-pld-linux-gcc -Wno-unused-result -Wsign-compare -DNDEBUG -O2 -fwrapv -pipe -Wformat -Werror=format-security -gdwarf-4 -fno-debug-types-section -fvar-tracking-assignments -g2 -Wp,-D_FORTIFY_SOURCE=2 -fstack-protector-strong --param=ssp-buffer-size=4 -Werror=trampolines -fomit-frame-pointer -march=i686 -fasynchronous-unwind-tables -mtune=pentium4 -gdwarf-4 -fno-debug-types-section -fvar-tracking-assignments -g2 -O2 -fwrapv -pipe -Wformat -Werror=format-security -gdwarf-4 -fno-debug-types-section -fvar-tracking-assignments -g2 -Wp,-D_FORTIFY_SOURCE=2 -fstack-protector-strong --param=ssp-buffer-size=4 -Werror=trampolines -fomit-frame-pointer -march=i686 -fasynchronous-unwind-tables -mtune=pentium4 -gdwarf-4 -fno-debug-types-section -fvar-tracking-assignments -g2 -O2 -fwrapv -pipe -Wformat -Werror=format-security -gdwarf-4 -fno-debug-types-section -fvar-tracking-assignments -g2 -Wp,-D_FORTIFY_SOURCE=2 -fstack-protector-strong --param=ssp-buffer-size=4 -Werror=trampolines -fomit-frame-pointer -march=i686 -fasynchronous-unwind-tables -mtune=pentium4 -gdwarf-4 -fno-debug-types-section -fvar-tracking-assignments -g2 -fPIC -fPIC

creating build-3/temp.linux-i686-3.9/numpy/random/src/sfc64
compile options: '-D_FILE_OFFSET_BITS=64 -D_LARGEFILE_SOURCE=1 -D_LARGEFILE64_SOURCE=1 -DNPY_NO_DEPRECATED_API=0 -Inumpy/random -Inumpy/random/src -Inumpy/random/src/sfc64 -Inumpy/core/include -Ibuild-3/src.linux-i686-3.9/numpy/core/include/numpy -Inumpy/core/src/common -Inumpy/core/src -Inumpy/core -Inumpy/core/src/npymath -Inumpy/core/src/multiarray -Inumpy/core/src/umath -Inumpy/core/src/npysort -I/usr/include/python3.9 -Ibuild-3/src.linux-i686-3.9/numpy/core/src/common -Ibuild-3/src.linux-i686-3.9/numpy/core/src/npymath -c'
extra options: '-U__GNUC_GNU_INLINE__ -std=c99'
i686-pld-linux-gcc: numpy/random/_sfc64.c
i686-pld-linux-gcc: numpy/random/src/sfc64/sfc64.c
i686-pld-linux-gcc -shared -Wl,--as-needed -Wl,--no-copy-dt-needed-entries -Wl,-z,relro -Wl,-z,combreloc -Wl,--as-needed -Wl,--no-copy-dt-needed-entries -Wl,-z,relro -Wl,-z,combreloc -shared -O2 -fwrapv -pipe -Wformat -Werror=format-security -gdwarf-4 -fno-debug-types-section -fvar-tracking-assignments -g2 -Wp,-D_FORTIFY_SOURCE=2 -fstack-protector-strong --param=ssp-buffer-size=4 -Werror=trampolines -fomit-frame-pointer -march=i686 -fasynchronous-unwind-tables -mtune=pentium4 -gdwarf-4 -fno-debug-types-section -fvar-tracking-assignments -g2 -fPIC build-3/temp.linux-i686-3.9/numpy/random/_sfc64.o build-3/temp.linux-i686-3.9/numpy/random/src/sfc64/sfc64.o -L/usr/lib -Lbuild-3/temp.linux-i686-3.9 -lnpyrandom -lm -o build-3/lib.linux-i686-3.9/numpy/random/_sfc64.cpython-39-i386-linux-gnu.so
building 'numpy.random._common' extension
compiling C sources
C compiler: i686-pld-linux-gcc -Wno-unused-result -Wsign-compare -DNDEBUG -O2 -fwrapv -pipe -Wformat -Werror=format-security -gdwarf-4 -fno-debug-types-section -fvar-tracking-assignments -g2 -Wp,-D_FORTIFY_SOURCE=2 -fstack-protector-strong --param=ssp-buffer-size=4 -Werror=trampolines -fomit-frame-pointer -march=i686 -fasynchronous-unwind-tables -mtune=pentium4 -gdwarf-4 -fno-debug-types-section -fvar-tracking-assignments -g2 -O2 -fwrapv -pipe -Wformat -Werror=format-security -gdwarf-4 -fno-debug-types-section -fvar-tracking-assignments -g2 -Wp,-D_FORTIFY_SOURCE=2 -fstack-protector-strong --param=ssp-buffer-size=4 -Werror=trampolines -fomit-frame-pointer -march=i686 -fasynchronous-unwind-tables -mtune=pentium4 -gdwarf-4 -fno-debug-types-section -fvar-tracking-assignments -g2 -O2 -fwrapv -pipe -Wformat -Werror=format-security -gdwarf-4 -fno-debug-types-section -fvar-tracking-assignments -g2 -Wp,-D_FORTIFY_SOURCE=2 -fstack-protector-strong --param=ssp-buffer-size=4 -Werror=trampolines -fomit-frame-pointer -march=i686 -fasynchronous-unwind-tables -mtune=pentium4 -gdwarf-4 -fno-debug-types-section -fvar-tracking-assignments -g2 -fPIC -fPIC

compile options: '-D_FILE_OFFSET_BITS=64 -D_LARGEFILE_SOURCE=1 -D_LARGEFILE64_SOURCE=1 -DNPY_NO_DEPRECATED_API=0 -Inumpy/random -Inumpy/random/src -Inumpy/core/include -Ibuild-3/src.linux-i686-3.9/numpy/core/include/numpy -Inumpy/core/src/common -Inumpy/core/src -Inumpy/core -Inumpy/core/src/npymath -Inumpy/core/src/multiarray -Inumpy/core/src/umath -Inumpy/core/src/npysort -I/usr/include/python3.9 -Ibuild-3/src.linux-i686-3.9/numpy/core/src/common -Ibuild-3/src.linux-i686-3.9/numpy/core/src/npymath -c'
extra options: '-U__GNUC_GNU_INLINE__ -std=c99'
i686-pld-linux-gcc: numpy/random/_common.c
i686-pld-linux-gcc -shared -Wl,--as-needed -Wl,--no-copy-dt-needed-entries -Wl,-z,relro -Wl,-z,combreloc -Wl,--as-needed -Wl,--no-copy-dt-needed-entries -Wl,-z,relro -Wl,-z,combreloc -shared -O2 -fwrapv -pipe -Wformat -Werror=format-security -gdwarf-4 -fno-debug-types-section -fvar-tracking-assignments -g2 -Wp,-D_FORTIFY_SOURCE=2 -fstack-protector-strong --param=ssp-buffer-size=4 -Werror=trampolines -fomit-frame-pointer -march=i686 -fasynchronous-unwind-tables -mtune=pentium4 -gdwarf-4 -fno-debug-types-section -fvar-tracking-assignments -g2 -fPIC build-3/temp.linux-i686-3.9/numpy/random/_common.o -L/usr/lib -Lbuild-3/temp.linux-i686-3.9 -lnpyrandom -lm -o build-3/lib.linux-i686-3.9/numpy/random/_common.cpython-39-i386-linux-gnu.so
building 'numpy.random.bit_generator' extension
compiling C sources
C compiler: i686-pld-linux-gcc -Wno-unused-result -Wsign-compare -DNDEBUG -O2 -fwrapv -pipe -Wformat -Werror=format-security -gdwarf-4 -fno-debug-types-section -fvar-tracking-assignments -g2 -Wp,-D_FORTIFY_SOURCE=2 -fstack-protector-strong --param=ssp-buffer-size=4 -Werror=trampolines -fomit-frame-pointer -march=i686 -fasynchronous-unwind-tables -mtune=pentium4 -gdwarf-4 -fno-debug-types-section -fvar-tracking-assignments -g2 -O2 -fwrapv -pipe -Wformat -Werror=format-security -gdwarf-4 -fno-debug-types-section -fvar-tracking-assignments -g2 -Wp,-D_FORTIFY_SOURCE=2 -fstack-protector-strong --param=ssp-buffer-size=4 -Werror=trampolines -fomit-frame-pointer -march=i686 -fasynchronous-unwind-tables -mtune=pentium4 -gdwarf-4 -fno-debug-types-section -fvar-tracking-assignments -g2 -O2 -fwrapv -pipe -Wformat -Werror=format-security -gdwarf-4 -fno-debug-types-section -fvar-tracking-assignments -g2 -Wp,-D_FORTIFY_SOURCE=2 -fstack-protector-strong --param=ssp-buffer-size=4 -Werror=trampolines -fomit-frame-pointer -march=i686 -fasynchronous-unwind-tables -mtune=pentium4 -gdwarf-4 -fno-debug-types-section -fvar-tracking-assignments -g2 -fPIC -fPIC

compile options: '-D_FILE_OFFSET_BITS=64 -D_LARGEFILE_SOURCE=1 -D_LARGEFILE64_SOURCE=1 -DNPY_NO_DEPRECATED_API=0 -Inumpy/random -Inumpy/random/src -Inumpy/core/include -Ibuild-3/src.linux-i686-3.9/numpy/core/include/numpy -Inumpy/core/src/common -Inumpy/core/src -Inumpy/core -Inumpy/core/src/npymath -Inumpy/core/src/multiarray -Inumpy/core/src/umath -Inumpy/core/src/npysort -I/usr/include/python3.9 -Ibuild-3/src.linux-i686-3.9/numpy/core/src/common -Ibuild-3/src.linux-i686-3.9/numpy/core/src/npymath -c'
extra options: '-U__GNUC_GNU_INLINE__ -std=c99'
i686-pld-linux-gcc: numpy/random/bit_generator.c
numpy/random/bit_generator.c: In function '__pyx_f_5numpy_6random_13bit_generator_12SeedSequence_get_assembled_entropy':
numpy/random/bit_generator.c:5690:27: warning: comparison of integer expressions of different signedness: 'Py_ssize_t' {aka 'int'} and 'uint32_t' {aka 'unsigned int'} [-Wsign-compare]
 5690 |   __pyx_t_6 = ((__pyx_t_5 < __pyx_v_self->pool_size) != 0);
      |                           ^
numpy/random/bit_generator.c: In function '__pyx_pf_5numpy_6random_13bit_generator_12SeedSequence_6spawn':
numpy/random/bit_generator.c:6468:64: warning: comparison of integer expressions of different signedness: 'uint32_t' {aka 'unsigned int'} and 'long int' [-Wsign-compare]
 6468 |   for (__pyx_t_5 = __pyx_v_self->n_children_spawned; __pyx_t_5 < __pyx_t_4; __pyx_t_5+=1) {
      |                                                                ^
i686-pld-linux-gcc -shared -Wl,--as-needed -Wl,--no-copy-dt-needed-entries -Wl,-z,relro -Wl,-z,combreloc -Wl,--as-needed -Wl,--no-copy-dt-needed-entries -Wl,-z,relro -Wl,-z,combreloc -shared -O2 -fwrapv -pipe -Wformat -Werror=format-security -gdwarf-4 -fno-debug-types-section -fvar-tracking-assignments -g2 -Wp,-D_FORTIFY_SOURCE=2 -fstack-protector-strong --param=ssp-buffer-size=4 -Werror=trampolines -fomit-frame-pointer -march=i686 -fasynchronous-unwind-tables -mtune=pentium4 -gdwarf-4 -fno-debug-types-section -fvar-tracking-assignments -g2 -fPIC build-3/temp.linux-i686-3.9/numpy/random/bit_generator.o -L/usr/lib -Lbuild-3/temp.linux-i686-3.9 -lnpyrandom -lm -o build-3/lib.linux-i686-3.9/numpy/random/bit_generator.cpython-39-i386-linux-gnu.so
building 'numpy.random._generator' extension
compiling C sources
C compiler: i686-pld-linux-gcc -Wno-unused-result -Wsign-compare -DNDEBUG -O2 -fwrapv -pipe -Wformat -Werror=format-security -gdwarf-4 -fno-debug-types-section -fvar-tracking-assignments -g2 -Wp,-D_FORTIFY_SOURCE=2 -fstack-protector-strong --param=ssp-buffer-size=4 -Werror=trampolines -fomit-frame-pointer -march=i686 -fasynchronous-unwind-tables -mtune=pentium4 -gdwarf-4 -fno-debug-types-section -fvar-tracking-assignments -g2 -O2 -fwrapv -pipe -Wformat -Werror=format-security -gdwarf-4 -fno-debug-types-section -fvar-tracking-assignments -g2 -Wp,-D_FORTIFY_SOURCE=2 -fstack-protector-strong --param=ssp-buffer-size=4 -Werror=trampolines -fomit-frame-pointer -march=i686 -fasynchronous-unwind-tables -mtune=pentium4 -gdwarf-4 -fno-debug-types-section -fvar-tracking-assignments -g2 -O2 -fwrapv -pipe -Wformat -Werror=format-security -gdwarf-4 -fno-debug-types-section -fvar-tracking-assignments -g2 -Wp,-D_FORTIFY_SOURCE=2 -fstack-protector-strong --param=ssp-buffer-size=4 -Werror=trampolines -fomit-frame-pointer -march=i686 -fasynchronous-unwind-tables -mtune=pentium4 -gdwarf-4 -fno-debug-types-section -fvar-tracking-assignments -g2 -fPIC -fPIC

compile options: '-D_FILE_OFFSET_BITS=64 -D_LARGEFILE_SOURCE=1 -D_LARGEFILE64_SOURCE=1 -DNPY_NO_DEPRECATED_API=0 -Inumpy/random -Inumpy/random/src -Inumpy/core/include -Ibuild-3/src.linux-i686-3.9/numpy/core/include/numpy -Inumpy/core/src/common -Inumpy/core/src -Inumpy/core -Inumpy/core/src/npymath -Inumpy/core/src/multiarray -Inumpy/core/src/umath -Inumpy/core/src/npysort -I/usr/include/python3.9 -Ibuild-3/src.linux-i686-3.9/numpy/core/src/common -Ibuild-3/src.linux-i686-3.9/numpy/core/src/npymath -c'
extra options: '-U__GNUC_GNU_INLINE__ -std=c99'
i686-pld-linux-gcc: numpy/random/_generator.c
i686-pld-linux-gcc -shared -Wl,--as-needed -Wl,--no-copy-dt-needed-entries -Wl,-z,relro -Wl,-z,combreloc -Wl,--as-needed -Wl,--no-copy-dt-needed-entries -Wl,-z,relro -Wl,-z,combreloc -shared -O2 -fwrapv -pipe -Wformat -Werror=format-security -gdwarf-4 -fno-debug-types-section -fvar-tracking-assignments -g2 -Wp,-D_FORTIFY_SOURCE=2 -fstack-protector-strong --param=ssp-buffer-size=4 -Werror=trampolines -fomit-frame-pointer -march=i686 -fasynchronous-unwind-tables -mtune=pentium4 -gdwarf-4 -fno-debug-types-section -fvar-tracking-assignments -g2 -fPIC build-3/temp.linux-i686-3.9/numpy/random/_generator.o -L/usr/lib -Lbuild-3/temp.linux-i686-3.9 -lnpyrandom -lm -o build-3/lib.linux-i686-3.9/numpy/random/_generator.cpython-39-i386-linux-gnu.so
building 'numpy.random._bounded_integers' extension
compiling C sources
C compiler: i686-pld-linux-gcc -Wno-unused-result -Wsign-compare -DNDEBUG -O2 -fwrapv -pipe -Wformat -Werror=format-security -gdwarf-4 -fno-debug-types-section -fvar-tracking-assignments -g2 -Wp,-D_FORTIFY_SOURCE=2 -fstack-protector-strong --param=ssp-buffer-size=4 -Werror=trampolines -fomit-frame-pointer -march=i686 -fasynchronous-unwind-tables -mtune=pentium4 -gdwarf-4 -fno-debug-types-section -fvar-tracking-assignments -g2 -O2 -fwrapv -pipe -Wformat -Werror=format-security -gdwarf-4 -fno-debug-types-section -fvar-tracking-assignments -g2 -Wp,-D_FORTIFY_SOURCE=2 -fstack-protector-strong --param=ssp-buffer-size=4 -Werror=trampolines -fomit-frame-pointer -march=i686 -fasynchronous-unwind-tables -mtune=pentium4 -gdwarf-4 -fno-debug-types-section -fvar-tracking-assignments -g2 -O2 -fwrapv -pipe -Wformat -Werror=format-security -gdwarf-4 -fno-debug-types-section -fvar-tracking-assignments -g2 -Wp,-D_FORTIFY_SOURCE=2 -fstack-protector-strong --param=ssp-buffer-size=4 -Werror=trampolines -fomit-frame-pointer -march=i686 -fasynchronous-unwind-tables -mtune=pentium4 -gdwarf-4 -fno-debug-types-section -fvar-tracking-assignments -g2 -fPIC -fPIC

compile options: '-D_FILE_OFFSET_BITS=64 -D_LARGEFILE_SOURCE=1 -D_LARGEFILE64_SOURCE=1 -DNPY_NO_DEPRECATED_API=0 -Inumpy/random -Inumpy/random/src -Inumpy/core/include -Ibuild-3/src.linux-i686-3.9/numpy/core/include/numpy -Inumpy/core/src/common -Inumpy/core/src -Inumpy/core -Inumpy/core/src/npymath -Inumpy/core/src/multiarray -Inumpy/core/src/umath -Inumpy/core/src/npysort -I/usr/include/python3.9 -Ibuild-3/src.linux-i686-3.9/numpy/core/src/common -Ibuild-3/src.linux-i686-3.9/numpy/core/src/npymath -c'
extra options: '-U__GNUC_GNU_INLINE__ -std=c99'
i686-pld-linux-gcc: numpy/random/_bounded_integers.c
i686-pld-linux-gcc -shared -Wl,--as-needed -Wl,--no-copy-dt-needed-entries -Wl,-z,relro -Wl,-z,combreloc -Wl,--as-needed -Wl,--no-copy-dt-needed-entries -Wl,-z,relro -Wl,-z,combreloc -shared -O2 -fwrapv -pipe -Wformat -Werror=format-security -gdwarf-4 -fno-debug-types-section -fvar-tracking-assignments -g2 -Wp,-D_FORTIFY_SOURCE=2 -fstack-protector-strong --param=ssp-buffer-size=4 -Werror=trampolines -fomit-frame-pointer -march=i686 -fasynchronous-unwind-tables -mtune=pentium4 -gdwarf-4 -fno-debug-types-section -fvar-tracking-assignments -g2 -fPIC build-3/temp.linux-i686-3.9/numpy/random/_bounded_integers.o -L/usr/lib -Lbuild-3/temp.linux-i686-3.9 -lnpyrandom -lm -o build-3/lib.linux-i686-3.9/numpy/random/_bounded_integers.cpython-39-i386-linux-gnu.so
building 'numpy.random.mtrand' extension
compiling C sources
C compiler: i686-pld-linux-gcc -Wno-unused-result -Wsign-compare -DNDEBUG -O2 -fwrapv -pipe -Wformat -Werror=format-security -gdwarf-4 -fno-debug-types-section -fvar-tracking-assignments -g2 -Wp,-D_FORTIFY_SOURCE=2 -fstack-protector-strong --param=ssp-buffer-size=4 -Werror=trampolines -fomit-frame-pointer -march=i686 -fasynchronous-unwind-tables -mtune=pentium4 -gdwarf-4 -fno-debug-types-section -fvar-tracking-assignments -g2 -O2 -fwrapv -pipe -Wformat -Werror=format-security -gdwarf-4 -fno-debug-types-section -fvar-tracking-assignments -g2 -Wp,-D_FORTIFY_SOURCE=2 -fstack-protector-strong --param=ssp-buffer-size=4 -Werror=trampolines -fomit-frame-pointer -march=i686 -fasynchronous-unwind-tables -mtune=pentium4 -gdwarf-4 -fno-debug-types-section -fvar-tracking-assignments -g2 -O2 -fwrapv -pipe -Wformat -Werror=format-security -gdwarf-4 -fno-debug-types-section -fvar-tracking-assignments -g2 -Wp,-D_FORTIFY_SOURCE=2 -fstack-protector-strong --param=ssp-buffer-size=4 -Werror=trampolines -fomit-frame-pointer -march=i686 -fasynchronous-unwind-tables -mtune=pentium4 -gdwarf-4 -fno-debug-types-section -fvar-tracking-assignments -g2 -fPIC -fPIC

creating build-3/temp.linux-i686-3.9/numpy/random/src/legacy
compile options: '-D_FILE_OFFSET_BITS=64 -D_LARGEFILE_SOURCE=1 -D_LARGEFILE64_SOURCE=1 -DNPY_NO_DEPRECATED_API=0 -DNP_RANDOM_LEGACY=1 -Inumpy/random -Inumpy/random/src -Inumpy/random/src/legacy -Inumpy/core/include -Ibuild-3/src.linux-i686-3.9/numpy/core/include/numpy -Inumpy/core/src/common -Inumpy/core/src -Inumpy/core -Inumpy/core/src/npymath -Inumpy/core/src/multiarray -Inumpy/core/src/umath -Inumpy/core/src/npysort -I/usr/include/python3.9 -Ibuild-3/src.linux-i686-3.9/numpy/core/src/common -Ibuild-3/src.linux-i686-3.9/numpy/core/src/npymath -c'
extra options: '-U__GNUC_GNU_INLINE__ -std=c99'
i686-pld-linux-gcc: numpy/random/src/legacy/legacy-distributions.c
i686-pld-linux-gcc: numpy/random/src/distributions/distributions.c
i686-pld-linux-gcc: numpy/random/mtrand.c
i686-pld-linux-gcc -shared -Wl,--as-needed -Wl,--no-copy-dt-needed-entries -Wl,-z,relro -Wl,-z,combreloc -Wl,--as-needed -Wl,--no-copy-dt-needed-entries -Wl,-z,relro -Wl,-z,combreloc -shared -O2 -fwrapv -pipe -Wformat -Werror=format-security -gdwarf-4 -fno-debug-types-section -fvar-tracking-assignments -g2 -Wp,-D_FORTIFY_SOURCE=2 -fstack-protector-strong --param=ssp-buffer-size=4 -Werror=trampolines -fomit-frame-pointer -march=i686 -fasynchronous-unwind-tables -mtune=pentium4 -gdwarf-4 -fno-debug-types-section -fvar-tracking-assignments -g2 -fPIC build-3/temp.linux-i686-3.9/numpy/random/mtrand.o build-3/temp.linux-i686-3.9/numpy/random/src/legacy/legacy-distributions.o build-3/temp.linux-i686-3.9/numpy/random/src/distributions/distributions.o -L/usr/lib -Lbuild-3/temp.linux-i686-3.9 -lm -o build-3/lib.linux-i686-3.9/numpy/random/mtrand.cpython-39-i386-linux-gnu.so
+ /usr/bin/python3 runtests.py '--mode=full'
Building, see build.log...
    ... build in progress
    ... build in progress
Build OK
NumPy version 1.19.4
NumPy relaxed strides checking option: True
.............................................................x.......... [  0%]
......................................................ss................ [  1%]
........................................................................ [  1%]
........................................................................ [  2%]
..................................................x..........x..x....... [  3%]
...x.................................................................... [  3%]
........................................................................ [  4%]
.................................ssss................................x.. [  5%]
........................................................................ [  5%]
........................................................................ [  6%]
........................................................................ [  7%]
........................................................................ [  7%]
........................................................................ [  8%]
........................................................................ [  9%]
........................................................................ [  9%]
........................................................................ [ 10%]
........................................................................ [ 11%]
........................................................................ [ 11%]
........................................................................ [ 12%]
........................................................................ [ 12%]
........................................................................ [ 13%]
........................sss............................................. [ 14%]
.................................................................s...... [ 14%]
.............................xx......................................... [ 15%]
........................................................................ [ 16%]
.............s.......................................................... [ 16%]
........................................................................ [ 17%]
........................................................................ [ 18%]
........................................................................ [ 18%]
........................................................................ [ 19%]
........................................................................ [ 20%]
........................................................................ [ 20%]
...............................................x...x.................... [ 21%]
........................................................................ [ 22%]
...............................................xx....................... [ 22%]
........................................................................ [ 23%]
........................................................................ [ 23%]
........................................................................ [ 24%]
........................................................................ [ 25%]
........................................................................ [ 25%]
........................................................................ [ 26%]
........................................................................ [ 27%]
.................................ss..................................... [ 27%]
........................................................................ [ 28%]
...............s............................................s........... [ 29%]
........................................................................ [ 29%]
........................................................................ [ 30%]
........................................................................ [ 31%]
........................................................................ [ 31%]
........................................................................ [ 32%]
........................................................................ [ 33%]
........................................................................ [ 33%]
........................................................................ [ 34%]
................................................................s..s.... [ 34%]
........s............................................................... [ 35%]
........................................................................ [ 36%]
........................................................................ [ 36%]
........................................................................ [ 37%]
........................................................................ [ 38%]
......................................................s...........ssssss [ 38%]
sssssssss...............sssssssssssssss................................. [ 39%]
........................................................................ [ 40%]
........................................................................ [ 40%]
........................................................................ [ 41%]
........................................................................ [ 42%]
........................................................................ [ 42%]
........................................................................ [ 43%]
........................................................................ [ 44%]
........................................................................ [ 44%]
........................................................................ [ 45%]
..................................................x..................... [ 45%]
........................................................................ [ 46%]
........................................................................ [ 47%]
........................................................................ [ 47%]
........................................................................ [ 48%]
........................................................................ [ 49%]
........................................................................ [ 49%]
........................................................................ [ 50%]
........................................................................ [ 51%]
.........................s.............................................. [ 51%]
........................................................................ [ 52%]
.............................x.......................................... [ 53%]
........................................................................ [ 53%]
........................................................................ [ 54%]
........................................................................ [ 55%]
...s............................x....................................... [ 55%]
........................................................................ [ 56%]
........................................................................ [ 56%]
........................................................................ [ 57%]
........................................................................ [ 58%]
........................................................................ [ 58%]
........................................................................ [ 59%]
........................................................................ [ 60%]
..............................................x......................... [ 60%]
........................................s............................... [ 61%]
........................................................................ [ 62%]
........................................................................ [ 62%]
............................................F........................... [ 63%]
........................................................................ [ 64%]
........................................................................ [ 64%]
........................................................................ [ 65%]
.................xx..................................................... [ 66%]
........................................................................ [ 66%]
........................................................................ [ 67%]
........................................................................ [ 68%]
........................................................................ [ 68%]
........................................................................ [ 69%]
........................................................................ [ 69%]
........................................................................ [ 70%]
........................................................................ [ 71%]
........................................................................ [ 71%]
........................................................................ [ 72%]
........................................................................ [ 73%]
........................................................................ [ 73%]
........................................................................ [ 74%]
........................................................................ [ 75%]
........................................................................ [ 75%]
........................................................................ [ 76%]
........................................................................ [ 77%]
........................................................................ [ 77%]
........................................................................ [ 78%]
.................xx..................................................... [ 79%]
........................................................................ [ 79%]
........................................................................ [ 80%]
........................................................................ [ 80%]
........................................................................ [ 81%]
........................................................................ [ 82%]
........................................................................ [ 82%]
........................................................................ [ 83%]
........................................................................ [ 84%]
........................................................................ [ 84%]
........................................................................ [ 85%]
........................................................................ [ 86%]
........................................................................ [ 86%]
........................................................................ [ 87%]
........................................................................ [ 88%]
........................................................................ [ 88%]
..................................s..................................... [ 89%]
........................................................................ [ 90%]
........................................................................ [ 90%]
........................................................................ [ 91%]
........................................................................ [ 91%]
........................................................................ [ 92%]
............s........................................................... [ 93%]
........................................................................ [ 93%]
.................s................s..................................... [ 94%]
........................................................................ [ 95%]
........................................................................ [ 95%]
........................................................................ [ 96%]
..........ss............................................................ [ 97%]
........................................................................ [ 97%]
........................................................................ [ 98%]
........................................................................ [ 99%]
....sss................................................................. [ 99%]
.......................xXX..                                             [100%]
=================================== FAILURES ===================================
______________________________ TestCond.test_nan _______________________________

self = <numpy.linalg.tests.test_linalg.TestCond object at 0xee082b80>

    def test_nan(self):
        # nans should be passed through, not converted to infs
        ps = [None, 1, -1, 2, -2, 'fro']
        p_pos = [None, 1, 2, 'fro']
    
        A = np.ones((2, 2))
        A[0,1] = np.nan
        for p in ps:
>           c = linalg.cond(A, p)

A          = array([[ 1., nan],
       [ 1.,  1.]])
p          = None
p_pos      = [None, 1, 2, 'fro']
ps         = [None, 1, -1, 2, -2, 'fro']
self       = <numpy.linalg.tests.test_linalg.TestCond object at 0xee082b80>

numpy/linalg/tests/test_linalg.py:777: 
_ _ _ _ _ _ _ _ _ _ _ _ _ _ _ _ _ _ _ _ _ _ _ _ _ _ _ _ _ _ _ _ _ _ _ _ _ _ _ _ 
<__array_function__ internals>:5: in cond
    ???
        args       = (array([[ 1., nan],
       [ 1.,  1.]]), None)
        kwargs     = {}
        relevant_args = (array([[ 1., nan],
       [ 1.,  1.]]),)
numpy/linalg/linalg.py:1766: in cond
    s = svd(x, compute_uv=False)
        p          = None
        x          = array([[ 1., nan],
       [ 1.,  1.]])
<__array_function__ internals>:5: in svd
    ???
        args       = (array([[ 1., nan],
       [ 1.,  1.]]),)
        kwargs     = {'compute_uv': False}
        relevant_args = (array([[ 1., nan],
       [ 1.,  1.]]),)
numpy/linalg/linalg.py:1673: in svd
    s = gufunc(a, signature=signature, extobj=extobj)
        _nx        = <module 'numpy' from '/tmp/B.ixzp66fn/BUILD/numpy-1.19.4/build/testenv/lib/python3.9/site-packages/numpy/__init__.py'>
        a          = array([[ 1., nan],
       [ 1.,  1.]])
        compute_uv = False
        extobj     = [8192, 1536, <function _raise_linalgerror_svd_nonconvergence at 0xf6d254f0>]
        full_matrices = True
        gufunc     = <ufunc 'svd_n'>
        hermitian  = False
        m          = 2
        n          = 2
        result_t   = <class 'numpy.float64'>
        signature  = 'd->d'
        t          = <class 'numpy.float64'>
        wrap       = <built-in method __array_prepare__ of numpy.ndarray object at 0xee43f570>
_ _ _ _ _ _ _ _ _ _ _ _ _ _ _ _ _ _ _ _ _ _ _ _ _ _ _ _ _ _ _ _ _ _ _ _ _ _ _ _ 

err = 'invalid value', flag = 8

    def _raise_linalgerror_svd_nonconvergence(err, flag):
>       raise LinAlgError("SVD did not converge")
E       numpy.linalg.LinAlgError: SVD did not converge

err        = 'invalid value'
flag       = 8

numpy/linalg/linalg.py:97: LinAlgError
=========================== short test summary info ============================
FAILED numpy/linalg/tests/test_linalg.py::TestCond::test_nan - numpy.linalg.L...
1 failed, 11031 passed, 61 skipped, 21 xfailed, 2 xpassed in 503.00s (0:08:23)
error: Bad exit status from /tmp/B.ixzp66fn/BUILD/tmp/rpm-tmp.4Tf1C3 (%build)


RPM build errors:
    Could not canonicalize hostname: nereid
    Bad exit status from /tmp/B.ixzp66fn/BUILD/tmp/rpm-tmp.4Tf1C3 (%build)
ended at: Sun Nov 21 06:29:36 2021, done in 0:13:28.481971
error: No files produced.
+ chmod -R u+rwX /tmp/B.ixzp66fn/BUILD
+ rm -rf /tmp/B.ixzp66fn/tmp /tmp/B.ixzp66fn/BUILD
+ rm -rf /tmp/B.ixzp66fn
Begin-PLD-Builder-Info
Build-Time: user:973.34s sys:37.15s real:811.04s (faults io:2210 non-io:7082968)

End-PLD-Builder-Info
[Back to list of logs] [View rpm -qa of builder]