FailedOk

th/SRPMS[OK]
th/x32[OK]
th/i686[OK]
th/x86_64[OK]

ac/SRPMS[OK]
ac/i386[OK]
ac/i586[OK]
ac/i686[OK]
ac/alpha[OK]
ac/amd64[OK]
ac/athlon[OK]
ac/ppc[OK]
ac/sparc[OK]
ac/sparc64[OK]

Advanced Search
main()
Powered by PLD Linux
(c) 2002-2021 PLD Team
$Revision: 1.37 $
Powered by x-files.
Your IP: 3.235.223.5

rpm 932137ac-81ff-4771-8f47-83b564ba54bd

Status:Failed
Source URL:https://buildlogs.pld-linux.org/pld/th/i686/FAIL/rpm,932137ac-81ff-4771-8f47-83b564ba54bd.bz2
text/plain URL:View!
full text:View!
rpm -qa of builder:View!
Date:2021/05/29 07:48:01
Runtime:0:00:51.869531

Toc:

  • error 1
  • error: No files produced.
  • error 2
  • libtool: error: error: relink 'selinux.la' with the above command before installing it
  • error 3
  • make[3]: *** [Makefile:580: install-pluginsLTLIBRARIES] Error 1
  • error 4
  • make[2]: *** [Makefile:785: install-am] Error 2
  • error 5
  • make[1]: *** [Makefile:1372: install-recursive] Error 1

Content:

 /usr/bin/install -c -m 644 gendiff.1 '/tmp/B.DmPoh9/BUILD/tmp/rpm-4.16.1.3-i686-root-builder/usr/share/man/man1'
make[3]: Leaving directory '/tmp/B.DmPoh9/BUILD/rpm-4.16.1.3/doc'
make[3]: Entering directory '/tmp/B.DmPoh9/BUILD/rpm-4.16.1.3/doc'
 /bin/mkdir -p '/tmp/B.DmPoh9/BUILD/tmp/rpm-4.16.1.3-i686-root-builder/usr/share/man/ko/man8'
 /usr/bin/install -c -m 644 ko/rpm.8 ko/rpm2cpio.8 '/tmp/B.DmPoh9/BUILD/tmp/rpm-4.16.1.3-i686-root-builder/usr/share/man/ko/man8'
make[3]: Leaving directory '/tmp/B.DmPoh9/BUILD/rpm-4.16.1.3/doc'
make[3]: Entering directory '/tmp/B.DmPoh9/BUILD/rpm-4.16.1.3/doc'
 /bin/mkdir -p '/tmp/B.DmPoh9/BUILD/tmp/rpm-4.16.1.3-i686-root-builder/usr/share/man/pl/man8'
 /usr/bin/install -c -m 644 pl/rpm.8 pl/rpm2cpio.8 pl/rpmbuild.8 pl/rpmdeps.8 pl/rpmgraph.8 '/tmp/B.DmPoh9/BUILD/tmp/rpm-4.16.1.3-i686-root-builder/usr/share/man/pl/man8'
make[3]: Leaving directory '/tmp/B.DmPoh9/BUILD/rpm-4.16.1.3/doc'
make[3]: Entering directory '/tmp/B.DmPoh9/BUILD/rpm-4.16.1.3/doc'
 /bin/mkdir -p '/tmp/B.DmPoh9/BUILD/tmp/rpm-4.16.1.3-i686-root-builder/usr/share/man/pl/man1'
 /usr/bin/install -c -m 644 pl/gendiff.1 '/tmp/B.DmPoh9/BUILD/tmp/rpm-4.16.1.3-i686-root-builder/usr/share/man/pl/man1'
make[3]: Leaving directory '/tmp/B.DmPoh9/BUILD/rpm-4.16.1.3/doc'
make[3]: Entering directory '/tmp/B.DmPoh9/BUILD/rpm-4.16.1.3/doc'
 /bin/mkdir -p '/tmp/B.DmPoh9/BUILD/tmp/rpm-4.16.1.3-i686-root-builder/usr/share/man/man8'
 /usr/bin/install -c -m 644 rpm.8 rpm-misc.8 rpmbuild.8 rpmdeps.8 rpmgraph.8 rpm2cpio.8 rpmdb.8 rpmkeys.8 rpmsign.8 rpmspec.8 rpm-plugin-prioreset.8 rpm-plugin-syslog.8 rpm-plugins.8 rpm-plugin-audit.8 rpm-plugin-systemd-inhibit.8 rpm-plugin-ima.8 rpm-plugin-selinux.8 rpm2archive.8 '/tmp/B.DmPoh9/BUILD/tmp/rpm-4.16.1.3-i686-root-builder/usr/share/man/man8'
make[3]: Leaving directory '/tmp/B.DmPoh9/BUILD/rpm-4.16.1.3/doc'
make[3]: Entering directory '/tmp/B.DmPoh9/BUILD/rpm-4.16.1.3/doc'
 /bin/mkdir -p '/tmp/B.DmPoh9/BUILD/tmp/rpm-4.16.1.3-i686-root-builder/usr/share/man/ru/man8'
 /usr/bin/install -c -m 644 ru/rpm.8 ru/rpm2cpio.8 '/tmp/B.DmPoh9/BUILD/tmp/rpm-4.16.1.3-i686-root-builder/usr/share/man/ru/man8'
make[3]: Leaving directory '/tmp/B.DmPoh9/BUILD/rpm-4.16.1.3/doc'
make[3]: Entering directory '/tmp/B.DmPoh9/BUILD/rpm-4.16.1.3/doc'
 /bin/mkdir -p '/tmp/B.DmPoh9/BUILD/tmp/rpm-4.16.1.3-i686-root-builder/usr/share/man/sk/man8'
 /usr/bin/install -c -m 644 sk/rpm.8 '/tmp/B.DmPoh9/BUILD/tmp/rpm-4.16.1.3-i686-root-builder/usr/share/man/sk/man8'
make[3]: Leaving directory '/tmp/B.DmPoh9/BUILD/rpm-4.16.1.3/doc'
Making install in .
make[3]: Entering directory '/tmp/B.DmPoh9/BUILD/rpm-4.16.1.3'
 /bin/mkdir -p '/tmp/B.DmPoh9/BUILD/tmp/rpm-4.16.1.3-i686-root-builder/usr/bin'
 /usr/bin/install -c scripts/gendiff '/tmp/B.DmPoh9/BUILD/tmp/rpm-4.16.1.3-i686-root-builder/usr/bin'
make[3]: Leaving directory '/tmp/B.DmPoh9/BUILD/rpm-4.16.1.3'
make[3]: Entering directory '/tmp/B.DmPoh9/BUILD/rpm-4.16.1.3'
 /bin/mkdir -p '/tmp/B.DmPoh9/BUILD/tmp/rpm-4.16.1.3-i686-root-builder/usr/lib/pkgconfig'
 /usr/bin/install -c -m 644 rpm.pc '/tmp/B.DmPoh9/BUILD/tmp/rpm-4.16.1.3-i686-root-builder/usr/lib/pkgconfig'
make[3]: Leaving directory '/tmp/B.DmPoh9/BUILD/rpm-4.16.1.3'
make[3]: Entering directory '/tmp/B.DmPoh9/BUILD/rpm-4.16.1.3'
 /bin/mkdir -p '/tmp/B.DmPoh9/BUILD/tmp/rpm-4.16.1.3-i686-root-builder/usr/lib/rpm'
 /usr/bin/install -c -m 644 rpmrc rpmpopt-4.16.1.3 '/tmp/B.DmPoh9/BUILD/tmp/rpm-4.16.1.3-i686-root-builder/usr/lib/rpm'
make[3]: Leaving directory '/tmp/B.DmPoh9/BUILD/rpm-4.16.1.3'
make[3]: Entering directory '/tmp/B.DmPoh9/BUILD/rpm-4.16.1.3'
 /bin/mkdir -p '/tmp/B.DmPoh9/BUILD/tmp/rpm-4.16.1.3-i686-root-builder/usr/lib/rpm'
 /usr/bin/install -c mkinstalldirs scripts/find-debuginfo.sh '/tmp/B.DmPoh9/BUILD/tmp/rpm-4.16.1.3-i686-root-builder/usr/lib/rpm'
make[3]: Leaving directory '/tmp/B.DmPoh9/BUILD/rpm-4.16.1.3'
make[3]: Entering directory '/tmp/B.DmPoh9/BUILD/rpm-4.16.1.3'
 /bin/mkdir -p '/tmp/B.DmPoh9/BUILD/tmp/rpm-4.16.1.3-i686-root-builder/usr/include/rpm'
 /usr/bin/install -c -m 644 rpmio/argv.h rpmio/rpmio.h rpmio/rpmurl.h rpmio/rpmmacro.h rpmio/rpmlog.h rpmio/rpmpgp.h rpmio/rpmsq.h rpmio/rpmstring.h rpmio/rpmstrpool.h rpmio/rpmsw.h rpmio/rpmfileutil.h rpmio/rpmutil.h rpmio/rpmkeyring.h rpmio/rpmbase64.h rpmio/rpmver.h lib/header.h lib/rpmdb.h lib/rpmcallback.h lib/rpmcli.h lib/rpmlib.h lib/rpmds.h lib/rpmfi.h lib/rpmfiles.h lib/rpmpol.h lib/rpmps.h lib/rpmprob.h lib/rpmtag.h lib/rpmtd.h lib/rpmte.h lib/rpmts.h lib/rpmtypes.h lib/rpmarchive.h sign/rpmsign.h build/rpmbuild.h build/rpmfc.h build/rpmspec.h '/tmp/B.DmPoh9/BUILD/tmp/rpm-4.16.1.3-i686-root-builder/usr/include/rpm'
make[3]: Leaving directory '/tmp/B.DmPoh9/BUILD/rpm-4.16.1.3'
make[3]: Entering directory '/tmp/B.DmPoh9/BUILD/rpm-4.16.1.3'
 /bin/mkdir -p '/tmp/B.DmPoh9/BUILD/tmp/rpm-4.16.1.3-i686-root-builder/usr/lib/rpm'
  /bin/sh ./libtool   --mode=install /usr/bin/install -c debugedit elfdeps sepdebugcrcfix rpmdeps '/tmp/B.DmPoh9/BUILD/tmp/rpm-4.16.1.3-i686-root-builder/usr/lib/rpm'
libtool: install: /usr/bin/install -c .libs/debugedit /tmp/B.DmPoh9/BUILD/tmp/rpm-4.16.1.3-i686-root-builder/usr/lib/rpm/debugedit
libtool: install: /usr/bin/install -c .libs/elfdeps /tmp/B.DmPoh9/BUILD/tmp/rpm-4.16.1.3-i686-root-builder/usr/lib/rpm/elfdeps
libtool: install: /usr/bin/install -c sepdebugcrcfix /tmp/B.DmPoh9/BUILD/tmp/rpm-4.16.1.3-i686-root-builder/usr/lib/rpm/sepdebugcrcfix
libtool: install: /usr/bin/install -c .libs/rpmdeps /tmp/B.DmPoh9/BUILD/tmp/rpm-4.16.1.3-i686-root-builder/usr/lib/rpm/rpmdeps
make[3]: Leaving directory '/tmp/B.DmPoh9/BUILD/rpm-4.16.1.3'
make[3]: Entering directory '/tmp/B.DmPoh9/BUILD/rpm-4.16.1.3'
 /bin/mkdir -p '/tmp/B.DmPoh9/BUILD/tmp/rpm-4.16.1.3-i686-root-builder/usr/bin'
  /bin/sh ./libtool   --mode=install /usr/bin/install -c rpm rpm2cpio rpmbuild rpmdb rpmkeys rpmsign rpmspec rpm2archive rpmgraph '/tmp/B.DmPoh9/BUILD/tmp/rpm-4.16.1.3-i686-root-builder/usr/bin'
libtool: install: /usr/bin/install -c .libs/rpm /tmp/B.DmPoh9/BUILD/tmp/rpm-4.16.1.3-i686-root-builder/usr/bin/rpm
libtool: install: /usr/bin/install -c .libs/rpm2cpio /tmp/B.DmPoh9/BUILD/tmp/rpm-4.16.1.3-i686-root-builder/usr/bin/rpm2cpio
libtool: install: /usr/bin/install -c .libs/rpmbuild /tmp/B.DmPoh9/BUILD/tmp/rpm-4.16.1.3-i686-root-builder/usr/bin/rpmbuild
libtool: install: /usr/bin/install -c .libs/rpmdb /tmp/B.DmPoh9/BUILD/tmp/rpm-4.16.1.3-i686-root-builder/usr/bin/rpmdb
libtool: install: /usr/bin/install -c .libs/rpmkeys /tmp/B.DmPoh9/BUILD/tmp/rpm-4.16.1.3-i686-root-builder/usr/bin/rpmkeys
libtool: install: /usr/bin/install -c .libs/rpmsign /tmp/B.DmPoh9/BUILD/tmp/rpm-4.16.1.3-i686-root-builder/usr/bin/rpmsign
libtool: install: /usr/bin/install -c .libs/rpmspec /tmp/B.DmPoh9/BUILD/tmp/rpm-4.16.1.3-i686-root-builder/usr/bin/rpmspec
libtool: install: /usr/bin/install -c .libs/rpm2archive /tmp/B.DmPoh9/BUILD/tmp/rpm-4.16.1.3-i686-root-builder/usr/bin/rpm2archive
libtool: install: /usr/bin/install -c .libs/rpmgraph /tmp/B.DmPoh9/BUILD/tmp/rpm-4.16.1.3-i686-root-builder/usr/bin/rpmgraph
make[3]: Leaving directory '/tmp/B.DmPoh9/BUILD/rpm-4.16.1.3'
/usr/bin/make  install-exec-hook
make[4]: Entering directory '/tmp/B.DmPoh9/BUILD/rpm-4.16.1.3'
ln -s rpm /tmp/B.DmPoh9/BUILD/tmp/rpm-4.16.1.3-i686-root-builder/usr/bin/rpmquery
ln -s  rpm /tmp/B.DmPoh9/BUILD/tmp/rpm-4.16.1.3-i686-root-builder/usr/bin/rpmverify
make[4]: Leaving directory '/tmp/B.DmPoh9/BUILD/rpm-4.16.1.3'
make[3]: Entering directory '/tmp/B.DmPoh9/BUILD/rpm-4.16.1.3'
DESTDIR="/tmp/B.DmPoh9/BUILD/tmp/rpm-4.16.1.3-i686-root-builder" pkglibdir="/usr/lib/rpm" \
	/bin/sh ./installplatform \
		rpmrc platform macros \
		pld linux -gnu
make[3]: Leaving directory '/tmp/B.DmPoh9/BUILD/rpm-4.16.1.3'
Making install in python
make[3]: Entering directory '/tmp/B.DmPoh9/BUILD/rpm-4.16.1.3/python'
 /bin/mkdir -p '/tmp/B.DmPoh9/BUILD/tmp/rpm-4.16.1.3-i686-root-builder/usr/lib/python3.9/site-packages/rpm'
 /usr/bin/install -c -m 644 rpm/__init__.py rpm/transaction.py '/tmp/B.DmPoh9/BUILD/tmp/rpm-4.16.1.3-i686-root-builder/usr/lib/python3.9/site-packages/rpm'
make[3]: Leaving directory '/tmp/B.DmPoh9/BUILD/rpm-4.16.1.3/python'
make[3]: Nothing to be done for 'install-data-am'.
make[3]: Entering directory '/tmp/B.DmPoh9/BUILD/rpm-4.16.1.3/python'
 /bin/mkdir -p '/tmp/B.DmPoh9/BUILD/tmp/rpm-4.16.1.3-i686-root-builder/usr/lib/python3.9/site-packages/rpm'
 /bin/sh ../libtool   --mode=install /usr/bin/install -c   _rpm.la '/tmp/B.DmPoh9/BUILD/tmp/rpm-4.16.1.3-i686-root-builder/usr/lib/python3.9/site-packages/rpm'
libtool: warning: relinking '_rpm.la'
libtool: install: (cd /tmp/B.DmPoh9/BUILD/rpm-4.16.1.3/python; /bin/sh "/tmp/B.DmPoh9/BUILD/rpm-4.16.1.3/libtool"  --tag CC --mode=relink i686-pld-linux-gcc -D_REENTRANT -Wall -Wpointer-arith -Wmissing-prototypes -Wstrict-prototypes -fno-strict-aliasing -fstack-protector -fno-strict-overflow -fno-delete-null-pointer-checks -Wempty-body -O2 -fwrapv -pipe -Wformat -Werror=format-security -gdwarf-4 -fno-debug-types-section -fvar-tracking-assignments -g2 -Wp,-D_FORTIFY_SOURCE=2 -fstack-protector-strong --param=ssp-buffer-size=4 -Werror=trampolines -fomit-frame-pointer -march=i686 -fasynchronous-unwind-tables -mtune=pentium4 -gdwarf-4 -fno-debug-types-section -fvar-tracking-assignments -g2 -module -avoid-version -shared -Wl,--as-needed -Wl,--no-copy-dt-needed-entries -Wl,-z,relro -Wl,-z,combreloc -o _rpm.la -rpath /usr/lib/python3.9/site-packages/rpm rpmmodule.lo header-py.lo rpmarchive-py.lo rpmds-py.lo rpmfd-py.lo rpmfi-py.lo rpmfiles-py.lo rpmkeyring-py.lo rpmmi-py.lo rpmii-py.lo rpmps-py.lo rpmmacro-py.lo rpmstrpool-py.lo rpmtd-py.lo rpmte-py.lo rpmts-py.lo rpmver-py.lo spec-py.lo ../lib/librpm.la ../rpmio/librpmio.la ../build/librpmbuild.la ../sign/librpmsign.la -laudit -ldl -lpthread -inst-prefix-dir /tmp/B.DmPoh9/BUILD/tmp/rpm-4.16.1.3-i686-root-builder)
libtool: relink: i686-pld-linux-gcc -shared  -fPIC -DPIC  -fstack-protector -O2 -gdwarf-4 -g2 -fstack-protector-strong -march=i686 -mtune=pentium4 -gdwarf-4 -g2 -Wl,--as-needed -Wl,--no-copy-dt-needed-entries -Wl,-z -Wl,relro -Wl,-z -Wl,combreloc   -pthread -fopenmp  .libs/rpmmodule.o .libs/header-py.o .libs/rpmarchive-py.o .libs/rpmds-py.o .libs/rpmfd-py.o .libs/rpmfi-py.o .libs/rpmfiles-py.o .libs/rpmkeyring-py.o .libs/rpmmi-py.o .libs/rpmii-py.o .libs/rpmps-py.o .libs/rpmmacro-py.o .libs/rpmstrpool-py.o .libs/rpmtd-py.o .libs/rpmte-py.o .libs/rpmts-py.o .libs/rpmver-py.o .libs/spec-py.o   -L/tmp/B.DmPoh9/BUILD/rpm-4.16.1.3/lib/.libs -L/tmp/B.DmPoh9/BUILD/rpm-4.16.1.3/rpmio/.libs -L/tmp/B.DmPoh9/BUILD/tmp/rpm-4.16.1.3-i686-root-builder/usr/lib -L/usr/lib -lrpmbuild -lmagic -lelf -ldw -lrpmsign -lrpm -lcap -lacl -lattr -ldb -lsqlite3 -lrpmio -lgcrypt -lgpg-error -lbz2 -lz -llzma -lzstd -llua5.4 -lm -lpopt -laudit -lcap-ng -ldl -lpthread -Wl,-soname -Wl,_rpm.so -o .libs/_rpm.so
libtool: install: /usr/bin/install -c .libs/_rpm.soT /tmp/B.DmPoh9/BUILD/tmp/rpm-4.16.1.3-i686-root-builder/usr/lib/python3.9/site-packages/rpm/_rpm.so
libtool: install: /usr/bin/install -c .libs/_rpm.lai /tmp/B.DmPoh9/BUILD/tmp/rpm-4.16.1.3-i686-root-builder/usr/lib/python3.9/site-packages/rpm/_rpm.la
libtool: warning: remember to run 'libtool --finish /usr/lib/python3.9/site-packages/rpm'
make[3]: Leaving directory '/tmp/B.DmPoh9/BUILD/rpm-4.16.1.3/python'
Making install in plugins
make[3]: Nothing to be done for 'install-exec-am'.
Terminated
ended at: Sat May 29 07:48:01 2021, done in 0:00:51.869531
error: No files produced.
+ chmod -R u+rwX /tmp/B.DmPoh9/BUILD
+ rm -rf /tmp/B.DmPoh9/tmp /tmp/B.DmPoh9/BUILD
make[3]: Entering directory '/tmp/B.DmPoh9/BUILD/rpm-4.16.1.3/plugins'
 /bin/mkdir -p '/tmp/B.DmPoh9/BUILD/tmp/rpm-4.16.1.3-i686-root-builder/usr/lib/rpm-plugins'
 /bin/sh ../libtool   --mode=install /usr/bin/install -c   selinux.la systemd_inhibit.la prioreset.la syslog.la ima.la audit.la '/tmp/B.DmPoh9/BUILD/tmp/rpm-4.16.1.3-i686-root-builder/usr/lib/rpm-plugins'
libtool: warning: relinking 'selinux.la'
libtool: install: (cd /tmp/B.DmPoh9/BUILD/rpm-4.16.1.3/plugins; /bin/sh "/tmp/B.DmPoh9/BUILD/rpm-4.16.1.3/libtool"  --tag CC --mode=relink i686-pld-linux-gcc -D_REENTRANT -Wall -Wpointer-arith -Wmissing-prototypes -Wstrict-prototypes -fno-strict-aliasing -fstack-protector -fno-strict-overflow -fno-delete-null-pointer-checks -Wempty-body -O2 -fwrapv -pipe -Wformat -Werror=format-security -gdwarf-4 -fno-debug-types-section -fvar-tracking-assignments -g2 -Wp,-D_FORTIFY_SOURCE=2 -fstack-protector-strong --param=ssp-buffer-size=4 -Werror=trampolines -fomit-frame-pointer -march=i686 -fasynchronous-unwind-tables -mtune=pentium4 -gdwarf-4 -fno-debug-types-section -fvar-tracking-assignments -g2 -avoid-version -module -shared -Wl,--as-needed -Wl,--no-copy-dt-needed-entries -Wl,-z,relro -Wl,-z,combreloc -o selinux.la -rpath /usr/lib/rpm-plugins selinux.lo ../lib/librpm.la ../rpmio/librpmio.la -lselinux -laudit -ldl -lpthread -inst-prefix-dir /tmp/B.DmPoh9/BUILD/tmp/rpm-4.16.1.3-i686-root-builder)
/tmp/B.DmPoh9/BUILD/rpm-4.16.1.3/libtool: cd: /tmp/B.DmPoh9/BUILD/rpm-4.16.1.3/plugins/.libs: No such file or directory
libtool:   error: error: relink 'selinux.la' with the above command before installing it
make[3]: *** [Makefile:580: install-pluginsLTLIBRARIES] Error 1
make[3]: Leaving directory '/tmp/B.DmPoh9/BUILD/rpm-4.16.1.3/plugins'
make[2]: *** [Makefile:785: install-am] Error 2
make[1]: *** [Makefile:1372: install-recursive] Error 1
make: *** [Makefile:1681: install] Error 2
+ rm -rf /tmp/B.DmPoh9
Begin-PLD-Builder-Info
Build-Time: user:98.76s sys:31.90s real:54.45s (faults io:540 non-io:6935766)

End-PLD-Builder-Info
[Back to list of logs] [View rpm -qa of builder]