FailedOk

th/SRPMS[OK]
th/x32[OK]
th/i686[OK]
th/x86_64[OK]

ac/SRPMS[OK]
ac/i386[OK]
ac/i586[OK]
ac/i686[OK]
ac/alpha[OK]
ac/amd64[OK]
ac/athlon[OK]
ac/ppc[OK]
ac/sparc[OK]
ac/sparc64[OK]

Advanced Search
main()
Powered by PLD Linux
(c) 2002-2022 PLD Team
$Revision: 1.37 $
Powered by Lunatic Corp.
Your IP: 54.80.252.84

seamonkey 4702a7f3-ce66-4069-8f4b-bd15530a98c5

Status:Failed
Source URL:https://buildlogs.pld-linux.org/pld/th/i686/FAIL/seamonkey,4702a7f3-ce66-4069-8f4b-bd15530a98c5.bz2
text/plain URL:View!
full text:View!
rpm -qa of builder:View!
Date:2022/01/15 09:16:39
Runtime:0:00:46.268739

Toc:

  • error 1
  • 0:13.94 IOError: [Errno 13] Permission denied: u'/usr/lib/python2.7/sitecustomize.py'
  • error 2
  • 0:13.95 gmake[1]: *** [client.mk:109: configure] Error 1
  • error 3
  • error: Bad exit status from /tmp/B.m1q03mr4/BUILD/tmp/rpm-tmp.qOGfGl (%build)
  • error 4
  • RPM build errors:
  • error 5
  • error: No files produced.

Content:

+ cd seamonkey-2.53.10.2
+ <<EOF 
mk_add_options MOZ_OBJDIR=/tmp/B.m1q03mr4/BUILD/seamonkey-2.53.10.2/obj-i686

export CFLAGS="-O2 -fwrapv -pipe -Wformat -Werror=format-security -gdwarf-4 -fno-debug-types-section -fvar-tracking-assignments -g2 -Wp,-D_FORTIFY_SOURCE=2 -fstack-protector-strong --param=ssp-buffer-size=4 -Werror=trampolines -fomit-frame-pointer -march=i686 -fasynchronous-unwind-tables -mtune=pentium4 -gdwarf-4 -fno-debug-types-section -fvar-tracking-assignments -g2  -D_FILE_OFFSET_BITS=64"
export CXXFLAGS="-O2 -fwrapv -pipe -Wformat -Werror=format-security -gdwarf-4 -fno-debug-types-section -fvar-tracking-assignments -g2 -Wp,-D_FORTIFY_SOURCE=2 -fstack-protector-strong --param=ssp-buffer-size=4 -Werror=trampolines -fomit-frame-pointer -march=i686 -fasynchronous-unwind-tables -mtune=pentium4 -gdwarf-4 -fno-debug-types-section -fvar-tracking-assignments -g2  -D_FILE_OFFSET_BITS=64"

export CFLAGS="$CFLAGS -g0"
export CXXFLAGS="$CXXFLAGS -g0"
export MOZ_DEBUG_FLAGS=" "
export LLVM_USE_SPLIT_DWARF=1
export LLVM_PARALLEL_LINK_JOBS=1
export MOZ_LINK_FLAGS="-Wl,--no-keep-memory -Wl,--reduce-memory-overheads"
export RUSTFLAGS="-Cdebuginfo=0"


# Options for 'configure' (same as command-line options).
ac_add_options --prefix=/usr
ac_add_options --libdir=/usr/lib
ac_add_options --disable-debug
ac_add_options --disable-strip
ac_add_options --disable-install-strip
ac_add_options --disable-tests
ac_add_options --disable-crashreporter
ac_add_options --disable-elf-hack
ac_add_options --disable-necko-wifi
ac_add_options --disable-updater
ac_add_options --enable-application=comm/suite
ac_add_options --enable-calendar
ac_add_options --enable-chrome-format=omni
ac_add_options --enable-default-toolkit=cairo-gtk3
ac_add_options --enable-dominspector
ac_add_options --enable-extensions=default
ac_add_options --enable-irc
ac_add_options --enable-linker=bfd
# breaks build
#ac_add_options --enable-shared-js
ac_add_options --enable-startup-notification
ac_add_options --enable-system-hunspell
ac_add_options --with-distribution-id=org.pld-linux
ac_add_options --with-system-bz2
ac_add_options --with-system-ffi
ac_add_options --with-system-icu
ac_add_options --with-system-jpeg
ac_add_options --with-system-libevent
ac_add_options --with-system-libvpx
ac_add_options --with-system-nspr
ac_add_options --with-system-nss
ac_add_options --with-system-pixman
ac_add_options --with-system-png
ac_add_options --with-system-zlib
EOF

+ >.mozconfig 
+ cat
+ /usr/bin/make -Otarget -j9 -j1 build 'AUTOCONF=/usr/bin/autoconf2_13' 'STRIP=/bin/true' 'MOZ_MAKE_FLAGS=-j9' 'installdir=/usr/lib/seamonkey' 'XLIBS=-lX11 -lXt' 'CC=i686-pld-linux-gcc' 'CXX=i686-pld-linux-g++'
./mach build
 Config object not found by mach.
 0:00.56 Clobber not needed.
 0:00.56 Adding make options from /tmp/B.m1q03mr4/BUILD/seamonkey-2.53.10.2/.mozconfig
    MOZ_OBJDIR=/tmp/B.m1q03mr4/BUILD/seamonkey-2.53.10.2/obj-i686
    OBJDIR=/tmp/B.m1q03mr4/BUILD/seamonkey-2.53.10.2/obj-i686
    FOUND_MOZCONFIG=/tmp/B.m1q03mr4/BUILD/seamonkey-2.53.10.2/.mozconfig
    export FOUND_MOZCONFIG
 0:00.57 /usr/bin/gmake -f client.mk -s configure
 0:00.58 cd /tmp/B.m1q03mr4/BUILD/seamonkey-2.53.10.2/obj-i686
 0:00.58 /tmp/B.m1q03mr4/BUILD/seamonkey-2.53.10.2/configure
 0:00.74 Creating Python environment
 0:12.36 created virtual environment CPython2.7.18.final.0-32 in 10829ms
 0:12.36   creator CPython2Posix(dest=/tmp/B.m1q03mr4/BUILD/seamonkey-2.53.10.2/obj-i686/_virtualenv, clear=False, no_vcs_ignore=False, global=False)
 0:12.36   seeder FromAppData(download=False, pip=bundle, wheel=bundle, setuptools=bundle, via=copy, app_data_dir=/home/users/builder/.local/share/virtualenv)
 0:12.36     added seed packages: pip==20.3.4, setuptools==44.1.1, wheel==0.37.1
 0:12.36   activators NushellActivator,PythonActivator,FishActivator,CShellActivator,PowerShellActivator,BashActivator
 0:13.94 running build_ext
 0:13.94 building 'psutil._psutil_linux' extension
 0:13.94 creating build
 0:13.94 creating build/temp.linux-i686-2.7
 0:13.94 creating build/temp.linux-i686-2.7/psutil
 0:13.94 i686-pld-linux-gcc -fno-strict-aliasing -O2 -fwrapv -pipe -Wformat -Werror=format-security -gdwarf-4 -fno-debug-types-section -fvar-tracking-assignments -g2 -Wp,-D_FORTIFY_SOURCE=2 -fstack-protector-strong --param=ssp-buffer-size=4 -Werror=trampolines -fomit-frame-pointer -march=i686 -fasynchronous-unwind-tables -mtune=pentium4 -gdwarf-4 -fno-debug-types-section -fvar-tracking-assignments -g2 -DNDEBUG -O2 -fwrapv -pipe -Wformat -Werror=format-security -gdwarf-4 -fno-debug-types-section -fvar-tracking-assignments -g2 -Wp,-D_FORTIFY_SOURCE=2 -fstack-protector-strong --param=ssp-buffer-size=4 -Werror=trampolines -fomit-frame-pointer -march=i686 -fasynchronous-unwind-tables -mtune=pentium4 -gdwarf-4 -fno-debug-types-section -fvar-tracking-assignments -g2 -fPIC -DPSUTIL_POSIX=1 -DPSUTIL_VERSION=543 -DPSUTIL_LINUX=1 -I/tmp/B.m1q03mr4/BUILD/seamonkey-2.53.10.2/obj-i686/_virtualenv/include/python2.7 -c psutil/_psutil_common.c -o build/temp.linux-i686-2.7/psutil/_psutil_common.o
 0:13.94 i686-pld-linux-gcc -fno-strict-aliasing -O2 -fwrapv -pipe -Wformat -Werror=format-security -gdwarf-4 -fno-debug-types-section -fvar-tracking-assignments -g2 -Wp,-D_FORTIFY_SOURCE=2 -fstack-protector-strong --param=ssp-buffer-size=4 -Werror=trampolines -fomit-frame-pointer -march=i686 -fasynchronous-unwind-tables -mtune=pentium4 -gdwarf-4 -fno-debug-types-section -fvar-tracking-assignments -g2 -DNDEBUG -O2 -fwrapv -pipe -Wformat -Werror=format-security -gdwarf-4 -fno-debug-types-section -fvar-tracking-assignments -g2 -Wp,-D_FORTIFY_SOURCE=2 -fstack-protector-strong --param=ssp-buffer-size=4 -Werror=trampolines -fomit-frame-pointer -march=i686 -fasynchronous-unwind-tables -mtune=pentium4 -gdwarf-4 -fno-debug-types-section -fvar-tracking-assignments -g2 -fPIC -DPSUTIL_POSIX=1 -DPSUTIL_VERSION=543 -DPSUTIL_LINUX=1 -I/tmp/B.m1q03mr4/BUILD/seamonkey-2.53.10.2/obj-i686/_virtualenv/include/python2.7 -c psutil/_psutil_posix.c -o build/temp.linux-i686-2.7/psutil/_psutil_posix.o
 0:13.94 i686-pld-linux-gcc -fno-strict-aliasing -O2 -fwrapv -pipe -Wformat -Werror=format-security -gdwarf-4 -fno-debug-types-section -fvar-tracking-assignments -g2 -Wp,-D_FORTIFY_SOURCE=2 -fstack-protector-strong --param=ssp-buffer-size=4 -Werror=trampolines -fomit-frame-pointer -march=i686 -fasynchronous-unwind-tables -mtune=pentium4 -gdwarf-4 -fno-debug-types-section -fvar-tracking-assignments -g2 -DNDEBUG -O2 -fwrapv -pipe -Wformat -Werror=format-security -gdwarf-4 -fno-debug-types-section -fvar-tracking-assignments -g2 -Wp,-D_FORTIFY_SOURCE=2 -fstack-protector-strong --param=ssp-buffer-size=4 -Werror=trampolines -fomit-frame-pointer -march=i686 -fasynchronous-unwind-tables -mtune=pentium4 -gdwarf-4 -fno-debug-types-section -fvar-tracking-assignments -g2 -fPIC -DPSUTIL_POSIX=1 -DPSUTIL_VERSION=543 -DPSUTIL_LINUX=1 -I/tmp/B.m1q03mr4/BUILD/seamonkey-2.53.10.2/obj-i686/_virtualenv/include/python2.7 -c psutil/_psutil_linux.c -o build/temp.linux-i686-2.7/psutil/_psutil_linux.o
 0:13.94 creating build/lib.linux-i686-2.7
 0:13.94 creating build/lib.linux-i686-2.7/psutil
 0:13.94 i686-pld-linux-gcc -shared -Wl,--as-needed -Wl,--no-copy-dt-needed-entries -Wl,-z,relro -Wl,-z,combreloc build/temp.linux-i686-2.7/psutil/_psutil_common.o build/temp.linux-i686-2.7/psutil/_psutil_posix.o build/temp.linux-i686-2.7/psutil/_psutil_linux.o -L/usr/lib -lpython2.7 -o build/lib.linux-i686-2.7/psutil/_psutil_linux.so
 0:13.94 building 'psutil._psutil_posix' extension
 0:13.94 i686-pld-linux-gcc -fno-strict-aliasing -O2 -fwrapv -pipe -Wformat -Werror=format-security -gdwarf-4 -fno-debug-types-section -fvar-tracking-assignments -g2 -Wp,-D_FORTIFY_SOURCE=2 -fstack-protector-strong --param=ssp-buffer-size=4 -Werror=trampolines -fomit-frame-pointer -march=i686 -fasynchronous-unwind-tables -mtune=pentium4 -gdwarf-4 -fno-debug-types-section -fvar-tracking-assignments -g2 -DNDEBUG -O2 -fwrapv -pipe -Wformat -Werror=format-security -gdwarf-4 -fno-debug-types-section -fvar-tracking-assignments -g2 -Wp,-D_FORTIFY_SOURCE=2 -fstack-protector-strong --param=ssp-buffer-size=4 -Werror=trampolines -fomit-frame-pointer -march=i686 -fasynchronous-unwind-tables -mtune=pentium4 -gdwarf-4 -fno-debug-types-section -fvar-tracking-assignments -g2 -fPIC -DPSUTIL_POSIX=1 -DPSUTIL_VERSION=543 -DPSUTIL_LINUX=1 -I/tmp/B.m1q03mr4/BUILD/seamonkey-2.53.10.2/obj-i686/_virtualenv/include/python2.7 -c psutil/_psutil_common.c -o build/temp.linux-i686-2.7/psutil/_psutil_common.o
 0:13.94 i686-pld-linux-gcc -fno-strict-aliasing -O2 -fwrapv -pipe -Wformat -Werror=format-security -gdwarf-4 -fno-debug-types-section -fvar-tracking-assignments -g2 -Wp,-D_FORTIFY_SOURCE=2 -fstack-protector-strong --param=ssp-buffer-size=4 -Werror=trampolines -fomit-frame-pointer -march=i686 -fasynchronous-unwind-tables -mtune=pentium4 -gdwarf-4 -fno-debug-types-section -fvar-tracking-assignments -g2 -DNDEBUG -O2 -fwrapv -pipe -Wformat -Werror=format-security -gdwarf-4 -fno-debug-types-section -fvar-tracking-assignments -g2 -Wp,-D_FORTIFY_SOURCE=2 -fstack-protector-strong --param=ssp-buffer-size=4 -Werror=trampolines -fomit-frame-pointer -march=i686 -fasynchronous-unwind-tables -mtune=pentium4 -gdwarf-4 -fno-debug-types-section -fvar-tracking-assignments -g2 -fPIC -DPSUTIL_POSIX=1 -DPSUTIL_VERSION=543 -DPSUTIL_LINUX=1 -I/tmp/B.m1q03mr4/BUILD/seamonkey-2.53.10.2/obj-i686/_virtualenv/include/python2.7 -c psutil/_psutil_posix.c -o build/temp.linux-i686-2.7/psutil/_psutil_posix.o
 0:13.94 i686-pld-linux-gcc -shared -Wl,--as-needed -Wl,--no-copy-dt-needed-entries -Wl,-z,relro -Wl,-z,combreloc build/temp.linux-i686-2.7/psutil/_psutil_common.o build/temp.linux-i686-2.7/psutil/_psutil_posix.o -L/usr/lib -lpython2.7 -o build/lib.linux-i686-2.7/psutil/_psutil_posix.so
 0:13.94 copying build/lib.linux-i686-2.7/psutil/_psutil_linux.so -> psutil
 0:13.94 copying build/lib.linux-i686-2.7/psutil/_psutil_posix.so -> psutil
 0:13.94 Traceback (most recent call last):
 0:13.94   File "/tmp/B.m1q03mr4/BUILD/seamonkey-2.53.10.2/python/mozbuild/mozbuild/virtualenv.py", line 565, in <module>
 0:13.94     manager.populate()
 0:13.94   File "/tmp/B.m1q03mr4/BUILD/seamonkey-2.53.10.2/python/mozbuild/mozbuild/virtualenv.py", line 390, in populate
 0:13.94     handle_package(package)
 0:13.94   File "/tmp/B.m1q03mr4/BUILD/seamonkey-2.53.10.2/python/mozbuild/mozbuild/virtualenv.py", line 285, in handle_package
 0:13.94     submanager.populate()
 0:13.94   File "/tmp/B.m1q03mr4/BUILD/seamonkey-2.53.10.2/python/mozbuild/mozbuild/virtualenv.py", line 394, in populate
 0:13.94     with open(sitecustomize, 'w') as f:
 0:13.94 IOError: [Errno 13] Permission denied: u'/usr/lib/python2.7/sitecustomize.py'
 0:13.94 Traceback (most recent call last):
 0:13.95   File "/tmp/B.m1q03mr4/BUILD/seamonkey-2.53.10.2/configure.py", line 124, in <module>
 0:13.95     sys.exit(main(sys.argv))
 0:13.95   File "/tmp/B.m1q03mr4/BUILD/seamonkey-2.53.10.2/configure.py", line 29, in main
 0:13.95     sandbox.run(os.path.join(os.path.dirname(__file__), 'moz.configure'))
 0:13.95   File "/tmp/B.m1q03mr4/BUILD/seamonkey-2.53.10.2/python/mozbuild/mozbuild/configure/__init__.py", line 425, in run
 0:13.95     self.include_file(path)
 0:13.95   File "/tmp/B.m1q03mr4/BUILD/seamonkey-2.53.10.2/python/mozbuild/mozbuild/configure/__init__.py", line 416, in include_file
 0:13.95     exec_(code, self)
 0:13.95   File "/tmp/B.m1q03mr4/BUILD/seamonkey-2.53.10.2/python/mozbuild/mozbuild/util.py", line 59, in exec_
 0:13.95     exec(object, globals, locals)
 0:13.95   File "/tmp/B.m1q03mr4/BUILD/seamonkey-2.53.10.2/moz.configure", line 7, in <module>
 0:13.95     include('build/moz.configure/init.configure')
 0:13.95   File "/tmp/B.m1q03mr4/BUILD/seamonkey-2.53.10.2/python/mozbuild/mozbuild/configure/__init__.py", line 718, in include_impl
 0:13.95     self.include_file(what)
 0:13.95   File "/tmp/B.m1q03mr4/BUILD/seamonkey-2.53.10.2/python/mozbuild/mozbuild/configure/__init__.py", line 416, in include_file
 0:13.95     exec_(code, self)
 0:13.95   File "/tmp/B.m1q03mr4/BUILD/seamonkey-2.53.10.2/python/mozbuild/mozbuild/util.py", line 59, in exec_
 0:13.95     exec(object, globals, locals)
 0:13.95   File "/tmp/B.m1q03mr4/BUILD/seamonkey-2.53.10.2/build/moz.configure/init.configure", line 207, in <module>
 0:13.95     @imports('distutils.sysconfig')
 0:13.95   File "/tmp/B.m1q03mr4/BUILD/seamonkey-2.53.10.2/python/mozbuild/mozbuild/configure/__init__.py", line 701, in decorator
 0:13.95     depends = DependsFunction(self, func, dependencies, when=when)
 0:13.95   File "/tmp/B.m1q03mr4/BUILD/seamonkey-2.53.10.2/python/mozbuild/mozbuild/configure/__init__.py", line 121, in __init__
 0:13.95     sandbox._value_for(self)
 0:13.95   File "/tmp/B.m1q03mr4/BUILD/seamonkey-2.53.10.2/python/mozbuild/mozbuild/configure/__init__.py", line 500, in _value_for
 0:13.95     return self._value_for_depends(obj)
 0:13.95   File "/tmp/B.m1q03mr4/BUILD/seamonkey-2.53.10.2/python/mozbuild/mozbuild/util.py", line 944, in method_call
 0:13.95     cache[args] = self.func(instance, *args)
 0:13.95   File "/tmp/B.m1q03mr4/BUILD/seamonkey-2.53.10.2/python/mozbuild/mozbuild/configure/__init__.py", line 509, in _value_for_depends
 0:13.95     return obj.result()
 0:13.95   File "/tmp/B.m1q03mr4/BUILD/seamonkey-2.53.10.2/python/mozbuild/mozbuild/util.py", line 944, in method_call
 0:13.95     cache[args] = self.func(instance, *args)
 0:13.95   File "/tmp/B.m1q03mr4/BUILD/seamonkey-2.53.10.2/python/mozbuild/mozbuild/configure/__init__.py", line 147, in result
 0:13.95     return self._func(*resolved_args)
 0:13.95   File "/tmp/B.m1q03mr4/BUILD/seamonkey-2.53.10.2/python/mozbuild/mozbuild/configure/__init__.py", line 1027, in wrapped
 0:13.95     return new_func(*args, **kwargs)
 0:13.95   File "/tmp/B.m1q03mr4/BUILD/seamonkey-2.53.10.2/build/moz.configure/init.configure", line 255, in virtualenv_python
 0:13.95     manager.build(python)
 0:13.95   File "/tmp/B.m1q03mr4/BUILD/seamonkey-2.53.10.2/python/mozbuild/mozbuild/virtualenv.py", line 449, in build
 0:13.95     raise Exception('Error populating virtualenv.')
 0:13.95 Exception: Error populating virtualenv.
 0:13.95 *** Fix above errors and then restart with\
 0:13.95                "./mach build"
 0:13.95 gmake[1]: *** [client.mk:109: configure] Error 1
make: *** [GNUmakefile:9: build] Error 2
error: Bad exit status from /tmp/B.m1q03mr4/BUILD/tmp/rpm-tmp.qOGfGl (%build)


RPM build errors:
    Macro expanded in comment on line 1013: %{_datadir}/%{name}/extensions/langpack-lt@seamonkey.mozilla.org.xpi

    Could not canonicalize hostname: nereid
    Bad exit status from /tmp/B.m1q03mr4/BUILD/tmp/rpm-tmp.qOGfGl (%build)
ended at: Sat Jan 15 09:16:12 2022, done in 0:00:46.268739
error: No files produced.
+ chmod -R u+rwX /tmp/B.m1q03mr4/BUILD
+ rm -rf /tmp/B.m1q03mr4/tmp /tmp/B.m1q03mr4/BUILD
+ rm -rf /tmp/B.m1q03mr4
Begin-PLD-Builder-Info
Build-Time: user:40.25s sys:27.95s real:102.99s (faults io:0 non-io:269885)

End-PLD-Builder-Info
[Back to list of logs] [View rpm -qa of builder]