FailedOk

th/SRPMS[OK]
th/x32[OK]
th/i686[OK]
th/x86_64[OK]

ac/SRPMS[OK]
ac/i386[OK]
ac/i586[OK]
ac/i686[OK]
ac/alpha[OK]
ac/amd64[OK]
ac/athlon[OK]
ac/ppc[OK]
ac/sparc[OK]
ac/sparc64[OK]

Advanced Search
main()
Powered by PLD Linux
(c) 2002-2021 PLD Team
$Revision: 1.37 $
Powered by computron.
Your IP: 35.170.64.36

simple-scan fe6fa2f0-97f4-4b67-894a-3d7c37a8eeb2

Status:Failed
Source URL:https://buildlogs.pld-linux.org/pld/th/i686/FAIL/simple-scan,fe6fa2f0-97f4-4b67-894a-3d7c37a8eeb2.bz2
text/plain URL:View!
full text:View!
rpm -qa of builder:View!
Date:2021/05/30 19:19:16
Runtime:0:00:02.818076

Toc:

  • error 1
  • rpm: error: Failed build dependencies:
  • error 2
  • rpm: error: Failed build dependencies:
  • prep
  • Executing(%prep): /bin/sh -e /tmp/B.1eIq5E/BUILD/tmp/rpm-tmp.vuy1iH
  • build
  • Executing(%build): /bin/sh -e /tmp/B.1eIq5E/BUILD/tmp/rpm-tmp.T4NuKF
  • error 3
  • error: Package `libhandy-1' not found in specified Vala API directories or GObject-Introspection GIR directories
  • error 4
  • error: Bad exit status from /tmp/B.1eIq5E/BUILD/tmp/rpm-tmp.T4NuKF (%build)
  • error 5
  • RPM build errors:
  • error 6
  • error: No files produced.

Content:

checking if we should skip the build
started at: Sun May 30 19:19:01 2021
killing old processes on a builder
sending signal 9 to pid -1
cleaning up /tmp
fetching https://srcbuilder.pld-linux.org/th//srpms/fe6fa2f0-97f4-4b67-894a-3d7c37a8eeb2/simple-scan-40.1-1.src.rpm
fetched 1482708 bytes, 2685.1 K/s
installing srpm: simple-scan-40.1-1.src.rpm
+ install -d /tmp/B.1eIq5E/BUILD /tmp/B.1eIq5E/RPMS
+ LC_ALL=en_US.UTF-8
+ rpm -qp --changelog simple-scan-40.1-1.src.rpm
* Sun May 30 2021 PLD Linux Team <feedback@pld-linux.org>
- For complete changelog see: http://git.pld-linux.org/?p=packages/simple-scan.git;a=log;h=master
* Sun May 30 2021 Jakub Bogusz <qboosh@pld-linux.org> a17505a
- updated to 40.1 * Sun Apr 04 2021 Jakub Bogusz <qboosh@pld-linux.org> 27b0a96
- updated to 40.0 * Sat Mar 13 2021 Jakub Bogusz <qboosh@pld-linux.org> c78ebc6
- updated to 3.38.5 * Wed Dec 09 2020 Jakub Bogusz <qboosh@pld-linux.org> dbe2e5c
- updated to 3.38.2 * Sat Oct 03 2020 Jakub Bogusz <qboosh@pld-linux.org> 2d28083
- updated to 3.38.1 * Sun Sep 13 2020 Jakub Bogusz <qboosh@pld-linux.org> 9282d69
- updated to 3.38.0 * Fri Sep 04 2020 Jakub Bogusz <qboosh@pld-linux.org> 9526915
- updated to 3.36.6 * Fri Jul 10 2020 Jakub Bogusz <qboosh@pld-linux.org> 9601585
- updated to 3.36.4 * Wed Jun 03 2020 Jakub Bogusz <qboosh@pld-linux.org> 0ec4508
- updated to 3.36.3 * Wed May 06 2020 Jakub Bogusz <qboosh@pld-linux.org> 0f16f1b
- updated to 3.36.2.1 * Thu Apr 30 2020 Jakub Bogusz <qboosh@pld-linux.org> 2aa7d5c
- updated to 3.36.2 * Sat Nov 23 2019 Jakub Bogusz <qboosh@pld-linux.org> c4f71ad
- updated to 3.34.2; PackageKit disabled for now * Mon Apr 09 2018 Jan Rękorajski <baggins@pld-linux.org> 4cae168
- remove unsupported locale, rel 2 * Sun Apr 01 2018 Marcin Banasiak <marcin.banasiak@gmail.com> a5991f2
- Update to 3.28.0 * Tue Nov 17 2015 Marcin Banasiak <marcin.banasiak@gmail.com> 77636b9
- Update to 3.18.1 * Wed Jan 14 2015 Marcin Banasiak <marcin.banasiak@gmail.com> cee7157
- Update to 3.14.2 * Sun Dec 28 2014 Jan Rękorajski <baggins@pld-linux.org> 24b031e
- updated gettext BR * Sun Jun 08 2014 Jan Rękorajski <baggins@pld-linux.org> 918db35
- release 2 (by relup.sh) * Sat Mar 31 2012 Marcin Banasiak <marcin.banasiak@gmail.com> 998189a
- updated to 3.4.0; merged changes from DEVEL * Sun Nov 20 2011 Marcin Banasiak <marcin.banasiak@gmail.com> e288f24
- updated to 3.2.1 + rpm -Uhv --nodeps --define '_topdir /tmp/B.1eIq5E' --define '_specdir %{_topdir}' --define '_sourcedir %{_specdir}' --define '_rpmdir %{_topdir}/RPMS' --define '_builddir %{_topdir}/BUILD' simple-scan-40.1-1.src.rpm Updating / installing... simple-scan-40.1-1 ######################################## + rm -f simple-scan-40.1-1.src.rpm + install -m 700 -d /tmp/B.1eIq5E/BUILD/tmp + TMPDIR=/tmp/B.1eIq5E/BUILD/tmp + exec nice -n 0 rpmbuild -bp --short-circuit --nodeps --define '_topdir /tmp/B.1eIq5E' --define '_specdir %{_topdir}' --define '_sourcedir %{_specdir}' --define '_rpmdir %{_topdir}/RPMS' --define '_builddir %{_topdir}/BUILD' --target i686-pld-linux --define 'prep exit 0' /tmp/B.1eIq5E/simple-scan.spec warning: Could not canonicalize hostname: nereid Building target platforms: i686-pld-linux Building for target i686-pld-linux checking BuildConflict-ing packages no BuildConflicts found checking BR rpm: warning: Could not canonicalize hostname: nereid rpm: error: Failed build dependencies: rpm: libhandy1-devel >= 1.1.90 is needed by simple-scan-40.1-1.i686 rpm: Building target platforms: i686-pld-linux rpm: Building for target i686-pld-linux updating poldek cache... ready is up to date th is up to date th is up to date th-ready is up to date th-ready is up to date th-test is up to date th-test is up to date checking conflicting packages in BRed packages poldek: Loading [pndir]ready... poldek: Loading [pndir]th-test... poldek: Loading [pndir]th-test... poldek: Loading [pndir]th-ready... poldek: Loading [pndir]th-ready... poldek: Loading [pndir]th... poldek: Loading [pndir]th... poldek: 33859 packages read poldek: Removed 4245 duplicate packages from available set poldek: Processing dependencies... poldek: There are 1 package to install: poldek: A libhandy1-devel-1.2.2-1 poldek: This operation will use 720.8KB of disk space. poldek: Need to get 69.1KB of archives (69.1KB to download). poldek: poldek: Retrieving th::libhandy1-devel-1.2.2-1.i686.rpm............................................done poldek: libhandy1-devel-1.2.2-1.i686.rpm: digests OK poldek: Executing pm-command.sh --upgrade -vh --test --root / --define _check_dirname_deps 0... poldek: warning: /root/.poldek-cache/ftp_ftp1.pld-linux.org.dists.th.PLD.i686.RPMS/libhandy1-devel-1.2.2-1.i686.rpm: Header V4 DSA/SHA1 Signature, key ID e4f1bc2d: NOKEY poldek: Verifying... ######################################## poldek: Preparing... ######################################## no conflicts found checking BR rpm: warning: Could not canonicalize hostname: nereid rpm: error: Failed build dependencies: rpm: libhandy1-devel >= 1.1.90 is needed by simple-scan-40.1-1.i686 rpm: Building target platforms: i686-pld-linux rpm: Building for target i686-pld-linux installing BR: libhandy1\-devel + poldek --noask --caplookup -Q -v '--ignore=hhvm-*' '--ignore=php4-*' '--ignore=php52-*' '--ignore=php54-*' '--ignore=php55-*' '--ignore=php56-*' '--ignore=php70-*' '--ignore=php71-*' '--ignore=php72-*' '--ignore=php73-*' '--ignore=php74-*' '--ignore=php80-*' --upgrade libhandy1-devel Loading [pndir]ready... Loading [pndir]th-test... Loading [pndir]th-test... Loading [pndir]th-ready... Loading [pndir]th-ready... Loading [pndir]th... Loading [pndir]th... 33859 packages read Removed 4245 duplicate packages from available set Processing dependencies... There are 1 package to install: A libhandy1-devel-1.2.2-1 This operation will use 720.8KB of disk space. libhandy1-devel-1.2.2-1.i686.rpm: digests OK Need to get 69.1KB of archives. libhandy1-devel-1.2.2-1.i686.rpm: digests OK Executing pm-command.sh --upgrade -vh --root / --define _check_dirname_deps 0... warning: /root/.poldek-cache/ftp_ftp1.pld-linux.org.dists.th.PLD.i686.RPMS/libhandy1-devel-1.2.2-1.i686.rpm: Header V4 DSA/SHA1 Signature, key ID e4f1bc2d: NOKEY Verifying... ######################################## Preparing... ######################################## Updating / installing... libhandy1-devel-1.2.2-1 ######################################## building RPM using: set -ex; : build-id: fe6fa2f0-97f4-4b67-894a-3d7c37a8eeb2; TMPDIR=/tmp/B.1eIq5E/BUILD/tmp exec nice -n 0 rpmbuild -bb --define '_smp_mflags -j9' --define '_make_opts -Otarget' --define '_pld_builder 1' --define '_topdir /tmp/B.1eIq5E' --define '_specdir %{_topdir}' --define '_sourcedir %{_specdir}' --define '_rpmdir %{_topdir}/RPMS' --define '_builddir %{_topdir}/BUILD' --target i686-pld-linux /tmp/B.1eIq5E/simple-scan.spec + : build-id: fe6fa2f0-97f4-4b67-894a-3d7c37a8eeb2 + TMPDIR=/tmp/B.1eIq5E/BUILD/tmp + exec nice -n 0 rpmbuild -bb --define '_smp_mflags -j9' --define '_make_opts -Otarget' --define '_pld_builder 1' --define '_topdir /tmp/B.1eIq5E' --define '_specdir %{_topdir}' --define '_sourcedir %{_specdir}' --define '_rpmdir %{_topdir}/RPMS' --define '_builddir %{_topdir}/BUILD' --target i686-pld-linux /tmp/B.1eIq5E/simple-scan.spec warning: Could not canonicalize hostname: nereid Building target platforms: i686-pld-linux Building for target i686-pld-linux Executing(%prep): /bin/sh -e /tmp/B.1eIq5E/BUILD/tmp/rpm-tmp.vuy1iH + umask 022 + cd /tmp/B.1eIq5E/BUILD + cd /tmp/B.1eIq5E/BUILD + rm -rf simple-scan-40.1 + /usr/bin/xz -dc /tmp/B.1eIq5E/simple-scan-40.1.tar.xz + /bin/tar -xof - + STATUS=0 + '[' 0 -ne 0 ']' + cd simple-scan-40.1 + /bin/chmod -Rf a+rX,u+w,g-w,o-w . + RPM_EC=0 + jobs -p + exit 0 Executing(%build): /bin/sh -e /tmp/B.1eIq5E/BUILD/tmp/rpm-tmp.T4NuKF TMP=/home/users/builder/tmp HOME=/home/users/builder PATH=/home/users/builder/GNUstep/Tools:/bin:/usr/bin:/usr/local/bin:/home/users/builder/bin TMPDIR=/tmp/B.1eIq5E/BUILD/tmp + umask 022 + cd /tmp/B.1eIq5E/BUILD + cd simple-scan-40.1 + CC=i686-pld-linux-gcc CXX=i686-pld-linux-g++ CFLAGS='-O2 -fwrapv -pipe -Wformat -Werror=format-security -gdwarf-4 -fno-debug-types-section -fvar-tracking-assignments -g2 -Wp,-D_FORTIFY_SOURCE=2 -fstack-protector-strong --param=ssp-buffer-size=4 -Werror=trampolines -fomit-frame-pointer -march=i686 -fasynchronous-unwind-tables -mtune=pentium4 -gdwarf-4 -fno-debug-types-section -fvar-tracking-assignments -g2 ' CPPFLAGS='' CXXFLAGS='-O2 -fwrapv -pipe -Wformat -Werror=format-security -gdwarf-4 -fno-debug-types-section -fvar-tracking-assignments -g2 -Wp,-D_FORTIFY_SOURCE=2 -fstack-protector-strong --param=ssp-buffer-size=4 -Werror=trampolines -fomit-frame-pointer -march=i686 -fasynchronous-unwind-tables -mtune=pentium4 -gdwarf-4 -fno-debug-types-section -fvar-tracking-assignments -g2 ' LDFLAGS='-Wl,--as-needed -Wl,--no-copy-dt-needed-entries -Wl,-z,relro -Wl,-z,combreloc ' LC_ALL=C.UTF-8 /usr/bin/meson '--buildtype=plain' '--bindir=/usr/bin' '--datadir=/usr/share' '--includedir=/usr/include' '--infodir=/usr/share/info' '--libdir=/usr/lib' '--libexecdir=/usr/libexec' '--localedir=/usr/share/locale' '--localstatedir=/var' '--mandir=/usr/share/man' '--prefix=/usr' '--sbindir=/usr/sbin' '--sharedstatedir=/var/lib' '--sysconfdir=/etc' '--wrap-mode=nodownload' '--default-library=both' build The Meson build system Version: 0.57.1 Source dir: /tmp/B.1eIq5E/BUILD/simple-scan-40.1 Build dir: /tmp/B.1eIq5E/BUILD/simple-scan-40.1/build Build type: native build Project name: simple-scan Project version: 40.1 C compiler for the host machine: i686-pld-linux-gcc (gcc 11.1.0 "i686-pld-linux-gcc (PLD-Linux) 11.1.0 20210427 (release)") C linker for the host machine: i686-pld-linux-gcc ld.bfd 2.36.1 Vala compiler for the host machine: valac (valac 0.52.3) Host machine cpu family: x86 Host machine cpu: i686 Found pkg-config: /usr/bin/pkg-config (0.29.2) Run-time dependency glib-2.0 found: YES 2.68.2 Run-time dependency gtk+-3.0 found: YES 3.24.29 Run-time dependency gmodule-export-2.0 found: YES 2.68.2 Run-time dependency gthread-2.0 found: YES 2.68.2 Run-time dependency libhandy-1 found: YES 1.2.2 Run-time dependency zlib found: YES 1.2.11 Run-time dependency cairo found: YES 1.16.0 Run-time dependency gdk-pixbuf-2.0 found: YES 2.42.6 Run-time dependency gusb found: YES 0.3.6 Run-time dependency colord found: YES 1.4.5 Run-time dependency packagekit-glib2 found: YES 1.2.2 Run-time dependency libwebp found: YES 1.2.0 Run-time dependency libwebpmux found: YES 1.2.0 Run-time dependency sane-backends found: YES 1.0.31 Program msgfmt found: YES (/usr/bin/msgfmt) Program itstool found: YES (/usr/bin/itstool) Program meson_compile_gschema.py found: YES (/tmp/B.1eIq5E/BUILD/simple-scan-40.1/data/meson_compile_gschema.py) Found pkg-config: /usr/bin/pkg-config (0.29.2) Program glib-compile-resources found: YES (/usr/bin/glib-compile-resources) Build targets in project: 10 Option buildtype is: plain [default: debugoptimized] Found ninja-1.10.0 at /usr/bin/ninja + LC_ALL=C.UTF-8 /usr/bin/ninja -v -j9 -C build ninja: Entering directory `build' [1/19] valac -C --disable-since-check --pkg libwebpmux --pkg libwebp --pkg packagekit-glib2 --pkg colord --pkg sane-backends --pkg gusb --pkg gdk-pixbuf-2.0 --pkg cairo --pkg zlib --pkg libhandy-1 --pkg gtk+-3.0 --target-glib ' 2.38' --pkg glib-2.0 --color=always --directory src/simple-scan.p --basedir ../src --gresources=../data/simple-scan.gresource.xml --pkg=posix --vapidir=/tmp/B.1eIq5E/BUILD/simple-scan-40.1/src -D HAVE_COLORD -D HAVE_PACKAGEKIT -D HAVE_WEBP ../src/config.vapi ../src/app-window.vala ../src/authorize-dialog.vala ../src/book.vala ../src/book-view.vala ../src/page.vala ../src/page-icon.vala ../src/page-view.vala ../src/preferences-dialog.vala ../src/simple-scan.vala ../src/scanner.vala ../src/screensaver.vala ../src/autosave-manager.vala FAILED: src/simple-scan.p/app-window.c src/simple-scan.p/authorize-dialog.c src/simple-scan.p/book.c src/simple-scan.p/book-view.c src/simple-scan.p/page.c src/simple-scan.p/page-icon.c src/simple-scan.p/page-view.c src/simple-scan.p/preferences-dialog.c src/simple-scan.p/simple-scan.c src/simple-scan.p/scanner.c src/simple-scan.p/screensaver.c src/simple-scan.p/autosave-manager.c valac -C --disable-since-check --pkg libwebpmux --pkg libwebp --pkg packagekit-glib2 --pkg colord --pkg sane-backends --pkg gusb --pkg gdk-pixbuf-2.0 --pkg cairo --pkg zlib --pkg libhandy-1 --pkg gtk+-3.0 --target-glib ' 2.38' --pkg glib-2.0 --color=always --directory src/simple-scan.p --basedir ../src --gresources=../data/simple-scan.gresource.xml --pkg=posix --vapidir=/tmp/B.1eIq5E/BUILD/simple-scan-40.1/src -D HAVE_COLORD -D HAVE_PACKAGEKIT -D HAVE_WEBP ../src/config.vapi ../src/app-window.vala ../src/authorize-dialog.vala ../src/book.vala ../src/book-view.vala ../src/page.vala ../src/page-icon.vala ../src/page-view.vala ../src/preferences-dialog.vala ../src/simple-scan.vala ../src/scanner.vala ../src/screensaver.vala ../src/autosave-manager.vala error: Package `libhandy-1' not found in specified Vala API directories or GObject-Introspection GIR directories Compilation failed: 1 error(s), 0 warning(s) [2/19] /usr/bin/glib-compile-resources ../data/simple-scan.gresource.xml --sourcedir ../data/. --sourcedir data --sourcedir ../data --c-name resources --internal --generate --target data/resources.h [3/19] /usr/bin/glib-compile-resources ../data/simple-scan.gresource.xml --sourcedir ../data/. --sourcedir data --sourcedir ../data --c-name resources --internal --generate --target data/resources.c --dependency-file data/resources.c.d [4/19] /usr/bin/meson --internal msgfmthelper ../data/simple-scan.desktop.in data/simple-scan.desktop desktop ../data/../po [5/19] /usr/bin/meson --internal msgfmthelper ../data/simple-scan.appdata.xml.in data/simple-scan.appdata.xml xml ../data/../po ninja: build stopped: subcommand failed. error: Bad exit status from /tmp/B.1eIq5E/BUILD/tmp/rpm-tmp.T4NuKF (%build) RPM build errors: Could not canonicalize hostname: nereid Bad exit status from /tmp/B.1eIq5E/BUILD/tmp/rpm-tmp.T4NuKF (%build) ended at: Sun May 30 19:19:16 2021, done in 0:00:02.818076 error: No files produced. + chmod -R u+rwX /tmp/B.1eIq5E/BUILD + rm -rf /tmp/B.1eIq5E/tmp /tmp/B.1eIq5E/BUILD + rm -rf /tmp/B.1eIq5E Begin-PLD-Builder-Info Build-Time: user:10.60s sys:1.71s real:15.16s (faults io:15 non-io:436600) End-PLD-Builder-Info
[Back to list of logs] [View rpm -qa of builder]