FailedOk

th/SRPMS[OK]
th/x32[OK]
th/i686[OK]
th/x86_64[OK]

ac/SRPMS[OK]
ac/i386[OK]
ac/i586[OK]
ac/i686[OK]
ac/alpha[OK]
ac/amd64[OK]
ac/athlon[OK]
ac/ppc[OK]
ac/sparc[OK]
ac/sparc64[OK]

Advanced Search
main()
Powered by PLD Linux
(c) 2002-2021 PLD Team
$Revision: 1.37 $
Powered by ITS.
Your IP: 44.192.254.246

thunderbird 12184238-fadf-4297-bce8-90702a9c5057

Status:Failed
Source URL:https://buildlogs.pld-linux.org/pld/th/i686/FAIL/thunderbird,12184238-fadf-4297-bce8-90702a9c5057.bz2
text/plain URL:View!
full text:View!
rpm -qa of builder:View!
Date:2021/09/08 03:54:33
Runtime:1:12:46.217859

Toc:

  • error 1
  • 66:43.78 /tmp/B.tukm_nme/BUILD/thunderbird-91.1.0/modules/fdlibm/src/math_private.h:34:21: error: typedef redefinition with different types ('__double_t' (aka 'double') vs 'long double')
  • error 2
  • 66:43.89 gmake[4]: *** [/tmp/B.tukm_nme/BUILD/thunderbird-91.1.0/config/rules.mk:676: e_acos.o] Error 1
  • error 3
  • 66:43.89 gmake[3]: *** [/tmp/B.tukm_nme/BUILD/thunderbird-91.1.0/config/recurse.mk:72: modules/fdlibm/src/target-objects] Error 2
  • error 4
  • 71:25.73 gmake[2]: *** [/tmp/B.tukm_nme/BUILD/thunderbird-91.1.0/config/recurse.mk:34: compile] Error 2
  • error 5
  • 71:25.73 gmake[1]: *** [/tmp/B.tukm_nme/BUILD/thunderbird-91.1.0/config/rules.mk:355: default] Error 2
  • error 6
  • error: Bad exit status from /tmp/B.tukm_nme/BUILD/tmp/rpm-tmp.CN9GE5 (%build)
  • error 7
  • RPM build errors:
  • error 8
  • error: No files produced.

Content:

57:42.41     }
57:42.41     ^
57:42.41 In file included from Unified_cpp_gfx_skia9.cpp:119:
57:42.41 /tmp/B.tukm_nme/BUILD/thunderbird-91.1.0/gfx/skia/skia/src/core/SkTypeface_remote.cpp:32:1: warning: non-void function does not return a value in all control paths [-Wreturn-type]
57:42.41 }
57:42.41 ^
57:44.71 13 warnings generated.
57:54.26 gfx/thebes
58:35.61 gfx/vr/service/openvr
59:17.01 gfx/vr/service
59:23.83 gfx/vr
59:37.79 gfx/webrender_bindings
59:42.80 gfx/ycbcr
59:46.97 hal
60:18.22 image/build
60:21.26 image/decoders/icon/gtk
60:24.80 image/decoders/icon
60:29.62 image/decoders
60:29.65 warning: unknown warning option '-Werror=trampolines' [-Wunknown-warning-option]
60:29.75 1 warning generated.
60:36.90 image/encoders/bmp
60:38.17 image/encoders/ico
60:40.72 image/encoders/jpeg
60:41.83 image/encoders/png
60:43.20 image
60:44.33 intl/components
60:50.00 intl/hyphenation/glue
60:50.34 intl/l10n
60:53.21 intl/locale/gtk
60:59.09 intl/locale
61:05.09 intl/lwbrk
61:06.68 intl/strres
61:09.98 intl/uconv
61:13.10 intl/unicharutil/util
61:20.46 ipc/app
61:22.09 toolkit/library/build/symverscript.stub
61:22.17 comm/ldap/c-sdk/libraries/libldap/libldap60.so
61:22.28 comm/ldap/c-sdk/libraries/libldif/libldif60.so
61:22.43 media/libsoundtouch/src
61:22.51 config/external/sqlite/libmozsqlite3.so.symbols.stub
61:22.69 third_party/sqlite3/src
61:22.72 warning: unknown warning option '-Werror=trampolines' [-Wunknown-warning-option]
61:23.54 In file included from Unified_cpp_libsoundtouch_src0.cpp:20:
61:23.54 /tmp/B.tukm_nme/BUILD/thunderbird-91.1.0/media/libsoundtouch/src/FIRFilter.cpp:81:12: warning: unused variable 'dScaler' [-Wunused-variable]
61:23.54     double dScaler = 1.0 / (double)resultDivider;
61:23.54            ^
61:23.54 /tmp/B.tukm_nme/BUILD/thunderbird-91.1.0/media/libsoundtouch/src/FIRFilter.cpp:127:12: warning: unused variable 'dScaler' [-Wunused-variable]
61:23.54     double dScaler = 1.0 / (double)resultDivider;
61:23.54            ^
61:23.54 /tmp/B.tukm_nme/BUILD/thunderbird-91.1.0/media/libsoundtouch/src/FIRFilter.cpp:166:12: warning: unused variable 'dScaler' [-Wunused-variable]
61:23.54     double dScaler = 1.0 / (double)resultDivider;
61:23.54            ^
61:23.57 In file included from Unified_cpp_libsoundtouch_src0.cpp:47:
61:23.57 /tmp/B.tukm_nme/BUILD/thunderbird-91.1.0/media/libsoundtouch/src/InterpolateShannon.cpp:71:9: warning: 'PI' macro redefined [-Wmacro-redefined]
61:23.57 #define PI 3.1415926536
61:23.57         ^
61:23.57 /tmp/B.tukm_nme/BUILD/thunderbird-91.1.0/media/libsoundtouch/src/AAFilter.cpp:45:9: note: previous definition is here
61:23.57 #define PI       M_PI
61:23.57         ^
61:23.62 In file included from Unified_cpp_libsoundtouch_src0.cpp:92:
61:23.62 /tmp/B.tukm_nme/BUILD/thunderbird-91.1.0/media/libsoundtouch/src/cpu_detect_x86.cpp:48:12: warning: 'bit_MMX' macro redefined [-Wmacro-redefined]
61:23.62    #define bit_MMX     (1 << 23)
61:23.62            ^
61:23.62 /usr/lib/clang/12.0.1/include/cpuid.h:133:9: note: previous definition is here
61:23.62 #define bit_MMX         0x00800000
61:23.62         ^
61:23.62 In file included from Unified_cpp_libsoundtouch_src0.cpp:92:
61:23.63 /tmp/B.tukm_nme/BUILD/thunderbird-91.1.0/media/libsoundtouch/src/cpu_detect_x86.cpp:49:12: warning: 'bit_SSE' macro redefined [-Wmacro-redefined]
61:23.63    #define bit_SSE     (1 << 25)
61:23.63            ^
61:23.63 /usr/lib/clang/12.0.1/include/cpuid.h:136:9: note: previous definition is here
61:23.63 #define bit_SSE         0x02000000
61:23.63         ^
61:23.63 In file included from Unified_cpp_libsoundtouch_src0.cpp:92:
61:23.63 /tmp/B.tukm_nme/BUILD/thunderbird-91.1.0/media/libsoundtouch/src/cpu_detect_x86.cpp:50:12: warning: 'bit_SSE2' macro redefined [-Wmacro-redefined]
61:23.63    #define bit_SSE2    (1 << 26)
61:23.63            ^
61:23.63 /usr/lib/clang/12.0.1/include/cpuid.h:137:9: note: previous definition is here
61:23.63 #define bit_SSE2        0x04000000
61:23.63         ^
61:24.33 ipc/chromium
61:24.39 7 warnings generated.
61:24.41 ipc/glue
61:24.57 /tmp/B.tukm_nme/BUILD/thunderbird-91.1.0/third_party/sqlite3/src/sqlite3.c:161544:9: warning: code will never be executed [-Wunreachable-code]
61:24.57         YYMINORTYPE yylhsminor;
61:24.57         ^~~~~~~~~~~~~~~~~~~~~~~
61:36.32 ipc/ipdl
61:55.14 ipc/testshell
62:20.52 2 warnings generated.
62:26.82 js/ductwork/debugger
62:29.33 js/src/debugger
62:36.63 js/src/frontend
62:39.03 js/src/gc/StatsPhasesGenerated.inc.stub
62:39.21 js/src/irregexp
63:29.59 js/src/jit
64:22.39 js/src
64:32.43 js/src/wasm
66:43.33 modules/fdlibm/src
66:43.78 In file included from /tmp/B.tukm_nme/BUILD/thunderbird-91.1.0/modules/fdlibm/src/e_acos.cpp:44:
66:43.78 /tmp/B.tukm_nme/BUILD/thunderbird-91.1.0/modules/fdlibm/src/math_private.h:34:21: error: typedef redefinition with different types ('__double_t' (aka 'double') vs 'long double')
66:43.78 typedef __double_t  double_t;
66:43.78                     ^
66:43.78 /usr/include/math.h:170:21: note: previous definition is here
66:43.78 typedef long double double_t;
66:43.78                     ^
66:43.89 1 error generated.
66:43.89 gmake[4]: *** [/tmp/B.tukm_nme/BUILD/thunderbird-91.1.0/config/rules.mk:676: e_acos.o] Error 1
66:43.89 gmake[3]: *** [/tmp/B.tukm_nme/BUILD/thunderbird-91.1.0/config/recurse.mk:72: modules/fdlibm/src/target-objects] Error 2
66:43.89 gmake[3]: *** Waiting for unfinished jobs....
71:25.73 gmake[2]: *** [/tmp/B.tukm_nme/BUILD/thunderbird-91.1.0/config/recurse.mk:34: compile] Error 2
71:25.73 gmake[1]: *** [/tmp/B.tukm_nme/BUILD/thunderbird-91.1.0/config/rules.mk:355: default] Error 2
71:25.73 gmake: *** [client.mk:65: build] Error 2
71:25.75 97 compiler warnings present.
71:26.04 /usr/bin/notify-send --app-name=Mozilla Build System Mozilla Build System Build failed
 Config object not found by mach.
Configure complete!
Be sure to run |mach build| to pick up any changes
error: Bad exit status from /tmp/B.tukm_nme/BUILD/tmp/rpm-tmp.CN9GE5 (%build)


RPM build errors:
    Could not canonicalize hostname: nereid
    Bad exit status from /tmp/B.tukm_nme/BUILD/tmp/rpm-tmp.CN9GE5 (%build)
ended at: Wed Sep  8 03:54:13 2021, done in 1:12:46.217859
error: No files produced.
+ chmod -R u+rwX /tmp/B.tukm_nme/BUILD
+ rm -rf /tmp/B.tukm_nme/tmp /tmp/B.tukm_nme/BUILD
+ rm -rf /tmp/B.tukm_nme
Begin-PLD-Builder-Info
Build-Time: user:16673.45s sys:349.24s real:4416.50s (faults io:3 non-io:59427855)

End-PLD-Builder-Info
[Back to list of logs] [View rpm -qa of builder]