FailedOk

th/SRPMS[OK]
th/x32[OK]
th/i686[OK]
th/x86_64[OK]

ac/SRPMS[OK]
ac/i386[OK]
ac/i586[OK]
ac/i686[OK]
ac/alpha[OK]
ac/amd64[OK]
ac/athlon[OK]
ac/ppc[OK]
ac/sparc[OK]
ac/sparc64[OK]

Advanced Search
main()
Powered by PLD Linux
(c) 2002-2022 PLD Team
$Revision: 1.37 $
Powered by The Right Thing.
Your IP: 54.224.117.125

uhd 5e54c00d-3187-4a4d-9ed8-29918fa2e30a

Status:Failed
Source URL:https://buildlogs.pld-linux.org/pld/th/i686/FAIL/uhd,5e54c00d-3187-4a4d-9ed8-29918fa2e30a.bz2
text/plain URL:View!
full text:View!
rpm -qa of builder:View!
Date:2022/01/14 23:10:22
Runtime:0:09:05.711644

Toc:

  • error 1
  • /tmp/B.psmyb8l9/BUILD/uhd-4.1.0.1/host/utils/latency/lib/Responder.cpp:59:11: error: format not a string literal and no format arguments [-Werror=format-security]
  • error 2
  • make[2]: *** [utils/latency/CMakeFiles/responder.dir/build.make:99: utils/latency/CMakeFiles/responder.dir/lib/Responder.cpp.o] Error 1
  • error 3
  • make[1]: *** [CMakeFiles/Makefile2:2279: utils/latency/CMakeFiles/responder.dir/all] Error 2
  • error 4
  • error: Bad exit status from /tmp/B.psmyb8l9/BUILD/tmp/rpm-tmp.Oz1UYo (%build)
  • error 5
  • RPM build errors:
  • error 6
  • error: No files produced.

Content:

[ 94%] Building CXX object utils/CMakeFiles/uhd_cal_rx_iq_balance.dir/uhd_cal_rx_iq_balance.cpp.o
cd /tmp/B.psmyb8l9/BUILD/uhd-4.1.0.1/build-host/utils && /usr/bin/i686-pld-linux-g++  -DBOOST_ASIO_DISABLE_STD_EXPERIMENTAL_STRING_VIEW -DBOOST_ASIO_DISABLE_STD_STRING_VIEW -DBOOST_ERROR_CODE_HEADER_ONLY -DHAVE_CONFIG_H -DUHD_LOG_CONSOLE_COLOR -DUHD_LOG_CONSOLE_LEVEL=2 -DUHD_LOG_FILE_LEVEL=2 -DUHD_LOG_MIN_LEVEL=1 -I/tmp/B.psmyb8l9/BUILD/uhd-4.1.0.1/build-host/include -I/tmp/B.psmyb8l9/BUILD/uhd-4.1.0.1/host/include -I/usr/include/libusb-1.0 -I/tmp/B.psmyb8l9/BUILD/uhd-4.1.0.1/host/utils/../lib/include -I/tmp/B.psmyb8l9/BUILD/uhd-4.1.0.1/host/utils/../lib/usrp/b200 -I/tmp/B.psmyb8l9/BUILD/uhd-4.1.0.1/host/utils/../lib/usrp/common -I/tmp/B.psmyb8l9/BUILD/uhd-4.1.0.1/host/utils/../lib/usrp/common/ad9361_driver -I/tmp/B.psmyb8l9/BUILD/uhd-4.1.0.1/build-host/_cmrc/include  -fvisibility=hidden -fvisibility-inlines-hidden -O2 -fwrapv -pipe -Wformat -Werror=format-security -gdwarf-4 -fno-debug-types-section -fvar-tracking-assignments -g2 -Wp,-D_FORTIFY_SOURCE=2 -fstack-protector-strong --param=ssp-buffer-size=4 -Werror=trampolines -fomit-frame-pointer -march=i686 -fasynchronous-unwind-tables -mtune=pentium4 -gdwarf-4 -fno-debug-types-section -fvar-tracking-assignments -g2  -DNDEBUG -DQT_NO_DEBUG   -Wall -Wextra -Wsign-compare -std=gnu++14 -o CMakeFiles/uhd_cal_rx_iq_balance.dir/uhd_cal_rx_iq_balance.cpp.o -c /tmp/B.psmyb8l9/BUILD/uhd-4.1.0.1/host/utils/uhd_cal_rx_iq_balance.cpp
make[2]: Leaving directory '/tmp/B.psmyb8l9/BUILD/uhd-4.1.0.1/build-host'
make[2]: Entering directory '/tmp/B.psmyb8l9/BUILD/uhd-4.1.0.1/build-host'
[ 95%] Building CXX object utils/CMakeFiles/usrp_burn_db_eeprom.dir/usrp_burn_db_eeprom.cpp.o
cd /tmp/B.psmyb8l9/BUILD/uhd-4.1.0.1/build-host/utils && /usr/bin/i686-pld-linux-g++  -DBOOST_ASIO_DISABLE_STD_EXPERIMENTAL_STRING_VIEW -DBOOST_ASIO_DISABLE_STD_STRING_VIEW -DBOOST_ERROR_CODE_HEADER_ONLY -DHAVE_CONFIG_H -DUHD_LOG_CONSOLE_COLOR -DUHD_LOG_CONSOLE_LEVEL=2 -DUHD_LOG_FILE_LEVEL=2 -DUHD_LOG_MIN_LEVEL=1 -I/tmp/B.psmyb8l9/BUILD/uhd-4.1.0.1/build-host/include -I/tmp/B.psmyb8l9/BUILD/uhd-4.1.0.1/host/include -I/usr/include/libusb-1.0 -I/tmp/B.psmyb8l9/BUILD/uhd-4.1.0.1/host/utils/../lib/include -I/tmp/B.psmyb8l9/BUILD/uhd-4.1.0.1/host/utils/../lib/usrp/b200 -I/tmp/B.psmyb8l9/BUILD/uhd-4.1.0.1/host/utils/../lib/usrp/common -I/tmp/B.psmyb8l9/BUILD/uhd-4.1.0.1/host/utils/../lib/usrp/common/ad9361_driver -I/tmp/B.psmyb8l9/BUILD/uhd-4.1.0.1/build-host/_cmrc/include  -fvisibility=hidden -fvisibility-inlines-hidden -O2 -fwrapv -pipe -Wformat -Werror=format-security -gdwarf-4 -fno-debug-types-section -fvar-tracking-assignments -g2 -Wp,-D_FORTIFY_SOURCE=2 -fstack-protector-strong --param=ssp-buffer-size=4 -Werror=trampolines -fomit-frame-pointer -march=i686 -fasynchronous-unwind-tables -mtune=pentium4 -gdwarf-4 -fno-debug-types-section -fvar-tracking-assignments -g2  -DNDEBUG -DQT_NO_DEBUG   -Wall -Wextra -Wsign-compare -std=gnu++14 -o CMakeFiles/usrp_burn_db_eeprom.dir/usrp_burn_db_eeprom.cpp.o -c /tmp/B.psmyb8l9/BUILD/uhd-4.1.0.1/host/utils/usrp_burn_db_eeprom.cpp
make[2]: Leaving directory '/tmp/B.psmyb8l9/BUILD/uhd-4.1.0.1/build-host'
make[2]: Entering directory '/tmp/B.psmyb8l9/BUILD/uhd-4.1.0.1/build-host'
[ 98%] Linking CXX executable uhd_cal_tx_dc_offset
cd /tmp/B.psmyb8l9/BUILD/uhd-4.1.0.1/build-host/utils && /usr/bin/cmake -E cmake_link_script CMakeFiles/uhd_cal_tx_dc_offset.dir/link.txt --verbose=1
/usr/bin/i686-pld-linux-g++   -fvisibility=hidden -fvisibility-inlines-hidden -O2 -fwrapv -pipe -Wformat -Werror=format-security -gdwarf-4 -fno-debug-types-section -fvar-tracking-assignments -g2 -Wp,-D_FORTIFY_SOURCE=2 -fstack-protector-strong --param=ssp-buffer-size=4 -Werror=trampolines -fomit-frame-pointer -march=i686 -fasynchronous-unwind-tables -mtune=pentium4 -gdwarf-4 -fno-debug-types-section -fvar-tracking-assignments -g2  -DNDEBUG -DQT_NO_DEBUG  -Wl,--as-needed -Wl,--no-copy-dt-needed-entries -Wl,-z,relro -Wl,-z,combreloc CMakeFiles/uhd_cal_tx_dc_offset.dir/uhd_cal_tx_dc_offset.cpp.o  -o uhd_cal_tx_dc_offset  -Wl,-rpath,/tmp/B.psmyb8l9/BUILD/uhd-4.1.0.1/build-host/lib: ../lib/libuhd.so.4.1.0 /usr/lib/libboost_chrono.so /usr/lib/libboost_date_time.so /usr/lib/libboost_filesystem.so /usr/lib/libboost_program_options.so /usr/lib/libboost_serialization.so /usr/lib/libboost_thread.so /usr/lib/libboost_unit_test_framework.so /usr/lib/libboost_system.so /usr/lib/libboost_atomic.so -lpthread -ldl /usr/lib/libusb-1.0.so ../lib/rc/libuhd-resources.a /usr/lib/libpython3.9.so 
make[2]: Leaving directory '/tmp/B.psmyb8l9/BUILD/uhd-4.1.0.1/build-host'
make[1]: Entering directory '/tmp/B.psmyb8l9/BUILD/uhd-4.1.0.1/build-host'
[ 99%] Built target uhd_cal_tx_dc_offset
make[1]: Leaving directory '/tmp/B.psmyb8l9/BUILD/uhd-4.1.0.1/build-host'
make[2]: Entering directory '/tmp/B.psmyb8l9/BUILD/uhd-4.1.0.1/build-host'
[ 99%] Linking CXX executable uhd_cal_rx_iq_balance
cd /tmp/B.psmyb8l9/BUILD/uhd-4.1.0.1/build-host/utils && /usr/bin/cmake -E cmake_link_script CMakeFiles/uhd_cal_rx_iq_balance.dir/link.txt --verbose=1
/usr/bin/i686-pld-linux-g++   -fvisibility=hidden -fvisibility-inlines-hidden -O2 -fwrapv -pipe -Wformat -Werror=format-security -gdwarf-4 -fno-debug-types-section -fvar-tracking-assignments -g2 -Wp,-D_FORTIFY_SOURCE=2 -fstack-protector-strong --param=ssp-buffer-size=4 -Werror=trampolines -fomit-frame-pointer -march=i686 -fasynchronous-unwind-tables -mtune=pentium4 -gdwarf-4 -fno-debug-types-section -fvar-tracking-assignments -g2  -DNDEBUG -DQT_NO_DEBUG  -Wl,--as-needed -Wl,--no-copy-dt-needed-entries -Wl,-z,relro -Wl,-z,combreloc CMakeFiles/uhd_cal_rx_iq_balance.dir/uhd_cal_rx_iq_balance.cpp.o  -o uhd_cal_rx_iq_balance  -Wl,-rpath,/tmp/B.psmyb8l9/BUILD/uhd-4.1.0.1/build-host/lib: ../lib/libuhd.so.4.1.0 /usr/lib/libboost_chrono.so /usr/lib/libboost_date_time.so /usr/lib/libboost_filesystem.so /usr/lib/libboost_program_options.so /usr/lib/libboost_serialization.so /usr/lib/libboost_thread.so /usr/lib/libboost_unit_test_framework.so /usr/lib/libboost_system.so /usr/lib/libboost_atomic.so -lpthread -ldl /usr/lib/libusb-1.0.so ../lib/rc/libuhd-resources.a /usr/lib/libpython3.9.so 
make[2]: Leaving directory '/tmp/B.psmyb8l9/BUILD/uhd-4.1.0.1/build-host'
make[1]: Entering directory '/tmp/B.psmyb8l9/BUILD/uhd-4.1.0.1/build-host'
[ 99%] Built target uhd_cal_rx_iq_balance
make[1]: Leaving directory '/tmp/B.psmyb8l9/BUILD/uhd-4.1.0.1/build-host'
make[2]: Entering directory '/tmp/B.psmyb8l9/BUILD/uhd-4.1.0.1/build-host'
[ 99%] Linking CXX executable usrp_burn_db_eeprom
cd /tmp/B.psmyb8l9/BUILD/uhd-4.1.0.1/build-host/utils && /usr/bin/cmake -E cmake_link_script CMakeFiles/usrp_burn_db_eeprom.dir/link.txt --verbose=1
/usr/bin/i686-pld-linux-g++   -fvisibility=hidden -fvisibility-inlines-hidden -O2 -fwrapv -pipe -Wformat -Werror=format-security -gdwarf-4 -fno-debug-types-section -fvar-tracking-assignments -g2 -Wp,-D_FORTIFY_SOURCE=2 -fstack-protector-strong --param=ssp-buffer-size=4 -Werror=trampolines -fomit-frame-pointer -march=i686 -fasynchronous-unwind-tables -mtune=pentium4 -gdwarf-4 -fno-debug-types-section -fvar-tracking-assignments -g2  -DNDEBUG -DQT_NO_DEBUG  -Wl,--as-needed -Wl,--no-copy-dt-needed-entries -Wl,-z,relro -Wl,-z,combreloc CMakeFiles/usrp_burn_db_eeprom.dir/usrp_burn_db_eeprom.cpp.o  -o usrp_burn_db_eeprom  -Wl,-rpath,/tmp/B.psmyb8l9/BUILD/uhd-4.1.0.1/build-host/lib: ../lib/libuhd.so.4.1.0 /usr/lib/libboost_chrono.so /usr/lib/libboost_date_time.so /usr/lib/libboost_filesystem.so /usr/lib/libboost_program_options.so /usr/lib/libboost_serialization.so /usr/lib/libboost_thread.so /usr/lib/libboost_unit_test_framework.so /usr/lib/libboost_system.so /usr/lib/libboost_atomic.so -lpthread -ldl /usr/lib/libusb-1.0.so ../lib/rc/libuhd-resources.a /usr/lib/libpython3.9.so 
make[2]: Leaving directory '/tmp/B.psmyb8l9/BUILD/uhd-4.1.0.1/build-host'
make[1]: Entering directory '/tmp/B.psmyb8l9/BUILD/uhd-4.1.0.1/build-host'
[ 99%] Built target usrp_burn_db_eeprom
make[1]: Leaving directory '/tmp/B.psmyb8l9/BUILD/uhd-4.1.0.1/build-host'
make[2]: Entering directory '/tmp/B.psmyb8l9/BUILD/uhd-4.1.0.1/build-host'
[ 97%] Building CXX object utils/CMakeFiles/converter_benchmark.dir/converter_benchmark.cpp.o
cd /tmp/B.psmyb8l9/BUILD/uhd-4.1.0.1/build-host/utils && /usr/bin/i686-pld-linux-g++  -DBOOST_ASIO_DISABLE_STD_EXPERIMENTAL_STRING_VIEW -DBOOST_ASIO_DISABLE_STD_STRING_VIEW -DBOOST_ERROR_CODE_HEADER_ONLY -DHAVE_CONFIG_H -DUHD_LOG_CONSOLE_COLOR -DUHD_LOG_CONSOLE_LEVEL=2 -DUHD_LOG_FILE_LEVEL=2 -DUHD_LOG_MIN_LEVEL=1 -I/tmp/B.psmyb8l9/BUILD/uhd-4.1.0.1/build-host/include -I/tmp/B.psmyb8l9/BUILD/uhd-4.1.0.1/host/include -I/usr/include/libusb-1.0 -I/tmp/B.psmyb8l9/BUILD/uhd-4.1.0.1/host/utils/../lib/include -I/tmp/B.psmyb8l9/BUILD/uhd-4.1.0.1/host/utils/../lib/usrp/b200 -I/tmp/B.psmyb8l9/BUILD/uhd-4.1.0.1/host/utils/../lib/usrp/common -I/tmp/B.psmyb8l9/BUILD/uhd-4.1.0.1/host/utils/../lib/usrp/common/ad9361_driver -I/tmp/B.psmyb8l9/BUILD/uhd-4.1.0.1/build-host/_cmrc/include  -fvisibility=hidden -fvisibility-inlines-hidden -O2 -fwrapv -pipe -Wformat -Werror=format-security -gdwarf-4 -fno-debug-types-section -fvar-tracking-assignments -g2 -Wp,-D_FORTIFY_SOURCE=2 -fstack-protector-strong --param=ssp-buffer-size=4 -Werror=trampolines -fomit-frame-pointer -march=i686 -fasynchronous-unwind-tables -mtune=pentium4 -gdwarf-4 -fno-debug-types-section -fvar-tracking-assignments -g2  -DNDEBUG -DQT_NO_DEBUG   -Wall -Wextra -Wsign-compare -std=gnu++14 -o CMakeFiles/converter_benchmark.dir/converter_benchmark.cpp.o -c /tmp/B.psmyb8l9/BUILD/uhd-4.1.0.1/host/utils/converter_benchmark.cpp
make[2]: Leaving directory '/tmp/B.psmyb8l9/BUILD/uhd-4.1.0.1/build-host'
make[2]: Entering directory '/tmp/B.psmyb8l9/BUILD/uhd-4.1.0.1/build-host'
[100%] Linking CXX executable converter_benchmark
cd /tmp/B.psmyb8l9/BUILD/uhd-4.1.0.1/build-host/utils && /usr/bin/cmake -E cmake_link_script CMakeFiles/converter_benchmark.dir/link.txt --verbose=1
/usr/bin/i686-pld-linux-g++   -fvisibility=hidden -fvisibility-inlines-hidden -O2 -fwrapv -pipe -Wformat -Werror=format-security -gdwarf-4 -fno-debug-types-section -fvar-tracking-assignments -g2 -Wp,-D_FORTIFY_SOURCE=2 -fstack-protector-strong --param=ssp-buffer-size=4 -Werror=trampolines -fomit-frame-pointer -march=i686 -fasynchronous-unwind-tables -mtune=pentium4 -gdwarf-4 -fno-debug-types-section -fvar-tracking-assignments -g2  -DNDEBUG -DQT_NO_DEBUG  -Wl,--as-needed -Wl,--no-copy-dt-needed-entries -Wl,-z,relro -Wl,-z,combreloc CMakeFiles/converter_benchmark.dir/converter_benchmark.cpp.o  -o converter_benchmark  -Wl,-rpath,/tmp/B.psmyb8l9/BUILD/uhd-4.1.0.1/build-host/lib: ../lib/libuhd.so.4.1.0 /usr/lib/libboost_chrono.so /usr/lib/libboost_date_time.so /usr/lib/libboost_filesystem.so /usr/lib/libboost_program_options.so /usr/lib/libboost_serialization.so /usr/lib/libboost_thread.so /usr/lib/libboost_unit_test_framework.so /usr/lib/libboost_system.so /usr/lib/libboost_atomic.so -lpthread -ldl /usr/lib/libusb-1.0.so ../lib/rc/libuhd-resources.a /usr/lib/libpython3.9.so 
make[2]: Leaving directory '/tmp/B.psmyb8l9/BUILD/uhd-4.1.0.1/build-host'
make[1]: Entering directory '/tmp/B.psmyb8l9/BUILD/uhd-4.1.0.1/build-host'
[100%] Built target converter_benchmark
make[1]: Leaving directory '/tmp/B.psmyb8l9/BUILD/uhd-4.1.0.1/build-host'
make[2]: Entering directory '/tmp/B.psmyb8l9/BUILD/uhd-4.1.0.1/build-host'
[ 97%] Building CXX object utils/CMakeFiles/fx2_init_eeprom.dir/fx2_init_eeprom.cpp.o
cd /tmp/B.psmyb8l9/BUILD/uhd-4.1.0.1/build-host/utils && /usr/bin/i686-pld-linux-g++  -DBOOST_ASIO_DISABLE_STD_EXPERIMENTAL_STRING_VIEW -DBOOST_ASIO_DISABLE_STD_STRING_VIEW -DBOOST_ERROR_CODE_HEADER_ONLY -DHAVE_CONFIG_H -DUHD_LOG_CONSOLE_COLOR -DUHD_LOG_CONSOLE_LEVEL=2 -DUHD_LOG_FILE_LEVEL=2 -DUHD_LOG_MIN_LEVEL=1 -I/tmp/B.psmyb8l9/BUILD/uhd-4.1.0.1/build-host/include -I/tmp/B.psmyb8l9/BUILD/uhd-4.1.0.1/host/include -I/usr/include/libusb-1.0 -I/tmp/B.psmyb8l9/BUILD/uhd-4.1.0.1/host/utils/../lib/include -I/tmp/B.psmyb8l9/BUILD/uhd-4.1.0.1/host/utils/../lib/usrp/b200 -I/tmp/B.psmyb8l9/BUILD/uhd-4.1.0.1/host/utils/../lib/usrp/common -I/tmp/B.psmyb8l9/BUILD/uhd-4.1.0.1/host/utils/../lib/usrp/common/ad9361_driver -I/tmp/B.psmyb8l9/BUILD/uhd-4.1.0.1/build-host/_cmrc/include  -fvisibility=hidden -fvisibility-inlines-hidden -O2 -fwrapv -pipe -Wformat -Werror=format-security -gdwarf-4 -fno-debug-types-section -fvar-tracking-assignments -g2 -Wp,-D_FORTIFY_SOURCE=2 -fstack-protector-strong --param=ssp-buffer-size=4 -Werror=trampolines -fomit-frame-pointer -march=i686 -fasynchronous-unwind-tables -mtune=pentium4 -gdwarf-4 -fno-debug-types-section -fvar-tracking-assignments -g2  -DNDEBUG -DQT_NO_DEBUG   -Wall -Wextra -Wsign-compare -std=gnu++14 -o CMakeFiles/fx2_init_eeprom.dir/fx2_init_eeprom.cpp.o -c /tmp/B.psmyb8l9/BUILD/uhd-4.1.0.1/host/utils/fx2_init_eeprom.cpp
make[2]: Leaving directory '/tmp/B.psmyb8l9/BUILD/uhd-4.1.0.1/build-host'
make[2]: Entering directory '/tmp/B.psmyb8l9/BUILD/uhd-4.1.0.1/build-host'
[100%] Linking CXX executable fx2_init_eeprom
cd /tmp/B.psmyb8l9/BUILD/uhd-4.1.0.1/build-host/utils && /usr/bin/cmake -E cmake_link_script CMakeFiles/fx2_init_eeprom.dir/link.txt --verbose=1
/usr/bin/i686-pld-linux-g++   -fvisibility=hidden -fvisibility-inlines-hidden -O2 -fwrapv -pipe -Wformat -Werror=format-security -gdwarf-4 -fno-debug-types-section -fvar-tracking-assignments -g2 -Wp,-D_FORTIFY_SOURCE=2 -fstack-protector-strong --param=ssp-buffer-size=4 -Werror=trampolines -fomit-frame-pointer -march=i686 -fasynchronous-unwind-tables -mtune=pentium4 -gdwarf-4 -fno-debug-types-section -fvar-tracking-assignments -g2  -DNDEBUG -DQT_NO_DEBUG  -Wl,--as-needed -Wl,--no-copy-dt-needed-entries -Wl,-z,relro -Wl,-z,combreloc CMakeFiles/fx2_init_eeprom.dir/fx2_init_eeprom.cpp.o  -o fx2_init_eeprom  -Wl,-rpath,/tmp/B.psmyb8l9/BUILD/uhd-4.1.0.1/build-host/lib: ../lib/libuhd.so.4.1.0 /usr/lib/libboost_chrono.so /usr/lib/libboost_date_time.so /usr/lib/libboost_filesystem.so /usr/lib/libboost_program_options.so /usr/lib/libboost_serialization.so /usr/lib/libboost_thread.so /usr/lib/libboost_unit_test_framework.so /usr/lib/libboost_system.so /usr/lib/libboost_atomic.so -lpthread -ldl /usr/lib/libusb-1.0.so ../lib/rc/libuhd-resources.a /usr/lib/libpython3.9.so 
make[2]: Leaving directory '/tmp/B.psmyb8l9/BUILD/uhd-4.1.0.1/build-host'
make[1]: Entering directory '/tmp/B.psmyb8l9/BUILD/uhd-4.1.0.1/build-host'
[100%] Built target fx2_init_eeprom
make[1]: Leaving directory '/tmp/B.psmyb8l9/BUILD/uhd-4.1.0.1/build-host'
make[2]: Entering directory '/tmp/B.psmyb8l9/BUILD/uhd-4.1.0.1/build-host'
[ 97%] Building CXX object utils/CMakeFiles/query_gpsdo_sensors.dir/query_gpsdo_sensors.cpp.o
cd /tmp/B.psmyb8l9/BUILD/uhd-4.1.0.1/build-host/utils && /usr/bin/i686-pld-linux-g++  -DBOOST_ASIO_DISABLE_STD_EXPERIMENTAL_STRING_VIEW -DBOOST_ASIO_DISABLE_STD_STRING_VIEW -DBOOST_ERROR_CODE_HEADER_ONLY -DHAVE_CONFIG_H -DUHD_LOG_CONSOLE_COLOR -DUHD_LOG_CONSOLE_LEVEL=2 -DUHD_LOG_FILE_LEVEL=2 -DUHD_LOG_MIN_LEVEL=1 -I/tmp/B.psmyb8l9/BUILD/uhd-4.1.0.1/build-host/include -I/tmp/B.psmyb8l9/BUILD/uhd-4.1.0.1/host/include -I/usr/include/libusb-1.0 -I/tmp/B.psmyb8l9/BUILD/uhd-4.1.0.1/host/utils/../lib/include -I/tmp/B.psmyb8l9/BUILD/uhd-4.1.0.1/host/utils/../lib/usrp/b200 -I/tmp/B.psmyb8l9/BUILD/uhd-4.1.0.1/host/utils/../lib/usrp/common -I/tmp/B.psmyb8l9/BUILD/uhd-4.1.0.1/host/utils/../lib/usrp/common/ad9361_driver -I/tmp/B.psmyb8l9/BUILD/uhd-4.1.0.1/build-host/_cmrc/include  -fvisibility=hidden -fvisibility-inlines-hidden -O2 -fwrapv -pipe -Wformat -Werror=format-security -gdwarf-4 -fno-debug-types-section -fvar-tracking-assignments -g2 -Wp,-D_FORTIFY_SOURCE=2 -fstack-protector-strong --param=ssp-buffer-size=4 -Werror=trampolines -fomit-frame-pointer -march=i686 -fasynchronous-unwind-tables -mtune=pentium4 -gdwarf-4 -fno-debug-types-section -fvar-tracking-assignments -g2  -DNDEBUG -DQT_NO_DEBUG   -Wall -Wextra -Wsign-compare -std=gnu++14 -o CMakeFiles/query_gpsdo_sensors.dir/query_gpsdo_sensors.cpp.o -c /tmp/B.psmyb8l9/BUILD/uhd-4.1.0.1/host/utils/query_gpsdo_sensors.cpp
make[2]: Leaving directory '/tmp/B.psmyb8l9/BUILD/uhd-4.1.0.1/build-host'
make[2]: Entering directory '/tmp/B.psmyb8l9/BUILD/uhd-4.1.0.1/build-host'
[100%] Linking CXX executable query_gpsdo_sensors
cd /tmp/B.psmyb8l9/BUILD/uhd-4.1.0.1/build-host/utils && /usr/bin/cmake -E cmake_link_script CMakeFiles/query_gpsdo_sensors.dir/link.txt --verbose=1
/usr/bin/i686-pld-linux-g++   -fvisibility=hidden -fvisibility-inlines-hidden -O2 -fwrapv -pipe -Wformat -Werror=format-security -gdwarf-4 -fno-debug-types-section -fvar-tracking-assignments -g2 -Wp,-D_FORTIFY_SOURCE=2 -fstack-protector-strong --param=ssp-buffer-size=4 -Werror=trampolines -fomit-frame-pointer -march=i686 -fasynchronous-unwind-tables -mtune=pentium4 -gdwarf-4 -fno-debug-types-section -fvar-tracking-assignments -g2  -DNDEBUG -DQT_NO_DEBUG  -Wl,--as-needed -Wl,--no-copy-dt-needed-entries -Wl,-z,relro -Wl,-z,combreloc CMakeFiles/query_gpsdo_sensors.dir/query_gpsdo_sensors.cpp.o  -o query_gpsdo_sensors  -Wl,-rpath,/tmp/B.psmyb8l9/BUILD/uhd-4.1.0.1/build-host/lib: ../lib/libuhd.so.4.1.0 /usr/lib/libboost_chrono.so /usr/lib/libboost_date_time.so /usr/lib/libboost_filesystem.so /usr/lib/libboost_program_options.so /usr/lib/libboost_serialization.so /usr/lib/libboost_thread.so /usr/lib/libboost_unit_test_framework.so /usr/lib/libboost_system.so /usr/lib/libboost_atomic.so -lpthread -ldl /usr/lib/libusb-1.0.so ../lib/rc/libuhd-resources.a /usr/lib/libpython3.9.so 
make[2]: Leaving directory '/tmp/B.psmyb8l9/BUILD/uhd-4.1.0.1/build-host'
make[1]: Entering directory '/tmp/B.psmyb8l9/BUILD/uhd-4.1.0.1/build-host'
[100%] Built target query_gpsdo_sensors
make[1]: Leaving directory '/tmp/B.psmyb8l9/BUILD/uhd-4.1.0.1/build-host'
make[2]: Entering directory '/tmp/B.psmyb8l9/BUILD/uhd-4.1.0.1/build-host'
[ 98%] Building CXX object utils/latency/CMakeFiles/responder.dir/responder.cpp.o
cd /tmp/B.psmyb8l9/BUILD/uhd-4.1.0.1/build-host/utils/latency && /usr/bin/i686-pld-linux-g++  -DBOOST_ASIO_DISABLE_STD_EXPERIMENTAL_STRING_VIEW -DBOOST_ASIO_DISABLE_STD_STRING_VIEW -DBOOST_ERROR_CODE_HEADER_ONLY -DHAVE_CONFIG_H -DUHD_LOG_CONSOLE_COLOR -DUHD_LOG_CONSOLE_LEVEL=2 -DUHD_LOG_FILE_LEVEL=2 -DUHD_LOG_MIN_LEVEL=1 -I/tmp/B.psmyb8l9/BUILD/uhd-4.1.0.1/build-host/include -I/tmp/B.psmyb8l9/BUILD/uhd-4.1.0.1/host/include -I/usr/include/libusb-1.0 -I/tmp/B.psmyb8l9/BUILD/uhd-4.1.0.1/host/utils/../lib/include -I/tmp/B.psmyb8l9/BUILD/uhd-4.1.0.1/host/utils/../lib/usrp/b200 -I/tmp/B.psmyb8l9/BUILD/uhd-4.1.0.1/host/utils/../lib/usrp/common -I/tmp/B.psmyb8l9/BUILD/uhd-4.1.0.1/host/utils/../lib/usrp/common/ad9361_driver -I/tmp/B.psmyb8l9/BUILD/uhd-4.1.0.1/host/utils/latency/include -I/tmp/B.psmyb8l9/BUILD/uhd-4.1.0.1/build-host/_cmrc/include  -fvisibility=hidden -fvisibility-inlines-hidden -O2 -fwrapv -pipe -Wformat -Werror=format-security -gdwarf-4 -fno-debug-types-section -fvar-tracking-assignments -g2 -Wp,-D_FORTIFY_SOURCE=2 -fstack-protector-strong --param=ssp-buffer-size=4 -Werror=trampolines -fomit-frame-pointer -march=i686 -fasynchronous-unwind-tables -mtune=pentium4 -gdwarf-4 -fno-debug-types-section -fvar-tracking-assignments -g2  -DNDEBUG -DQT_NO_DEBUG   -Wall -Wextra -Wsign-compare -std=gnu++14 -o CMakeFiles/responder.dir/responder.cpp.o -c /tmp/B.psmyb8l9/BUILD/uhd-4.1.0.1/host/utils/latency/responder.cpp
make[2]: Leaving directory '/tmp/B.psmyb8l9/BUILD/uhd-4.1.0.1/build-host'
make[2]: Entering directory '/tmp/B.psmyb8l9/BUILD/uhd-4.1.0.1/build-host'
[ 99%] Building CXX object python/CMakeFiles/pyuhd.dir/__/lib/device_python.cpp.o
cd /tmp/B.psmyb8l9/BUILD/uhd-4.1.0.1/build-host/python && /usr/bin/i686-pld-linux-g++  -DBOOST_ASIO_DISABLE_STD_EXPERIMENTAL_STRING_VIEW -DBOOST_ASIO_DISABLE_STD_STRING_VIEW -DBOOST_ERROR_CODE_HEADER_ONLY -DHAVE_CONFIG_H -DUHD_LOG_CONSOLE_COLOR -DUHD_LOG_CONSOLE_LEVEL=2 -DUHD_LOG_FILE_LEVEL=2 -DUHD_LOG_MIN_LEVEL=1 -Dpyuhd_EXPORTS -I/tmp/B.psmyb8l9/BUILD/uhd-4.1.0.1/build-host/include -I/tmp/B.psmyb8l9/BUILD/uhd-4.1.0.1/host/include -I/usr/include/python3.9 -I/tmp/B.psmyb8l9/BUILD/uhd-4.1.0.1/host/lib/deps/pybind11/include -I/usr/lib/python3.9/site-packages/numpy/core/include -I/tmp/B.psmyb8l9/BUILD/uhd-4.1.0.1/host/lib -I/tmp/B.psmyb8l9/BUILD/uhd-4.1.0.1/build-host/_cmrc/include  -fvisibility=hidden -fvisibility-inlines-hidden -O2 -fwrapv -pipe -Wformat -Werror=format-security -gdwarf-4 -fno-debug-types-section -fvar-tracking-assignments -g2 -Wp,-D_FORTIFY_SOURCE=2 -fstack-protector-strong --param=ssp-buffer-size=4 -Werror=trampolines -fomit-frame-pointer -march=i686 -fasynchronous-unwind-tables -mtune=pentium4 -gdwarf-4 -fno-debug-types-section -fvar-tracking-assignments -g2  -DNDEBUG -DQT_NO_DEBUG -fPIC   -Wall -Wextra -Wsign-compare -std=gnu++14 -o CMakeFiles/pyuhd.dir/__/lib/device_python.cpp.o -c /tmp/B.psmyb8l9/BUILD/uhd-4.1.0.1/host/lib/device_python.cpp
In file included from /usr/include/python3.9/pybind11/cast.h:16,
                 from /usr/include/python3.9/pybind11/attr.h:13,
                 from /usr/include/python3.9/pybind11/pybind11.h:44,
                 from /usr/include/python3.9/pybind11/complex.h:12,
                 from /tmp/B.psmyb8l9/BUILD/uhd-4.1.0.1/host/lib/device_python.cpp:7:
/usr/include/python3.9/pybind11/detail/internals.h: In function 'pybind11::detail::internals& pybind11::detail::get_internals()':
/usr/include/python3.9/pybind11/detail/internals.h:276:27: warning: 'void PyEval_InitThreads()' is deprecated [-Wdeprecated-declarations]
  276 |         PyEval_InitThreads();
      |         ~~~~~~~~~~~~~~~~~~^~
In file included from /usr/include/python3.9/Python.h:141,
                 from /usr/include/python3.9/pybind11/detail/common.h:112,
                 from /usr/include/python3.9/pybind11/pytypes.h:12,
                 from /usr/include/python3.9/pybind11/cast.h:13,
                 from /usr/include/python3.9/pybind11/attr.h:13,
                 from /usr/include/python3.9/pybind11/pybind11.h:44,
                 from /usr/include/python3.9/pybind11/complex.h:12,
                 from /tmp/B.psmyb8l9/BUILD/uhd-4.1.0.1/host/lib/device_python.cpp:7:
/usr/include/python3.9/ceval.h:130:37: note: declared here
  130 | Py_DEPRECATED(3.9) PyAPI_FUNC(void) PyEval_InitThreads(void);
      |                                     ^~~~~~~~~~~~~~~~~~
make[2]: Leaving directory '/tmp/B.psmyb8l9/BUILD/uhd-4.1.0.1/build-host'
make[2]: Entering directory '/tmp/B.psmyb8l9/BUILD/uhd-4.1.0.1/build-host'
[ 98%] Building CXX object utils/latency/CMakeFiles/responder.dir/lib/Responder.cpp.o
cd /tmp/B.psmyb8l9/BUILD/uhd-4.1.0.1/build-host/utils/latency && /usr/bin/i686-pld-linux-g++  -DBOOST_ASIO_DISABLE_STD_EXPERIMENTAL_STRING_VIEW -DBOOST_ASIO_DISABLE_STD_STRING_VIEW -DBOOST_ERROR_CODE_HEADER_ONLY -DHAVE_CONFIG_H -DUHD_LOG_CONSOLE_COLOR -DUHD_LOG_CONSOLE_LEVEL=2 -DUHD_LOG_FILE_LEVEL=2 -DUHD_LOG_MIN_LEVEL=1 -I/tmp/B.psmyb8l9/BUILD/uhd-4.1.0.1/build-host/include -I/tmp/B.psmyb8l9/BUILD/uhd-4.1.0.1/host/include -I/usr/include/libusb-1.0 -I/tmp/B.psmyb8l9/BUILD/uhd-4.1.0.1/host/utils/../lib/include -I/tmp/B.psmyb8l9/BUILD/uhd-4.1.0.1/host/utils/../lib/usrp/b200 -I/tmp/B.psmyb8l9/BUILD/uhd-4.1.0.1/host/utils/../lib/usrp/common -I/tmp/B.psmyb8l9/BUILD/uhd-4.1.0.1/host/utils/../lib/usrp/common/ad9361_driver -I/tmp/B.psmyb8l9/BUILD/uhd-4.1.0.1/host/utils/latency/include -I/tmp/B.psmyb8l9/BUILD/uhd-4.1.0.1/build-host/_cmrc/include  -fvisibility=hidden -fvisibility-inlines-hidden -O2 -fwrapv -pipe -Wformat -Werror=format-security -gdwarf-4 -fno-debug-types-section -fvar-tracking-assignments -g2 -Wp,-D_FORTIFY_SOURCE=2 -fstack-protector-strong --param=ssp-buffer-size=4 -Werror=trampolines -fomit-frame-pointer -march=i686 -fasynchronous-unwind-tables -mtune=pentium4 -gdwarf-4 -fno-debug-types-section -fvar-tracking-assignments -g2  -DNDEBUG -DQT_NO_DEBUG   -Wall -Wextra -Wsign-compare -std=gnu++14 -o CMakeFiles/responder.dir/lib/Responder.cpp.o -c /tmp/B.psmyb8l9/BUILD/uhd-4.1.0.1/host/utils/latency/lib/Responder.cpp
/tmp/B.psmyb8l9/BUILD/uhd-4.1.0.1/host/utils/latency/lib/Responder.cpp: In member function 'void Responder::FLUSH_SCREEN()':
/tmp/B.psmyb8l9/BUILD/uhd-4.1.0.1/host/utils/latency/lib/Responder.cpp:59:11: error: format not a string literal and no format arguments [-Werror=format-security]
   59 |     printw(_ss.str().c_str());
      |     ~~~~~~^~~~~~~~~~~~~~~~~~~
cc1plus: some warnings being treated as errors
make[2]: *** [utils/latency/CMakeFiles/responder.dir/build.make:99: utils/latency/CMakeFiles/responder.dir/lib/Responder.cpp.o] Error 1
make[2]: Leaving directory '/tmp/B.psmyb8l9/BUILD/uhd-4.1.0.1/build-host'
make[1]: *** [CMakeFiles/Makefile2:2279: utils/latency/CMakeFiles/responder.dir/all] Error 2
make[1]: *** Waiting for unfinished jobs....
make[2]: Entering directory '/tmp/B.psmyb8l9/BUILD/uhd-4.1.0.1/build-host'
[ 99%] Building CXX object python/CMakeFiles/pyuhd.dir/__/lib/property_tree_python.cpp.o
cd /tmp/B.psmyb8l9/BUILD/uhd-4.1.0.1/build-host/python && /usr/bin/i686-pld-linux-g++  -DBOOST_ASIO_DISABLE_STD_EXPERIMENTAL_STRING_VIEW -DBOOST_ASIO_DISABLE_STD_STRING_VIEW -DBOOST_ERROR_CODE_HEADER_ONLY -DHAVE_CONFIG_H -DUHD_LOG_CONSOLE_COLOR -DUHD_LOG_CONSOLE_LEVEL=2 -DUHD_LOG_FILE_LEVEL=2 -DUHD_LOG_MIN_LEVEL=1 -Dpyuhd_EXPORTS -I/tmp/B.psmyb8l9/BUILD/uhd-4.1.0.1/build-host/include -I/tmp/B.psmyb8l9/BUILD/uhd-4.1.0.1/host/include -I/usr/include/python3.9 -I/tmp/B.psmyb8l9/BUILD/uhd-4.1.0.1/host/lib/deps/pybind11/include -I/usr/lib/python3.9/site-packages/numpy/core/include -I/tmp/B.psmyb8l9/BUILD/uhd-4.1.0.1/host/lib -I/tmp/B.psmyb8l9/BUILD/uhd-4.1.0.1/build-host/_cmrc/include  -fvisibility=hidden -fvisibility-inlines-hidden -O2 -fwrapv -pipe -Wformat -Werror=format-security -gdwarf-4 -fno-debug-types-section -fvar-tracking-assignments -g2 -Wp,-D_FORTIFY_SOURCE=2 -fstack-protector-strong --param=ssp-buffer-size=4 -Werror=trampolines -fomit-frame-pointer -march=i686 -fasynchronous-unwind-tables -mtune=pentium4 -gdwarf-4 -fno-debug-types-section -fvar-tracking-assignments -g2  -DNDEBUG -DQT_NO_DEBUG -fPIC   -Wall -Wextra -Wsign-compare -std=gnu++14 -o CMakeFiles/pyuhd.dir/__/lib/property_tree_python.cpp.o -c /tmp/B.psmyb8l9/BUILD/uhd-4.1.0.1/host/lib/property_tree_python.cpp
In file included from /usr/include/python3.9/pybind11/cast.h:16,
                 from /usr/include/python3.9/pybind11/attr.h:13,
                 from /usr/include/python3.9/pybind11/pybind11.h:44,
                 from /tmp/B.psmyb8l9/BUILD/uhd-4.1.0.1/host/lib/property_tree_python.hpp:9,
                 from /tmp/B.psmyb8l9/BUILD/uhd-4.1.0.1/host/lib/property_tree_python.cpp:7:
/usr/include/python3.9/pybind11/detail/internals.h: In function 'pybind11::detail::internals& pybind11::detail::get_internals()':
/usr/include/python3.9/pybind11/detail/internals.h:276:27: warning: 'void PyEval_InitThreads()' is deprecated [-Wdeprecated-declarations]
  276 |         PyEval_InitThreads();
      |         ~~~~~~~~~~~~~~~~~~^~
In file included from /usr/include/python3.9/Python.h:141,
                 from /usr/include/python3.9/pybind11/detail/common.h:112,
                 from /usr/include/python3.9/pybind11/pytypes.h:12,
                 from /usr/include/python3.9/pybind11/cast.h:13,
                 from /usr/include/python3.9/pybind11/attr.h:13,
                 from /usr/include/python3.9/pybind11/pybind11.h:44,
                 from /tmp/B.psmyb8l9/BUILD/uhd-4.1.0.1/host/lib/property_tree_python.hpp:9,
                 from /tmp/B.psmyb8l9/BUILD/uhd-4.1.0.1/host/lib/property_tree_python.cpp:7:
/usr/include/python3.9/ceval.h:130:37: note: declared here
  130 | Py_DEPRECATED(3.9) PyAPI_FUNC(void) PyEval_InitThreads(void);
      |                                     ^~~~~~~~~~~~~~~~~~
make[2]: Leaving directory '/tmp/B.psmyb8l9/BUILD/uhd-4.1.0.1/build-host'
make[2]: Entering directory '/tmp/B.psmyb8l9/BUILD/uhd-4.1.0.1/build-host'
[100%] Building CXX object python/CMakeFiles/pyuhd.dir/__/lib/usrp/multi_usrp_python.cpp.o
cd /tmp/B.psmyb8l9/BUILD/uhd-4.1.0.1/build-host/python && /usr/bin/i686-pld-linux-g++  -DBOOST_ASIO_DISABLE_STD_EXPERIMENTAL_STRING_VIEW -DBOOST_ASIO_DISABLE_STD_STRING_VIEW -DBOOST_ERROR_CODE_HEADER_ONLY -DHAVE_CONFIG_H -DUHD_LOG_CONSOLE_COLOR -DUHD_LOG_CONSOLE_LEVEL=2 -DUHD_LOG_FILE_LEVEL=2 -DUHD_LOG_MIN_LEVEL=1 -Dpyuhd_EXPORTS -I/tmp/B.psmyb8l9/BUILD/uhd-4.1.0.1/build-host/include -I/tmp/B.psmyb8l9/BUILD/uhd-4.1.0.1/host/include -I/usr/include/python3.9 -I/tmp/B.psmyb8l9/BUILD/uhd-4.1.0.1/host/lib/deps/pybind11/include -I/usr/lib/python3.9/site-packages/numpy/core/include -I/tmp/B.psmyb8l9/BUILD/uhd-4.1.0.1/host/lib -I/tmp/B.psmyb8l9/BUILD/uhd-4.1.0.1/build-host/_cmrc/include  -fvisibility=hidden -fvisibility-inlines-hidden -O2 -fwrapv -pipe -Wformat -Werror=format-security -gdwarf-4 -fno-debug-types-section -fvar-tracking-assignments -g2 -Wp,-D_FORTIFY_SOURCE=2 -fstack-protector-strong --param=ssp-buffer-size=4 -Werror=trampolines -fomit-frame-pointer -march=i686 -fasynchronous-unwind-tables -mtune=pentium4 -gdwarf-4 -fno-debug-types-section -fvar-tracking-assignments -g2  -DNDEBUG -DQT_NO_DEBUG -fPIC   -Wall -Wextra -Wsign-compare -std=gnu++14 -o CMakeFiles/pyuhd.dir/__/lib/usrp/multi_usrp_python.cpp.o -c /tmp/B.psmyb8l9/BUILD/uhd-4.1.0.1/host/lib/usrp/multi_usrp_python.cpp
In file included from /usr/include/python3.9/pybind11/cast.h:16,
                 from /usr/include/python3.9/pybind11/attr.h:13,
                 from /usr/include/python3.9/pybind11/pybind11.h:44,
                 from /usr/include/python3.9/pybind11/complex.h:12,
                 from /tmp/B.psmyb8l9/BUILD/uhd-4.1.0.1/host/lib/usrp/multi_usrp_python.cpp:8:
/usr/include/python3.9/pybind11/detail/internals.h: In function 'pybind11::detail::internals& pybind11::detail::get_internals()':
/usr/include/python3.9/pybind11/detail/internals.h:276:27: warning: 'void PyEval_InitThreads()' is deprecated [-Wdeprecated-declarations]
  276 |         PyEval_InitThreads();
      |         ~~~~~~~~~~~~~~~~~~^~
In file included from /usr/include/python3.9/Python.h:141,
                 from /usr/include/python3.9/pybind11/detail/common.h:112,
                 from /usr/include/python3.9/pybind11/pytypes.h:12,
                 from /usr/include/python3.9/pybind11/cast.h:13,
                 from /usr/include/python3.9/pybind11/attr.h:13,
                 from /usr/include/python3.9/pybind11/pybind11.h:44,
                 from /usr/include/python3.9/pybind11/complex.h:12,
                 from /tmp/B.psmyb8l9/BUILD/uhd-4.1.0.1/host/lib/usrp/multi_usrp_python.cpp:8:
/usr/include/python3.9/ceval.h:130:37: note: declared here
  130 | Py_DEPRECATED(3.9) PyAPI_FUNC(void) PyEval_InitThreads(void);
      |                                     ^~~~~~~~~~~~~~~~~~
make[2]: Leaving directory '/tmp/B.psmyb8l9/BUILD/uhd-4.1.0.1/build-host'
make[2]: Entering directory '/tmp/B.psmyb8l9/BUILD/uhd-4.1.0.1/build-host'
[ 98%] Building CXX object python/CMakeFiles/pyuhd.dir/pyuhd.cpp.o
cd /tmp/B.psmyb8l9/BUILD/uhd-4.1.0.1/build-host/python && /usr/bin/i686-pld-linux-g++  -DBOOST_ASIO_DISABLE_STD_EXPERIMENTAL_STRING_VIEW -DBOOST_ASIO_DISABLE_STD_STRING_VIEW -DBOOST_ERROR_CODE_HEADER_ONLY -DHAVE_CONFIG_H -DUHD_LOG_CONSOLE_COLOR -DUHD_LOG_CONSOLE_LEVEL=2 -DUHD_LOG_FILE_LEVEL=2 -DUHD_LOG_MIN_LEVEL=1 -Dpyuhd_EXPORTS -I/tmp/B.psmyb8l9/BUILD/uhd-4.1.0.1/build-host/include -I/tmp/B.psmyb8l9/BUILD/uhd-4.1.0.1/host/include -I/usr/include/python3.9 -I/tmp/B.psmyb8l9/BUILD/uhd-4.1.0.1/host/lib/deps/pybind11/include -I/usr/lib/python3.9/site-packages/numpy/core/include -I/tmp/B.psmyb8l9/BUILD/uhd-4.1.0.1/host/lib -I/tmp/B.psmyb8l9/BUILD/uhd-4.1.0.1/build-host/_cmrc/include  -fvisibility=hidden -fvisibility-inlines-hidden -O2 -fwrapv -pipe -Wformat -Werror=format-security -gdwarf-4 -fno-debug-types-section -fvar-tracking-assignments -g2 -Wp,-D_FORTIFY_SOURCE=2 -fstack-protector-strong --param=ssp-buffer-size=4 -Werror=trampolines -fomit-frame-pointer -march=i686 -fasynchronous-unwind-tables -mtune=pentium4 -gdwarf-4 -fno-debug-types-section -fvar-tracking-assignments -g2  -DNDEBUG -DQT_NO_DEBUG -fPIC   -Wall -Wextra -Wsign-compare -std=gnu++14 -o CMakeFiles/pyuhd.dir/pyuhd.cpp.o -c /tmp/B.psmyb8l9/BUILD/uhd-4.1.0.1/host/python/pyuhd.cpp
In file included from /usr/include/python3.9/pybind11/cast.h:16,
                 from /usr/include/python3.9/pybind11/attr.h:13,
                 from /usr/include/python3.9/pybind11/pybind11.h:44,
                 from /usr/include/python3.9/pybind11/complex.h:12,
                 from /tmp/B.psmyb8l9/BUILD/uhd-4.1.0.1/host/python/pyuhd.cpp:8:
/usr/include/python3.9/pybind11/detail/internals.h: In function 'pybind11::detail::internals& pybind11::detail::get_internals()':
/usr/include/python3.9/pybind11/detail/internals.h:276:27: warning: 'void PyEval_InitThreads()' is deprecated [-Wdeprecated-declarations]
  276 |         PyEval_InitThreads();
      |         ~~~~~~~~~~~~~~~~~~^~
In file included from /usr/include/python3.9/Python.h:141,
                 from /usr/include/python3.9/pybind11/detail/common.h:112,
                 from /usr/include/python3.9/pybind11/pytypes.h:12,
                 from /usr/include/python3.9/pybind11/cast.h:13,
                 from /usr/include/python3.9/pybind11/attr.h:13,
                 from /usr/include/python3.9/pybind11/pybind11.h:44,
                 from /usr/include/python3.9/pybind11/complex.h:12,
                 from /tmp/B.psmyb8l9/BUILD/uhd-4.1.0.1/host/python/pyuhd.cpp:8:
/usr/include/python3.9/ceval.h:130:37: note: declared here
  130 | Py_DEPRECATED(3.9) PyAPI_FUNC(void) PyEval_InitThreads(void);
      |                                     ^~~~~~~~~~~~~~~~~~
make[2]: Leaving directory '/tmp/B.psmyb8l9/BUILD/uhd-4.1.0.1/build-host'
make[2]: Entering directory '/tmp/B.psmyb8l9/BUILD/uhd-4.1.0.1/build-host'
[100%] Linking CXX shared library libpyuhd.cpython-39-i386-linux-gnu.so
cd /tmp/B.psmyb8l9/BUILD/uhd-4.1.0.1/build-host/python && /usr/bin/cmake -E cmake_link_script CMakeFiles/pyuhd.dir/link.txt --verbose=1
/usr/bin/i686-pld-linux-g++ -fPIC  -fvisibility=hidden -fvisibility-inlines-hidden -O2 -fwrapv -pipe -Wformat -Werror=format-security -gdwarf-4 -fno-debug-types-section -fvar-tracking-assignments -g2 -Wp,-D_FORTIFY_SOURCE=2 -fstack-protector-strong --param=ssp-buffer-size=4 -Werror=trampolines -fomit-frame-pointer -march=i686 -fasynchronous-unwind-tables -mtune=pentium4 -gdwarf-4 -fno-debug-types-section -fvar-tracking-assignments -g2  -DNDEBUG -DQT_NO_DEBUG -Wl,--as-needed -Wl,--no-copy-dt-needed-entries -Wl,-z,relro -Wl,-z,combreloc -shared -Wl,-soname,libpyuhd.cpython-39-i386-linux-gnu.so -o libpyuhd.cpython-39-i386-linux-gnu.so CMakeFiles/pyuhd.dir/pyuhd.cpp.o CMakeFiles/pyuhd.dir/__/lib/property_tree_python.cpp.o CMakeFiles/pyuhd.dir/__/lib/device_python.cpp.o CMakeFiles/pyuhd.dir/__/lib/usrp/multi_usrp_python.cpp.o  -Wl,-rpath,/tmp/B.psmyb8l9/BUILD/uhd-4.1.0.1/build-host/lib: /usr/lib/libboost_chrono.so /usr/lib/libboost_date_time.so /usr/lib/libboost_filesystem.so /usr/lib/libboost_program_options.so /usr/lib/libboost_serialization.so /usr/lib/libboost_thread.so /usr/lib/libboost_unit_test_framework.so /usr/lib/libboost_system.so /usr/lib/libboost_atomic.so ../lib/libuhd.so.4.1.0 /usr/lib/libboost_chrono.so /usr/lib/libboost_date_time.so /usr/lib/libboost_filesystem.so /usr/lib/libboost_program_options.so /usr/lib/libboost_serialization.so /usr/lib/libboost_thread.so /usr/lib/libboost_unit_test_framework.so /usr/lib/libboost_system.so /usr/lib/libboost_atomic.so -lpthread -ldl /usr/lib/libusb-1.0.so ../lib/rc/libuhd-resources.a /usr/lib/libpython3.9.so 
cd /tmp/B.psmyb8l9/BUILD/uhd-4.1.0.1/build-host/python && /usr/bin/cmake -E copy /tmp/B.psmyb8l9/BUILD/uhd-4.1.0.1/build-host/python/libpyuhd.cpython-39-i386-linux-gnu.so /tmp/B.psmyb8l9/BUILD/uhd-4.1.0.1/build-host/python/uhd/libpyuhd.cpython-39-i386-linux-gnu.so
make[2]: Leaving directory '/tmp/B.psmyb8l9/BUILD/uhd-4.1.0.1/build-host'
make[1]: Entering directory '/tmp/B.psmyb8l9/BUILD/uhd-4.1.0.1/build-host'
[100%] Built target pyuhd
make[1]: Leaving directory '/tmp/B.psmyb8l9/BUILD/uhd-4.1.0.1/build-host'
make: *** [Makefile:186: all] Error 2
error: Bad exit status from /tmp/B.psmyb8l9/BUILD/tmp/rpm-tmp.Oz1UYo (%build)


RPM build errors:
    Could not canonicalize hostname: nereid
    Bad exit status from /tmp/B.psmyb8l9/BUILD/tmp/rpm-tmp.Oz1UYo (%build)
ended at: Fri Jan 14 23:10:21 2022, done in 0:09:05.711644
error: No files produced.
+ chmod -R u+rwX /tmp/B.psmyb8l9/BUILD
+ rm -rf /tmp/B.psmyb8l9/tmp /tmp/B.psmyb8l9/BUILD
+ rm -rf /tmp/B.psmyb8l9
Begin-PLD-Builder-Info
Build-Time: user:3288.75s sys:166.49s real:550.49s (faults io:159 non-io:29056563)

End-PLD-Builder-Info
[Back to list of logs] [View rpm -qa of builder]