FailedOk

th/SRPMS[OK]
th/x32[OK]
th/i686[OK]
th/x86_64[OK]

ac/SRPMS[OK]
ac/i386[OK]
ac/i586[OK]
ac/i686[OK]
ac/alpha[OK]
ac/amd64[OK]
ac/athlon[OK]
ac/ppc[OK]
ac/sparc[OK]
ac/sparc64[OK]

Advanced Search
main()
Powered by PLD Linux
(c) 2002-2021 PLD Team
$Revision: 1.37 $
Powered by PDP-11.
Your IP: 44.192.254.246

wget 03b5a3b8-6c76-4abf-b318-be68f7530456

Status:Failed
Source URL:https://buildlogs.pld-linux.org/pld/th/i686/FAIL/wget,03b5a3b8-6c76-4abf-b318-be68f7530456.bz2
text/plain URL:View!
full text:View!
rpm -qa of builder:View!
Date:2021/09/10 01:46:55
Runtime:0:01:26.770010

Toc:

  • error 1
  • # XFAIL: 0
  • error 2
  • # FAIL: 0
  • error 3
  • # ERROR: 0
  • error 4
  • # XFAIL: 0
  • error 5
  • # FAIL: 0
  • error 6
  • # ERROR: 0
  • error 7
  • FAIL: Test-metalink-http-xml.py
  • error 8
  • FAIL: Test-metalink-http-xml-trust.py
  • error 9
  • FAIL: Test-metalink-http-xml-trust-name.py
  • error 10
  • FAIL: Test-metalink-http-xml-type.py
  • error 11
  • FAIL: Test-metalink-http-xml-type-trust.py
  • error 12
  • FAIL: Test-metalink-http-xml-type-content.py
  • error 13
  • FAIL: Test-metalink-xml.py
  • error 14
  • FAIL: Test-metalink-xml-continue.py
  • error 15
  • FAIL: Test-metalink-xml-relpath.py
  • error 16
  • FAIL: Test-metalink-xml-abspath.py
  • error 17
  • FAIL: Test-metalink-xml-homepath.py
  • error 18
  • FAIL: Test-metalink-xml-trust.py
  • error 19
  • FAIL: Test-metalink-http-xml-type-trust-content.py
  • error 20
  • FAIL: Test-metalink-xml-relpath-trust.py
  • error 21
  • FAIL: Test-metalink-xml-abspath-trust.py
  • error 22
  • FAIL: Test-metalink-xml-homepath-trust.py
  • error 23
  • FAIL: Test-metalink-xml-prefix.py
  • error 24
  • FAIL: Test-metalink-xml-relprefix.py
  • error 25
  • FAIL: Test-metalink-xml-absprefix.py
  • error 26
  • FAIL: Test-metalink-xml-homeprefix.py
  • error 27
  • FAIL: Test-metalink-xml-prefix-trust.py
  • error 28
  • FAIL: Test-metalink-xml-relprefix-trust.py
  • error 29
  • FAIL: Test-metalink-xml-absprefix-trust.py
  • error 30
  • FAIL: Test-metalink-xml-homeprefix-trust.py
  • error 31
  • FAIL: Test-metalink-xml-emptyprefix-trust.py
  • error 32
  • FAIL: Test-metalink-xml-size.py
  • error 33
  • FAIL: Test-metalink-xml-nohash.py
  • error 34
  • FAIL: Test-metalink-xml-nourls.py
  • error 35
  • FAIL: Test-metalink-xml-urlbreak.py
  • error 36
  • # XFAIL: 0
  • error 37
  • # FAIL: 29
  • error 38
  • # ERROR: 0
  • error 39
  • make[4]: *** [Makefile:1916: test-suite.log] Error 1
  • error 40
  • make[3]: *** [Makefile:2024: check-TESTS] Error 2
  • error 41
  • make[2]: *** [Makefile:2090: check-am] Error 2
  • error 42
  • make[1]: *** [Makefile:1732: check-recursive] Error 1
  • error 43
  • error: Bad exit status from /tmp/B.1vm42abv/BUILD/tmp/rpm-tmp.lPoQqR (%build)
  • error 44
  • RPM build errors:
  • error 45
  • error: No files produced.

Content:

make[3]: Leaving directory '/tmp/B.1vm42abv/BUILD/wget-1.21.2/fuzz'
make[3]: Entering directory '/tmp/B.1vm42abv/BUILD/wget-1.21.2/fuzz'
i686-pld-linux-gcc    -D_FILE_OFFSET_BITS=64    -DHAVE_LIBSSL   -DNDEBUG -O2 -fwrapv -pipe -Wformat -Werror=format-security -gdwarf-4 -fno-debug-types-section -fvar-tracking-assignments -g2 -Wp,-D_FORTIFY_SOURCE=2 -fstack-protector-strong --param=ssp-buffer-size=4 -Werror=trampolines -fomit-frame-pointer -march=i686 -fasynchronous-unwind-tables -mtune=pentium4 -gdwarf-4 -fno-debug-types-section -fvar-tracking-assignments -g2   -Wl,--as-needed -Wl,--no-copy-dt-needed-entries -Wl,-z,relro -Wl,-z,combreloc  -o wget_robots_fuzzer wget_robots_fuzzer.o main.o ../src/libunittest.a ../lib/libgnu.a                      -lmetalink -lpcre2-8 -luuid -lidn2 -lssl -lcrypto -lz -lpsl  -lgpgme -lassuan -lgpg-error
make[3]: Leaving directory '/tmp/B.1vm42abv/BUILD/wget-1.21.2/fuzz'
make[3]: Entering directory '/tmp/B.1vm42abv/BUILD/wget-1.21.2/fuzz'
i686-pld-linux-gcc    -D_FILE_OFFSET_BITS=64    -DHAVE_LIBSSL   -DNDEBUG -O2 -fwrapv -pipe -Wformat -Werror=format-security -gdwarf-4 -fno-debug-types-section -fvar-tracking-assignments -g2 -Wp,-D_FORTIFY_SOURCE=2 -fstack-protector-strong --param=ssp-buffer-size=4 -Werror=trampolines -fomit-frame-pointer -march=i686 -fasynchronous-unwind-tables -mtune=pentium4 -gdwarf-4 -fno-debug-types-section -fvar-tracking-assignments -g2   -Wl,--as-needed -Wl,--no-copy-dt-needed-entries -Wl,-z,relro -Wl,-z,combreloc  -o wget_netrc_fuzzer wget_netrc_fuzzer.o main.o ../src/libunittest.a ../lib/libgnu.a                      -lmetalink -lpcre2-8 -luuid -lidn2 -lssl -lcrypto -lz -lpsl  -lgpgme -lassuan -lgpg-error
make[3]: Leaving directory '/tmp/B.1vm42abv/BUILD/wget-1.21.2/fuzz'
make[3]: Entering directory '/tmp/B.1vm42abv/BUILD/wget-1.21.2/fuzz'
i686-pld-linux-gcc    -D_FILE_OFFSET_BITS=64    -DHAVE_LIBSSL   -DNDEBUG -O2 -fwrapv -pipe -Wformat -Werror=format-security -gdwarf-4 -fno-debug-types-section -fvar-tracking-assignments -g2 -Wp,-D_FORTIFY_SOURCE=2 -fstack-protector-strong --param=ssp-buffer-size=4 -Werror=trampolines -fomit-frame-pointer -march=i686 -fasynchronous-unwind-tables -mtune=pentium4 -gdwarf-4 -fno-debug-types-section -fvar-tracking-assignments -g2   -Wl,--as-needed -Wl,--no-copy-dt-needed-entries -Wl,-z,relro -Wl,-z,combreloc  -o wget_options_fuzzer wget_options_fuzzer.o main.o ../src/libunittest.a ../lib/libgnu.a                      -lmetalink -lpcre2-8 -luuid -lidn2 -lssl -lcrypto -lz -lpsl  -lgpgme -lassuan -lgpg-error
make[3]: Leaving directory '/tmp/B.1vm42abv/BUILD/wget-1.21.2/fuzz'
make[3]: Entering directory '/tmp/B.1vm42abv/BUILD/wget-1.21.2/fuzz'
i686-pld-linux-gcc    -D_FILE_OFFSET_BITS=64    -DHAVE_LIBSSL   -DNDEBUG -O2 -fwrapv -pipe -Wformat -Werror=format-security -gdwarf-4 -fno-debug-types-section -fvar-tracking-assignments -g2 -Wp,-D_FORTIFY_SOURCE=2 -fstack-protector-strong --param=ssp-buffer-size=4 -Werror=trampolines -fomit-frame-pointer -march=i686 -fasynchronous-unwind-tables -mtune=pentium4 -gdwarf-4 -fno-debug-types-section -fvar-tracking-assignments -g2   -Wl,--as-needed -Wl,--no-copy-dt-needed-entries -Wl,-z,relro -Wl,-z,combreloc  -o wget_html_fuzzer wget_html_fuzzer.o main.o ../src/libunittest.a ../lib/libgnu.a                      -lmetalink -lpcre2-8 -luuid -lidn2 -lssl -lcrypto -lz -lpsl  -lgpgme -lassuan -lgpg-error
make[3]: Leaving directory '/tmp/B.1vm42abv/BUILD/wget-1.21.2/fuzz'
make[3]: Entering directory '/tmp/B.1vm42abv/BUILD/wget-1.21.2/fuzz'
i686-pld-linux-gcc    -D_FILE_OFFSET_BITS=64    -DHAVE_LIBSSL   -DNDEBUG -O2 -fwrapv -pipe -Wformat -Werror=format-security -gdwarf-4 -fno-debug-types-section -fvar-tracking-assignments -g2 -Wp,-D_FORTIFY_SOURCE=2 -fstack-protector-strong --param=ssp-buffer-size=4 -Werror=trampolines -fomit-frame-pointer -march=i686 -fasynchronous-unwind-tables -mtune=pentium4 -gdwarf-4 -fno-debug-types-section -fvar-tracking-assignments -g2   -Wl,--as-needed -Wl,--no-copy-dt-needed-entries -Wl,-z,relro -Wl,-z,combreloc  -o wget_css_fuzzer wget_css_fuzzer.o main.o ../src/libunittest.a ../lib/libgnu.a                      -lmetalink -lpcre2-8 -luuid -lidn2 -lssl -lcrypto -lz -lpsl  -lgpgme -lassuan -lgpg-error
make[3]: Leaving directory '/tmp/B.1vm42abv/BUILD/wget-1.21.2/fuzz'
make[3]: Entering directory '/tmp/B.1vm42abv/BUILD/wget-1.21.2/fuzz'
i686-pld-linux-gcc    -D_FILE_OFFSET_BITS=64    -DHAVE_LIBSSL   -DNDEBUG -O2 -fwrapv -pipe -Wformat -Werror=format-security -gdwarf-4 -fno-debug-types-section -fvar-tracking-assignments -g2 -Wp,-D_FORTIFY_SOURCE=2 -fstack-protector-strong --param=ssp-buffer-size=4 -Werror=trampolines -fomit-frame-pointer -march=i686 -fasynchronous-unwind-tables -mtune=pentium4 -gdwarf-4 -fno-debug-types-section -fvar-tracking-assignments -g2   -Wl,--as-needed -Wl,--no-copy-dt-needed-entries -Wl,-z,relro -Wl,-z,combreloc  -o wget_read_hunk_fuzzer wget_read_hunk_fuzzer.o main.o ../src/libunittest.a ../lib/libgnu.a                      -lmetalink -lpcre2-8 -luuid -lidn2 -lssl -lcrypto -lz -lpsl  -lgpgme -lassuan -lgpg-error
make[3]: Leaving directory '/tmp/B.1vm42abv/BUILD/wget-1.21.2/fuzz'
make[3]: Entering directory '/tmp/B.1vm42abv/BUILD/wget-1.21.2/fuzz'
i686-pld-linux-gcc    -D_FILE_OFFSET_BITS=64    -DHAVE_LIBSSL   -DNDEBUG -O2 -fwrapv -pipe -Wformat -Werror=format-security -gdwarf-4 -fno-debug-types-section -fvar-tracking-assignments -g2 -Wp,-D_FORTIFY_SOURCE=2 -fstack-protector-strong --param=ssp-buffer-size=4 -Werror=trampolines -fomit-frame-pointer -march=i686 -fasynchronous-unwind-tables -mtune=pentium4 -gdwarf-4 -fno-debug-types-section -fvar-tracking-assignments -g2   -Wl,--as-needed -Wl,--no-copy-dt-needed-entries -Wl,-z,relro -Wl,-z,combreloc  -o wget_ntlm_fuzzer wget_ntlm_fuzzer.o main.o ../src/libunittest.a ../lib/libgnu.a                      -lmetalink -lpcre2-8 -luuid -lidn2 -lssl -lcrypto -lz -lpsl  -lgpgme -lassuan -lgpg-error
make[3]: Leaving directory '/tmp/B.1vm42abv/BUILD/wget-1.21.2/fuzz'
make[3]: Entering directory '/tmp/B.1vm42abv/BUILD/wget-1.21.2/fuzz'
i686-pld-linux-gcc    -D_FILE_OFFSET_BITS=64    -DHAVE_LIBSSL   -DNDEBUG -O2 -fwrapv -pipe -Wformat -Werror=format-security -gdwarf-4 -fno-debug-types-section -fvar-tracking-assignments -g2 -Wp,-D_FORTIFY_SOURCE=2 -fstack-protector-strong --param=ssp-buffer-size=4 -Werror=trampolines -fomit-frame-pointer -march=i686 -fasynchronous-unwind-tables -mtune=pentium4 -gdwarf-4 -fno-debug-types-section -fvar-tracking-assignments -g2   -Wl,--as-needed -Wl,--no-copy-dt-needed-entries -Wl,-z,relro -Wl,-z,combreloc  -o wget_url_fuzzer wget_url_fuzzer.o main.o ../src/libunittest.a ../lib/libgnu.a                      -lmetalink -lpcre2-8 -luuid -lidn2 -lssl -lcrypto -lz -lpsl  -lgpgme -lassuan -lgpg-error
make[3]: Leaving directory '/tmp/B.1vm42abv/BUILD/wget-1.21.2/fuzz'
/usr/bin/make  -C ../src libunittest.a
make[4]: Entering directory '/tmp/B.1vm42abv/BUILD/wget-1.21.2/fuzz'
i686-pld-linux-gcc    -D_FILE_OFFSET_BITS=64    -DHAVE_LIBSSL   -DNDEBUG -O2 -fwrapv -pipe -Wformat -Werror=format-security -gdwarf-4 -fno-debug-types-section -fvar-tracking-assignments -g2 -Wp,-D_FORTIFY_SOURCE=2 -fstack-protector-strong --param=ssp-buffer-size=4 -Werror=trampolines -fomit-frame-pointer -march=i686 -fasynchronous-unwind-tables -mtune=pentium4 -gdwarf-4 -fno-debug-types-section -fvar-tracking-assignments -g2   -Wl,--as-needed -Wl,--no-copy-dt-needed-entries -Wl,-z,relro -Wl,-z,combreloc  -o wget_options_fuzzer wget_options_fuzzer.o main.o ../src/libunittest.a ../lib/libgnu.a                      -lmetalink -lpcre2-8 -luuid -lidn2 -lssl -lcrypto -lz -lpsl  -lgpgme -lassuan -lgpg-error
make[4]: Leaving directory '/tmp/B.1vm42abv/BUILD/wget-1.21.2/fuzz'
make[4]: Entering directory '/tmp/B.1vm42abv/BUILD/wget-1.21.2/fuzz'
i686-pld-linux-gcc    -D_FILE_OFFSET_BITS=64    -DHAVE_LIBSSL   -DNDEBUG -O2 -fwrapv -pipe -Wformat -Werror=format-security -gdwarf-4 -fno-debug-types-section -fvar-tracking-assignments -g2 -Wp,-D_FORTIFY_SOURCE=2 -fstack-protector-strong --param=ssp-buffer-size=4 -Werror=trampolines -fomit-frame-pointer -march=i686 -fasynchronous-unwind-tables -mtune=pentium4 -gdwarf-4 -fno-debug-types-section -fvar-tracking-assignments -g2   -Wl,--as-needed -Wl,--no-copy-dt-needed-entries -Wl,-z,relro -Wl,-z,combreloc  -o wget_html_fuzzer wget_html_fuzzer.o main.o ../src/libunittest.a ../lib/libgnu.a                      -lmetalink -lpcre2-8 -luuid -lidn2 -lssl -lcrypto -lz -lpsl  -lgpgme -lassuan -lgpg-error
make[4]: Leaving directory '/tmp/B.1vm42abv/BUILD/wget-1.21.2/fuzz'
make[4]: Entering directory '/tmp/B.1vm42abv/BUILD/wget-1.21.2/fuzz'
i686-pld-linux-gcc    -D_FILE_OFFSET_BITS=64    -DHAVE_LIBSSL   -DNDEBUG -O2 -fwrapv -pipe -Wformat -Werror=format-security -gdwarf-4 -fno-debug-types-section -fvar-tracking-assignments -g2 -Wp,-D_FORTIFY_SOURCE=2 -fstack-protector-strong --param=ssp-buffer-size=4 -Werror=trampolines -fomit-frame-pointer -march=i686 -fasynchronous-unwind-tables -mtune=pentium4 -gdwarf-4 -fno-debug-types-section -fvar-tracking-assignments -g2   -Wl,--as-needed -Wl,--no-copy-dt-needed-entries -Wl,-z,relro -Wl,-z,combreloc  -o wget_ftpls_fuzzer wget_ftpls_fuzzer.o main.o ../src/libunittest.a ../lib/libgnu.a                      -lmetalink -lpcre2-8 -luuid -lidn2 -lssl -lcrypto -lz -lpsl  -lgpgme -lassuan -lgpg-error
make[4]: Leaving directory '/tmp/B.1vm42abv/BUILD/wget-1.21.2/fuzz'
make[4]: Entering directory '/tmp/B.1vm42abv/BUILD/wget-1.21.2/fuzz'
i686-pld-linux-gcc    -D_FILE_OFFSET_BITS=64    -DHAVE_LIBSSL   -DNDEBUG -O2 -fwrapv -pipe -Wformat -Werror=format-security -gdwarf-4 -fno-debug-types-section -fvar-tracking-assignments -g2 -Wp,-D_FORTIFY_SOURCE=2 -fstack-protector-strong --param=ssp-buffer-size=4 -Werror=trampolines -fomit-frame-pointer -march=i686 -fasynchronous-unwind-tables -mtune=pentium4 -gdwarf-4 -fno-debug-types-section -fvar-tracking-assignments -g2   -Wl,--as-needed -Wl,--no-copy-dt-needed-entries -Wl,-z,relro -Wl,-z,combreloc  -o wget_netrc_fuzzer wget_netrc_fuzzer.o main.o ../src/libunittest.a ../lib/libgnu.a                      -lmetalink -lpcre2-8 -luuid -lidn2 -lssl -lcrypto -lz -lpsl  -lgpgme -lassuan -lgpg-error
make[4]: Leaving directory '/tmp/B.1vm42abv/BUILD/wget-1.21.2/fuzz'
make[4]: Entering directory '/tmp/B.1vm42abv/BUILD/wget-1.21.2/fuzz'
i686-pld-linux-gcc    -D_FILE_OFFSET_BITS=64    -DHAVE_LIBSSL   -DNDEBUG -O2 -fwrapv -pipe -Wformat -Werror=format-security -gdwarf-4 -fno-debug-types-section -fvar-tracking-assignments -g2 -Wp,-D_FORTIFY_SOURCE=2 -fstack-protector-strong --param=ssp-buffer-size=4 -Werror=trampolines -fomit-frame-pointer -march=i686 -fasynchronous-unwind-tables -mtune=pentium4 -gdwarf-4 -fno-debug-types-section -fvar-tracking-assignments -g2   -Wl,--as-needed -Wl,--no-copy-dt-needed-entries -Wl,-z,relro -Wl,-z,combreloc  -o wget_progress_fuzzer wget_progress_fuzzer.o main.o ../src/libunittest.a ../lib/libgnu.a                      -lmetalink -lpcre2-8 -luuid -lidn2 -lssl -lcrypto -lz -lpsl  -lgpgme -lassuan -lgpg-error
make[4]: Leaving directory '/tmp/B.1vm42abv/BUILD/wget-1.21.2/fuzz'
make[4]: Entering directory '/tmp/B.1vm42abv/BUILD/wget-1.21.2/fuzz'
i686-pld-linux-gcc    -D_FILE_OFFSET_BITS=64    -DHAVE_LIBSSL   -DNDEBUG -O2 -fwrapv -pipe -Wformat -Werror=format-security -gdwarf-4 -fno-debug-types-section -fvar-tracking-assignments -g2 -Wp,-D_FORTIFY_SOURCE=2 -fstack-protector-strong --param=ssp-buffer-size=4 -Werror=trampolines -fomit-frame-pointer -march=i686 -fasynchronous-unwind-tables -mtune=pentium4 -gdwarf-4 -fno-debug-types-section -fvar-tracking-assignments -g2   -Wl,--as-needed -Wl,--no-copy-dt-needed-entries -Wl,-z,relro -Wl,-z,combreloc  -o wget_robots_fuzzer wget_robots_fuzzer.o main.o ../src/libunittest.a ../lib/libgnu.a                      -lmetalink -lpcre2-8 -luuid -lidn2 -lssl -lcrypto -lz -lpsl  -lgpgme -lassuan -lgpg-error
make[4]: Leaving directory '/tmp/B.1vm42abv/BUILD/wget-1.21.2/fuzz'
make[4]: Entering directory '/tmp/B.1vm42abv/BUILD/wget-1.21.2/fuzz'
SKIP: wget_ftpls_fuzzer
make[4]: Leaving directory '/tmp/B.1vm42abv/BUILD/wget-1.21.2/fuzz'
make[4]: Entering directory '/tmp/B.1vm42abv/BUILD/wget-1.21.2/fuzz'
SKIP: wget_netrc_fuzzer
make[4]: Leaving directory '/tmp/B.1vm42abv/BUILD/wget-1.21.2/fuzz'
make[4]: Entering directory '/tmp/B.1vm42abv/BUILD/wget-1.21.2/fuzz'
SKIP: wget_progress_fuzzer
make[4]: Leaving directory '/tmp/B.1vm42abv/BUILD/wget-1.21.2/fuzz'
make[4]: Entering directory '/tmp/B.1vm42abv/BUILD/wget-1.21.2/fuzz'
SKIP: wget_options_fuzzer
make[4]: Leaving directory '/tmp/B.1vm42abv/BUILD/wget-1.21.2/fuzz'
make[4]: Entering directory '/tmp/B.1vm42abv/BUILD/wget-1.21.2/fuzz'
SKIP: wget_html_fuzzer
make[4]: Leaving directory '/tmp/B.1vm42abv/BUILD/wget-1.21.2/fuzz'
make[4]: Entering directory '/tmp/B.1vm42abv/BUILD/wget-1.21.2/fuzz'
SKIP: wget_robots_fuzzer
make[4]: Leaving directory '/tmp/B.1vm42abv/BUILD/wget-1.21.2/fuzz'
make[4]: Entering directory '/tmp/B.1vm42abv/BUILD/wget-1.21.2/fuzz'
i686-pld-linux-gcc    -D_FILE_OFFSET_BITS=64    -DHAVE_LIBSSL   -DNDEBUG -O2 -fwrapv -pipe -Wformat -Werror=format-security -gdwarf-4 -fno-debug-types-section -fvar-tracking-assignments -g2 -Wp,-D_FORTIFY_SOURCE=2 -fstack-protector-strong --param=ssp-buffer-size=4 -Werror=trampolines -fomit-frame-pointer -march=i686 -fasynchronous-unwind-tables -mtune=pentium4 -gdwarf-4 -fno-debug-types-section -fvar-tracking-assignments -g2   -Wl,--as-needed -Wl,--no-copy-dt-needed-entries -Wl,-z,relro -Wl,-z,combreloc  -o wget_cookie_fuzzer wget_cookie_fuzzer.o main.o ../src/libunittest.a ../lib/libgnu.a                      -lmetalink -lpcre2-8 -luuid -lidn2 -lssl -lcrypto -lz -lpsl  -lgpgme -lassuan -lgpg-error
make[4]: Leaving directory '/tmp/B.1vm42abv/BUILD/wget-1.21.2/fuzz'
make[4]: Entering directory '/tmp/B.1vm42abv/BUILD/wget-1.21.2/fuzz'
i686-pld-linux-gcc    -D_FILE_OFFSET_BITS=64    -DHAVE_LIBSSL   -DNDEBUG -O2 -fwrapv -pipe -Wformat -Werror=format-security -gdwarf-4 -fno-debug-types-section -fvar-tracking-assignments -g2 -Wp,-D_FORTIFY_SOURCE=2 -fstack-protector-strong --param=ssp-buffer-size=4 -Werror=trampolines -fomit-frame-pointer -march=i686 -fasynchronous-unwind-tables -mtune=pentium4 -gdwarf-4 -fno-debug-types-section -fvar-tracking-assignments -g2   -Wl,--as-needed -Wl,--no-copy-dt-needed-entries -Wl,-z,relro -Wl,-z,combreloc  -o wget_css_fuzzer wget_css_fuzzer.o main.o ../src/libunittest.a ../lib/libgnu.a                      -lmetalink -lpcre2-8 -luuid -lidn2 -lssl -lcrypto -lz -lpsl  -lgpgme -lassuan -lgpg-error
make[4]: Leaving directory '/tmp/B.1vm42abv/BUILD/wget-1.21.2/fuzz'
make[4]: Entering directory '/tmp/B.1vm42abv/BUILD/wget-1.21.2/fuzz'
SKIP: wget_cookie_fuzzer
make[4]: Leaving directory '/tmp/B.1vm42abv/BUILD/wget-1.21.2/fuzz'
make[4]: Entering directory '/tmp/B.1vm42abv/BUILD/wget-1.21.2/fuzz'
PASS: wget_css_fuzzer
make[4]: Leaving directory '/tmp/B.1vm42abv/BUILD/wget-1.21.2/fuzz'
make[4]: Entering directory '/tmp/B.1vm42abv/BUILD/wget-1.21.2/fuzz'
i686-pld-linux-gcc    -D_FILE_OFFSET_BITS=64    -DHAVE_LIBSSL   -DNDEBUG -O2 -fwrapv -pipe -Wformat -Werror=format-security -gdwarf-4 -fno-debug-types-section -fvar-tracking-assignments -g2 -Wp,-D_FORTIFY_SOURCE=2 -fstack-protector-strong --param=ssp-buffer-size=4 -Werror=trampolines -fomit-frame-pointer -march=i686 -fasynchronous-unwind-tables -mtune=pentium4 -gdwarf-4 -fno-debug-types-section -fvar-tracking-assignments -g2   -Wl,--as-needed -Wl,--no-copy-dt-needed-entries -Wl,-z,relro -Wl,-z,combreloc  -o wget_read_hunk_fuzzer wget_read_hunk_fuzzer.o main.o ../src/libunittest.a ../lib/libgnu.a                      -lmetalink -lpcre2-8 -luuid -lidn2 -lssl -lcrypto -lz -lpsl  -lgpgme -lassuan -lgpg-error
make[4]: Leaving directory '/tmp/B.1vm42abv/BUILD/wget-1.21.2/fuzz'
make[4]: Entering directory '/tmp/B.1vm42abv/BUILD/wget-1.21.2/fuzz'
SKIP: wget_read_hunk_fuzzer
make[4]: Leaving directory '/tmp/B.1vm42abv/BUILD/wget-1.21.2/fuzz'
make[4]: Entering directory '/tmp/B.1vm42abv/BUILD/wget-1.21.2/fuzz'
i686-pld-linux-gcc    -D_FILE_OFFSET_BITS=64    -DHAVE_LIBSSL   -DNDEBUG -O2 -fwrapv -pipe -Wformat -Werror=format-security -gdwarf-4 -fno-debug-types-section -fvar-tracking-assignments -g2 -Wp,-D_FORTIFY_SOURCE=2 -fstack-protector-strong --param=ssp-buffer-size=4 -Werror=trampolines -fomit-frame-pointer -march=i686 -fasynchronous-unwind-tables -mtune=pentium4 -gdwarf-4 -fno-debug-types-section -fvar-tracking-assignments -g2   -Wl,--as-needed -Wl,--no-copy-dt-needed-entries -Wl,-z,relro -Wl,-z,combreloc  -o wget_url_fuzzer wget_url_fuzzer.o main.o ../src/libunittest.a ../lib/libgnu.a                      -lmetalink -lpcre2-8 -luuid -lidn2 -lssl -lcrypto -lz -lpsl  -lgpgme -lassuan -lgpg-error
make[4]: Leaving directory '/tmp/B.1vm42abv/BUILD/wget-1.21.2/fuzz'
make[4]: Entering directory '/tmp/B.1vm42abv/BUILD/wget-1.21.2/fuzz'
SKIP: wget_url_fuzzer
make[4]: Leaving directory '/tmp/B.1vm42abv/BUILD/wget-1.21.2/fuzz'
make[4]: Entering directory '/tmp/B.1vm42abv/BUILD/wget-1.21.2/fuzz'
i686-pld-linux-gcc    -D_FILE_OFFSET_BITS=64    -DHAVE_LIBSSL   -DNDEBUG -O2 -fwrapv -pipe -Wformat -Werror=format-security -gdwarf-4 -fno-debug-types-section -fvar-tracking-assignments -g2 -Wp,-D_FORTIFY_SOURCE=2 -fstack-protector-strong --param=ssp-buffer-size=4 -Werror=trampolines -fomit-frame-pointer -march=i686 -fasynchronous-unwind-tables -mtune=pentium4 -gdwarf-4 -fno-debug-types-section -fvar-tracking-assignments -g2   -Wl,--as-needed -Wl,--no-copy-dt-needed-entries -Wl,-z,relro -Wl,-z,combreloc  -o wget_ntlm_fuzzer wget_ntlm_fuzzer.o main.o ../src/libunittest.a ../lib/libgnu.a                      -lmetalink -lpcre2-8 -luuid -lidn2 -lssl -lcrypto -lz -lpsl  -lgpgme -lassuan -lgpg-error
make[4]: Leaving directory '/tmp/B.1vm42abv/BUILD/wget-1.21.2/fuzz'
make[4]: Entering directory '/tmp/B.1vm42abv/BUILD/wget-1.21.2/fuzz'
SKIP: wget_ntlm_fuzzer
make[4]: Leaving directory '/tmp/B.1vm42abv/BUILD/wget-1.21.2/fuzz'
make[4]: Entering directory '/tmp/B.1vm42abv/BUILD/wget-1.21.2/fuzz'
============================================================================
Testsuite summary for wget 1.21.2
============================================================================
# TOTAL: 11
# PASS:  1
# SKIP:  10
# XFAIL: 0
# FAIL:  0
# XPASS: 0
# ERROR: 0
============================================================================
make[4]: Leaving directory '/tmp/B.1vm42abv/BUILD/wget-1.21.2/fuzz'
Making check in tests
/usr/bin/make  unit-tests
cd ../src && /usr/bin/make  libunittest.a
make[3]: Entering directory '/tmp/B.1vm42abv/BUILD/wget-1.21.2/tests'
depbase=`echo unit-tests.o | sed 's|[^/]*$|.deps/&|;s|\.o$||'`;\
i686-pld-linux-gcc -DHAVE_CONFIG_H -I. -I../src  -I../lib -I../lib -I../src -DLOCALEDIR=\"/usr/share/locale\"    -D_FILE_OFFSET_BITS=64    -DHAVE_LIBSSL   -DNDEBUG -O2 -fwrapv -pipe -Wformat -Werror=format-security -gdwarf-4 -fno-debug-types-section -fvar-tracking-assignments -g2 -Wp,-D_FORTIFY_SOURCE=2 -fstack-protector-strong --param=ssp-buffer-size=4 -Werror=trampolines -fomit-frame-pointer -march=i686 -fasynchronous-unwind-tables -mtune=pentium4 -gdwarf-4 -fno-debug-types-section -fvar-tracking-assignments -g2  -MT unit-tests.o -MD -MP -MF $depbase.Tpo -c -o unit-tests.o unit-tests.c &&\
mv -f $depbase.Tpo $depbase.Po
make[3]: Leaving directory '/tmp/B.1vm42abv/BUILD/wget-1.21.2/tests'
make[3]: Entering directory '/tmp/B.1vm42abv/BUILD/wget-1.21.2/tests'
i686-pld-linux-gcc   -D_FILE_OFFSET_BITS=64    -DHAVE_LIBSSL   -DNDEBUG -O2 -fwrapv -pipe -Wformat -Werror=format-security -gdwarf-4 -fno-debug-types-section -fvar-tracking-assignments -g2 -Wp,-D_FORTIFY_SOURCE=2 -fstack-protector-strong --param=ssp-buffer-size=4 -Werror=trampolines -fomit-frame-pointer -march=i686 -fasynchronous-unwind-tables -mtune=pentium4 -gdwarf-4 -fno-debug-types-section -fvar-tracking-assignments -g2   -Wl,--as-needed -Wl,--no-copy-dt-needed-entries -Wl,-z,relro -Wl,-z,combreloc  -o unit-tests unit-tests.o ../src/libunittest.a ../lib/libgnu.a             /usr/lib/libunistring.so  -lmetalink -lpcre2-8 -luuid -lidn2 -lssl -lcrypto -lz -lpsl  -lgpgme -lassuan -lgpg-error
make[3]: Leaving directory '/tmp/B.1vm42abv/BUILD/wget-1.21.2/tests'
/usr/bin/make  check-TESTS
cd ../src && /usr/bin/make  libunittest.a
make[3]: Entering directory '/tmp/B.1vm42abv/BUILD/wget-1.21.2/tests'
i686-pld-linux-gcc   -D_FILE_OFFSET_BITS=64    -DHAVE_LIBSSL   -DNDEBUG -O2 -fwrapv -pipe -Wformat -Werror=format-security -gdwarf-4 -fno-debug-types-section -fvar-tracking-assignments -g2 -Wp,-D_FORTIFY_SOURCE=2 -fstack-protector-strong --param=ssp-buffer-size=4 -Werror=trampolines -fomit-frame-pointer -march=i686 -fasynchronous-unwind-tables -mtune=pentium4 -gdwarf-4 -fno-debug-types-section -fvar-tracking-assignments -g2   -Wl,--as-needed -Wl,--no-copy-dt-needed-entries -Wl,-z,relro -Wl,-z,combreloc  -o unit-tests unit-tests.o ../src/libunittest.a ../lib/libgnu.a             /usr/lib/libunistring.so  -lmetalink -lpcre2-8 -luuid -lidn2 -lssl -lcrypto -lz -lpsl  -lgpgme -lassuan -lgpg-error
make[3]: Leaving directory '/tmp/B.1vm42abv/BUILD/wget-1.21.2/tests'
cd ../src && /usr/bin/make  libunittest.a
make[4]: Entering directory '/tmp/B.1vm42abv/BUILD/wget-1.21.2/tests'
PASS: Test-c-full.px
make[4]: Leaving directory '/tmp/B.1vm42abv/BUILD/wget-1.21.2/tests'
make[4]: Entering directory '/tmp/B.1vm42abv/BUILD/wget-1.21.2/tests'
PASS: Test-auth-basic.px
make[4]: Leaving directory '/tmp/B.1vm42abv/BUILD/wget-1.21.2/tests'
make[4]: Entering directory '/tmp/B.1vm42abv/BUILD/wget-1.21.2/tests'
PASS: Test-auth-retcode.px
make[4]: Leaving directory '/tmp/B.1vm42abv/BUILD/wget-1.21.2/tests'
make[4]: Entering directory '/tmp/B.1vm42abv/BUILD/wget-1.21.2/tests'
PASS: Test-c-partial.px
make[4]: Leaving directory '/tmp/B.1vm42abv/BUILD/wget-1.21.2/tests'
make[4]: Entering directory '/tmp/B.1vm42abv/BUILD/wget-1.21.2/tests'
PASS: Test-auth-no-challenge.px
make[4]: Leaving directory '/tmp/B.1vm42abv/BUILD/wget-1.21.2/tests'
make[4]: Entering directory '/tmp/B.1vm42abv/BUILD/wget-1.21.2/tests'
PASS: Test-auth-with-content-disposition.px
make[4]: Leaving directory '/tmp/B.1vm42abv/BUILD/wget-1.21.2/tests'
make[4]: Entering directory '/tmp/B.1vm42abv/BUILD/wget-1.21.2/tests'
PASS: Test-auth-no-challenge-url.px
make[4]: Leaving directory '/tmp/B.1vm42abv/BUILD/wget-1.21.2/tests'
make[4]: Entering directory '/tmp/B.1vm42abv/BUILD/wget-1.21.2/tests'
PASS: Test-c.px
make[4]: Leaving directory '/tmp/B.1vm42abv/BUILD/wget-1.21.2/tests'
make[4]: Entering directory '/tmp/B.1vm42abv/BUILD/wget-1.21.2/tests'
PASS: Test-ftp.px
make[4]: Leaving directory '/tmp/B.1vm42abv/BUILD/wget-1.21.2/tests'
make[4]: Entering directory '/tmp/B.1vm42abv/BUILD/wget-1.21.2/tests'
PASS: Test-ftp-dir.px
make[4]: Leaving directory '/tmp/B.1vm42abv/BUILD/wget-1.21.2/tests'
make[4]: Entering directory '/tmp/B.1vm42abv/BUILD/wget-1.21.2/tests'
PASS: Test-c-shorter.px
make[4]: Leaving directory '/tmp/B.1vm42abv/BUILD/wget-1.21.2/tests'
make[4]: Entering directory '/tmp/B.1vm42abv/BUILD/wget-1.21.2/tests'
PASS: Test-cookies.px
make[4]: Leaving directory '/tmp/B.1vm42abv/BUILD/wget-1.21.2/tests'
make[4]: Entering directory '/tmp/B.1vm42abv/BUILD/wget-1.21.2/tests'
PASS: Test-cookies-401.px
make[4]: Leaving directory '/tmp/B.1vm42abv/BUILD/wget-1.21.2/tests'
make[4]: Entering directory '/tmp/B.1vm42abv/BUILD/wget-1.21.2/tests'
PASS: Test-E-k-K.px
make[4]: Leaving directory '/tmp/B.1vm42abv/BUILD/wget-1.21.2/tests'
make[4]: Entering directory '/tmp/B.1vm42abv/BUILD/wget-1.21.2/tests'
PASS: Test-ftp-bad-list.px
make[4]: Leaving directory '/tmp/B.1vm42abv/BUILD/wget-1.21.2/tests'
make[4]: Entering directory '/tmp/B.1vm42abv/BUILD/wget-1.21.2/tests'
PASS: Test-ftp-recursive.px
make[4]: Leaving directory '/tmp/B.1vm42abv/BUILD/wget-1.21.2/tests'
make[4]: Entering directory '/tmp/B.1vm42abv/BUILD/wget-1.21.2/tests'
PASS: Test-ftp-iri.px
make[4]: Leaving directory '/tmp/B.1vm42abv/BUILD/wget-1.21.2/tests'
make[4]: Entering directory '/tmp/B.1vm42abv/BUILD/wget-1.21.2/tests'
PASS: Test-ftp-iri-fallback.px
make[4]: Leaving directory '/tmp/B.1vm42abv/BUILD/wget-1.21.2/tests'
make[4]: Entering directory '/tmp/B.1vm42abv/BUILD/wget-1.21.2/tests'
PASS: Test-ftp-iri-recursive.px
make[4]: Leaving directory '/tmp/B.1vm42abv/BUILD/wget-1.21.2/tests'
make[4]: Entering directory '/tmp/B.1vm42abv/BUILD/wget-1.21.2/tests'
PASS: Test-ftp-iri-disabled.px
make[4]: Leaving directory '/tmp/B.1vm42abv/BUILD/wget-1.21.2/tests'
make[4]: Entering directory '/tmp/B.1vm42abv/BUILD/wget-1.21.2/tests'
PASS: Test-ftp-list-Multinet.px
make[4]: Leaving directory '/tmp/B.1vm42abv/BUILD/wget-1.21.2/tests'
make[4]: Entering directory '/tmp/B.1vm42abv/BUILD/wget-1.21.2/tests'
PASS: Test-ftp-list-Unknown.px
make[4]: Leaving directory '/tmp/B.1vm42abv/BUILD/wget-1.21.2/tests'
make[4]: Entering directory '/tmp/B.1vm42abv/BUILD/wget-1.21.2/tests'
PASS: Test-ftp-list-Unknown-a.px
make[4]: Leaving directory '/tmp/B.1vm42abv/BUILD/wget-1.21.2/tests'
make[4]: Entering directory '/tmp/B.1vm42abv/BUILD/wget-1.21.2/tests'
PASS: Test-ftp-list-Unknown-hidden.px
make[4]: Leaving directory '/tmp/B.1vm42abv/BUILD/wget-1.21.2/tests'
make[4]: Entering directory '/tmp/B.1vm42abv/BUILD/wget-1.21.2/tests'
PASS: Test-ftp-list-Unknown-list-a-fails.px
make[4]: Leaving directory '/tmp/B.1vm42abv/BUILD/wget-1.21.2/tests'
make[4]: Entering directory '/tmp/B.1vm42abv/BUILD/wget-1.21.2/tests'
PASS: Test-ftp-list-UNIX-hidden.px
make[4]: Leaving directory '/tmp/B.1vm42abv/BUILD/wget-1.21.2/tests'
make[4]: Entering directory '/tmp/B.1vm42abv/BUILD/wget-1.21.2/tests'
PASS: Test-ftp--start-pos.px
make[4]: Leaving directory '/tmp/B.1vm42abv/BUILD/wget-1.21.2/tests'
make[4]: Entering directory '/tmp/B.1vm42abv/BUILD/wget-1.21.2/tests'
PASS: Test-HTTP-Content-Disposition-1.px
make[4]: Leaving directory '/tmp/B.1vm42abv/BUILD/wget-1.21.2/tests'
make[4]: Entering directory '/tmp/B.1vm42abv/BUILD/wget-1.21.2/tests'
PASS: Test-HTTP-Content-Disposition-2.px
make[4]: Leaving directory '/tmp/B.1vm42abv/BUILD/wget-1.21.2/tests'
make[4]: Entering directory '/tmp/B.1vm42abv/BUILD/wget-1.21.2/tests'
PASS: Test-i-ftp.px
make[4]: Leaving directory '/tmp/B.1vm42abv/BUILD/wget-1.21.2/tests'
make[4]: Entering directory '/tmp/B.1vm42abv/BUILD/wget-1.21.2/tests'
PASS: Test-HTTP-Content-Disposition.px
make[4]: Leaving directory '/tmp/B.1vm42abv/BUILD/wget-1.21.2/tests'
make[4]: Entering directory '/tmp/B.1vm42abv/BUILD/wget-1.21.2/tests'
PASS: Test-i-http.px
make[4]: Leaving directory '/tmp/B.1vm42abv/BUILD/wget-1.21.2/tests'
make[4]: Entering directory '/tmp/B.1vm42abv/BUILD/wget-1.21.2/tests'
PASS: Test-idn-headers.px
make[4]: Leaving directory '/tmp/B.1vm42abv/BUILD/wget-1.21.2/tests'
make[4]: Entering directory '/tmp/B.1vm42abv/BUILD/wget-1.21.2/tests'
PASS: Test-idn-meta.px
make[4]: Leaving directory '/tmp/B.1vm42abv/BUILD/wget-1.21.2/tests'
make[4]: Entering directory '/tmp/B.1vm42abv/BUILD/wget-1.21.2/tests'
PASS: Test-idn-cmd-utf8.px
make[4]: Leaving directory '/tmp/B.1vm42abv/BUILD/wget-1.21.2/tests'
make[4]: Entering directory '/tmp/B.1vm42abv/BUILD/wget-1.21.2/tests'
PASS: Test-idn-cmd.px
make[4]: Leaving directory '/tmp/B.1vm42abv/BUILD/wget-1.21.2/tests'
make[4]: Entering directory '/tmp/B.1vm42abv/BUILD/wget-1.21.2/tests'
PASS: Test-idn-robots.px
make[4]: Leaving directory '/tmp/B.1vm42abv/BUILD/wget-1.21.2/tests'
make[4]: Entering directory '/tmp/B.1vm42abv/BUILD/wget-1.21.2/tests'
PASS: Test-idn-robots-utf8.px
make[4]: Leaving directory '/tmp/B.1vm42abv/BUILD/wget-1.21.2/tests'
make[4]: Entering directory '/tmp/B.1vm42abv/BUILD/wget-1.21.2/tests'
PASS: Test-iri.px
make[4]: Leaving directory '/tmp/B.1vm42abv/BUILD/wget-1.21.2/tests'
make[4]: Entering directory '/tmp/B.1vm42abv/BUILD/wget-1.21.2/tests'
PASS: Test-iri-disabled.px
make[4]: Leaving directory '/tmp/B.1vm42abv/BUILD/wget-1.21.2/tests'
make[4]: Entering directory '/tmp/B.1vm42abv/BUILD/wget-1.21.2/tests'
PASS: Test-iri-percent.px
make[4]: Leaving directory '/tmp/B.1vm42abv/BUILD/wget-1.21.2/tests'
make[4]: Entering directory '/tmp/B.1vm42abv/BUILD/wget-1.21.2/tests'
PASS: Test-iri-forced-remote.px
make[4]: Leaving directory '/tmp/B.1vm42abv/BUILD/wget-1.21.2/tests'
make[4]: Entering directory '/tmp/B.1vm42abv/BUILD/wget-1.21.2/tests'
PASS: Test-k.px
make[4]: Leaving directory '/tmp/B.1vm42abv/BUILD/wget-1.21.2/tests'
make[4]: Entering directory '/tmp/B.1vm42abv/BUILD/wget-1.21.2/tests'
PASS: Test-iri-list.px
make[4]: Leaving directory '/tmp/B.1vm42abv/BUILD/wget-1.21.2/tests'
make[4]: Entering directory '/tmp/B.1vm42abv/BUILD/wget-1.21.2/tests'
PASS: Test-meta-robots.px
make[4]: Leaving directory '/tmp/B.1vm42abv/BUILD/wget-1.21.2/tests'
make[4]: Entering directory '/tmp/B.1vm42abv/BUILD/wget-1.21.2/tests'
PASS: Test-N-current.px
make[4]: Leaving directory '/tmp/B.1vm42abv/BUILD/wget-1.21.2/tests'
make[4]: Entering directory '/tmp/B.1vm42abv/BUILD/wget-1.21.2/tests'
PASS: Test-N-HTTP-Content-Disposition.px
make[4]: Leaving directory '/tmp/B.1vm42abv/BUILD/wget-1.21.2/tests'
make[4]: Entering directory '/tmp/B.1vm42abv/BUILD/wget-1.21.2/tests'
PASS: Test-N--no-content-disposition.px
make[4]: Leaving directory '/tmp/B.1vm42abv/BUILD/wget-1.21.2/tests'
make[4]: Entering directory '/tmp/B.1vm42abv/BUILD/wget-1.21.2/tests'
PASS: Test-N--no-content-disposition-trivial.px
make[4]: Leaving directory '/tmp/B.1vm42abv/BUILD/wget-1.21.2/tests'
make[4]: Entering directory '/tmp/B.1vm42abv/BUILD/wget-1.21.2/tests'
PASS: Test-N-no-info.px
make[4]: Leaving directory '/tmp/B.1vm42abv/BUILD/wget-1.21.2/tests'
make[4]: Entering directory '/tmp/B.1vm42abv/BUILD/wget-1.21.2/tests'
PASS: Test--no-content-disposition.px
make[4]: Leaving directory '/tmp/B.1vm42abv/BUILD/wget-1.21.2/tests'
make[4]: Entering directory '/tmp/B.1vm42abv/BUILD/wget-1.21.2/tests'
PASS: Test--no-content-disposition-trivial.px
make[4]: Leaving directory '/tmp/B.1vm42abv/BUILD/wget-1.21.2/tests'
make[4]: Entering directory '/tmp/B.1vm42abv/BUILD/wget-1.21.2/tests'
PASS: Test-N-old.px
make[4]: Leaving directory '/tmp/B.1vm42abv/BUILD/wget-1.21.2/tests'
make[4]: Entering directory '/tmp/B.1vm42abv/BUILD/wget-1.21.2/tests'
PASS: Test-noop.px
make[4]: Leaving directory '/tmp/B.1vm42abv/BUILD/wget-1.21.2/tests'
make[4]: Entering directory '/tmp/B.1vm42abv/BUILD/wget-1.21.2/tests'
PASS: Test-nonexisting-quiet.px
make[4]: Leaving directory '/tmp/B.1vm42abv/BUILD/wget-1.21.2/tests'
make[4]: Entering directory '/tmp/B.1vm42abv/BUILD/wget-1.21.2/tests'
PASS: Test-np.px
make[4]: Leaving directory '/tmp/B.1vm42abv/BUILD/wget-1.21.2/tests'
make[4]: Entering directory '/tmp/B.1vm42abv/BUILD/wget-1.21.2/tests'
PASS: Test-N.px
make[4]: Leaving directory '/tmp/B.1vm42abv/BUILD/wget-1.21.2/tests'
make[4]: Entering directory '/tmp/B.1vm42abv/BUILD/wget-1.21.2/tests'
PASS: Test-N-smaller.px
make[4]: Leaving directory '/tmp/B.1vm42abv/BUILD/wget-1.21.2/tests'
make[4]: Entering directory '/tmp/B.1vm42abv/BUILD/wget-1.21.2/tests'
PASS: Test-O-HTTP-Content-Disposition.px
make[4]: Leaving directory '/tmp/B.1vm42abv/BUILD/wget-1.21.2/tests'
make[4]: Entering directory '/tmp/B.1vm42abv/BUILD/wget-1.21.2/tests'
PASS: Test-O-nc.px
make[4]: Leaving directory '/tmp/B.1vm42abv/BUILD/wget-1.21.2/tests'
make[4]: Entering directory '/tmp/B.1vm42abv/BUILD/wget-1.21.2/tests'
PASS: Test-O--no-content-disposition.px
make[4]: Leaving directory '/tmp/B.1vm42abv/BUILD/wget-1.21.2/tests'
make[4]: Entering directory '/tmp/B.1vm42abv/BUILD/wget-1.21.2/tests'
PASS: Test-O--no-content-disposition-trivial.px
make[4]: Leaving directory '/tmp/B.1vm42abv/BUILD/wget-1.21.2/tests'
make[4]: Entering directory '/tmp/B.1vm42abv/BUILD/wget-1.21.2/tests'
PASS: Test-O-nonexisting.px
make[4]: Leaving directory '/tmp/B.1vm42abv/BUILD/wget-1.21.2/tests'
make[4]: Entering directory '/tmp/B.1vm42abv/BUILD/wget-1.21.2/tests'
PASS: Test--post-file.px
make[4]: Leaving directory '/tmp/B.1vm42abv/BUILD/wget-1.21.2/tests'
make[4]: Entering directory '/tmp/B.1vm42abv/BUILD/wget-1.21.2/tests'
PASS: Test-O.px
make[4]: Leaving directory '/tmp/B.1vm42abv/BUILD/wget-1.21.2/tests'
make[4]: Entering directory '/tmp/B.1vm42abv/BUILD/wget-1.21.2/tests'
PASS: Test-proxy-auth-basic.px
make[4]: Leaving directory '/tmp/B.1vm42abv/BUILD/wget-1.21.2/tests'
make[4]: Entering directory '/tmp/B.1vm42abv/BUILD/wget-1.21.2/tests'
PASS: Test-restrict-ascii.px
make[4]: Leaving directory '/tmp/B.1vm42abv/BUILD/wget-1.21.2/tests'
make[4]: Entering directory '/tmp/B.1vm42abv/BUILD/wget-1.21.2/tests'
PASS: Test-ftp-pasv-fail.px
make[4]: Leaving directory '/tmp/B.1vm42abv/BUILD/wget-1.21.2/tests'
make[4]: Entering directory '/tmp/B.1vm42abv/BUILD/wget-1.21.2/tests'
PASS: Test-E-k.px
make[4]: Leaving directory '/tmp/B.1vm42abv/BUILD/wget-1.21.2/tests'
make[4]: Entering directory '/tmp/B.1vm42abv/BUILD/wget-1.21.2/tests'
PASS: Test-Restrict-Lowercase.px
make[4]: Leaving directory '/tmp/B.1vm42abv/BUILD/wget-1.21.2/tests'
make[4]: Entering directory '/tmp/B.1vm42abv/BUILD/wget-1.21.2/tests'
PASS: Test-stdouterr.px
make[4]: Leaving directory '/tmp/B.1vm42abv/BUILD/wget-1.21.2/tests'
make[4]: Entering directory '/tmp/B.1vm42abv/BUILD/wget-1.21.2/tests'
PASS: Test-Restrict-Uppercase.px
make[4]: Leaving directory '/tmp/B.1vm42abv/BUILD/wget-1.21.2/tests'
make[4]: Entering directory '/tmp/B.1vm42abv/BUILD/wget-1.21.2/tests'
PASS: Test-proxied-https-auth.px
make[4]: Leaving directory '/tmp/B.1vm42abv/BUILD/wget-1.21.2/tests'
make[4]: Entering directory '/tmp/B.1vm42abv/BUILD/wget-1.21.2/tests'
PASS: Test-proxied-https-auth-keepalive.px
make[4]: Leaving directory '/tmp/B.1vm42abv/BUILD/wget-1.21.2/tests'
make[4]: Entering directory '/tmp/B.1vm42abv/BUILD/wget-1.21.2/tests'
PASS: Test--spider-fail.px
make[4]: Leaving directory '/tmp/B.1vm42abv/BUILD/wget-1.21.2/tests'
make[4]: Entering directory '/tmp/B.1vm42abv/BUILD/wget-1.21.2/tests'
PASS: Test--spider.px
make[4]: Leaving directory '/tmp/B.1vm42abv/BUILD/wget-1.21.2/tests'
make[4]: Entering directory '/tmp/B.1vm42abv/BUILD/wget-1.21.2/tests'
PASS: Test--spider-r-HTTP-Content-Disposition.px
make[4]: Leaving directory '/tmp/B.1vm42abv/BUILD/wget-1.21.2/tests'
make[4]: Entering directory '/tmp/B.1vm42abv/BUILD/wget-1.21.2/tests'
PASS: Test--spider-r--no-content-disposition.px
make[4]: Leaving directory '/tmp/B.1vm42abv/BUILD/wget-1.21.2/tests'
make[4]: Entering directory '/tmp/B.1vm42abv/BUILD/wget-1.21.2/tests'
PASS: Test--spider-r--no-content-disposition-trivial.px
make[4]: Leaving directory '/tmp/B.1vm42abv/BUILD/wget-1.21.2/tests'
make[4]: Entering directory '/tmp/B.1vm42abv/BUILD/wget-1.21.2/tests'
PASS: Test--spider-r.px
make[4]: Leaving directory '/tmp/B.1vm42abv/BUILD/wget-1.21.2/tests'
make[4]: Entering directory '/tmp/B.1vm42abv/BUILD/wget-1.21.2/tests'
PASS: Test--start-pos.px
make[4]: Leaving directory '/tmp/B.1vm42abv/BUILD/wget-1.21.2/tests'
make[4]: Entering directory '/tmp/B.1vm42abv/BUILD/wget-1.21.2/tests'
PASS: Test--start-pos--continue.px
make[4]: Leaving directory '/tmp/B.1vm42abv/BUILD/wget-1.21.2/tests'
make[4]: Entering directory '/tmp/B.1vm42abv/BUILD/wget-1.21.2/tests'
PASS: Test-ftp-pasv-not-supported.px
make[4]: Leaving directory '/tmp/B.1vm42abv/BUILD/wget-1.21.2/tests'
make[4]: Entering directory '/tmp/B.1vm42abv/BUILD/wget-1.21.2/tests'
PASS: Test--httpsonly-r.px
make[4]: Leaving directory '/tmp/B.1vm42abv/BUILD/wget-1.21.2/tests'
make[4]: Entering directory '/tmp/B.1vm42abv/BUILD/wget-1.21.2/tests'
PASS: Test-204.px
make[4]: Leaving directory '/tmp/B.1vm42abv/BUILD/wget-1.21.2/tests'
make[4]: Entering directory '/tmp/B.1vm42abv/BUILD/wget-1.21.2/tests'
SKIP: Test-https-pfs.px
make[4]: Leaving directory '/tmp/B.1vm42abv/BUILD/wget-1.21.2/tests'
make[4]: Entering directory '/tmp/B.1vm42abv/BUILD/wget-1.21.2/tests'
SKIP: Test-https-tlsv1.px
make[4]: Leaving directory '/tmp/B.1vm42abv/BUILD/wget-1.21.2/tests'
make[4]: Entering directory '/tmp/B.1vm42abv/BUILD/wget-1.21.2/tests'
SKIP: Test-https-tlsv1x.px
make[4]: Leaving directory '/tmp/B.1vm42abv/BUILD/wget-1.21.2/tests'
make[4]: Entering directory '/tmp/B.1vm42abv/BUILD/wget-1.21.2/tests'
SKIP: Test-https-weboftrust.px
make[4]: Leaving directory '/tmp/B.1vm42abv/BUILD/wget-1.21.2/tests'
make[4]: Entering directory '/tmp/B.1vm42abv/BUILD/wget-1.21.2/tests'
SKIP: Test-https-clientcert.px
make[4]: Leaving directory '/tmp/B.1vm42abv/BUILD/wget-1.21.2/tests'
make[4]: Entering directory '/tmp/B.1vm42abv/BUILD/wget-1.21.2/tests'
SKIP: Test-https-selfsigned.px
make[4]: Leaving directory '/tmp/B.1vm42abv/BUILD/wget-1.21.2/tests'
make[4]: Entering directory '/tmp/B.1vm42abv/BUILD/wget-1.21.2/tests'
SKIP: Test-https-crl.px
make[4]: Leaving directory '/tmp/B.1vm42abv/BUILD/wget-1.21.2/tests'
make[4]: Entering directory '/tmp/B.1vm42abv/BUILD/wget-1.21.2/tests'
SKIP: Test-https-badcerts.px
make[4]: Leaving directory '/tmp/B.1vm42abv/BUILD/wget-1.21.2/tests'
make[4]: Entering directory '/tmp/B.1vm42abv/BUILD/wget-1.21.2/tests'
i686-pld-linux-gcc   -D_FILE_OFFSET_BITS=64    -DHAVE_LIBSSL   -DNDEBUG -O2 -fwrapv -pipe -Wformat -Werror=format-security -gdwarf-4 -fno-debug-types-section -fvar-tracking-assignments -g2 -Wp,-D_FORTIFY_SOURCE=2 -fstack-protector-strong --param=ssp-buffer-size=4 -Werror=trampolines -fomit-frame-pointer -march=i686 -fasynchronous-unwind-tables -mtune=pentium4 -gdwarf-4 -fno-debug-types-section -fvar-tracking-assignments -g2   -Wl,--as-needed -Wl,--no-copy-dt-needed-entries -Wl,-z,relro -Wl,-z,combreloc  -o unit-tests unit-tests.o ../src/libunittest.a ../lib/libgnu.a             /usr/lib/libunistring.so  -lmetalink -lpcre2-8 -luuid -lidn2 -lssl -lcrypto -lz -lpsl  -lgpgme -lassuan -lgpg-error
make[4]: Leaving directory '/tmp/B.1vm42abv/BUILD/wget-1.21.2/tests'
make[4]: Entering directory '/tmp/B.1vm42abv/BUILD/wget-1.21.2/tests'
PASS: unit-tests
make[4]: Leaving directory '/tmp/B.1vm42abv/BUILD/wget-1.21.2/tests'
make[4]: Entering directory '/tmp/B.1vm42abv/BUILD/wget-1.21.2/tests'
============================================================================
Testsuite summary for wget 1.21.2
============================================================================
# TOTAL: 94
# PASS:  86
# SKIP:  8
# XFAIL: 0
# FAIL:  0
# XPASS: 0
# ERROR: 0
============================================================================
make[4]: Leaving directory '/tmp/B.1vm42abv/BUILD/wget-1.21.2/tests'
Making check in testenv
/usr/bin/make  check-TESTS
make[4]: Entering directory '/tmp/B.1vm42abv/BUILD/wget-1.21.2/testenv'
PASS: Test-auth-basic-netrc.py
make[4]: Leaving directory '/tmp/B.1vm42abv/BUILD/wget-1.21.2/testenv'
make[4]: Entering directory '/tmp/B.1vm42abv/BUILD/wget-1.21.2/testenv'
PASS: Test-auth-basic-netrc-user-given.py
make[4]: Leaving directory '/tmp/B.1vm42abv/BUILD/wget-1.21.2/testenv'
make[4]: Entering directory '/tmp/B.1vm42abv/BUILD/wget-1.21.2/testenv'
PASS: Test-416.py
make[4]: Leaving directory '/tmp/B.1vm42abv/BUILD/wget-1.21.2/testenv'
make[4]: Entering directory '/tmp/B.1vm42abv/BUILD/wget-1.21.2/testenv'
PASS: Test-auth-both.py
make[4]: Leaving directory '/tmp/B.1vm42abv/BUILD/wget-1.21.2/testenv'
make[4]: Entering directory '/tmp/B.1vm42abv/BUILD/wget-1.21.2/testenv'
PASS: Test-auth-basic-netrc-pass-given.py
make[4]: Leaving directory '/tmp/B.1vm42abv/BUILD/wget-1.21.2/testenv'
make[4]: Entering directory '/tmp/B.1vm42abv/BUILD/wget-1.21.2/testenv'
PASS: Test-auth-basic.py
make[4]: Leaving directory '/tmp/B.1vm42abv/BUILD/wget-1.21.2/testenv'
make[4]: Entering directory '/tmp/B.1vm42abv/BUILD/wget-1.21.2/testenv'
PASS: Test-auth-basic-no-netrc-fail.py
make[4]: Leaving directory '/tmp/B.1vm42abv/BUILD/wget-1.21.2/testenv'
make[4]: Entering directory '/tmp/B.1vm42abv/BUILD/wget-1.21.2/testenv'
PASS: Test-auth-basic-fail.py
make[4]: Leaving directory '/tmp/B.1vm42abv/BUILD/wget-1.21.2/testenv'
make[4]: Entering directory '/tmp/B.1vm42abv/BUILD/wget-1.21.2/testenv'
PASS: Test-auth-no-challenge-url.py
make[4]: Leaving directory '/tmp/B.1vm42abv/BUILD/wget-1.21.2/testenv'
make[4]: Entering directory '/tmp/B.1vm42abv/BUILD/wget-1.21.2/testenv'
PASS: Test-auth-no-challenge.py
make[4]: Leaving directory '/tmp/B.1vm42abv/BUILD/wget-1.21.2/testenv'
make[4]: Entering directory '/tmp/B.1vm42abv/BUILD/wget-1.21.2/testenv'
PASS: Test-auth-digest.py
make[4]: Leaving directory '/tmp/B.1vm42abv/BUILD/wget-1.21.2/testenv'
make[4]: Entering directory '/tmp/B.1vm42abv/BUILD/wget-1.21.2/testenv'
PASS: Test-condget.py
make[4]: Leaving directory '/tmp/B.1vm42abv/BUILD/wget-1.21.2/testenv'
make[4]: Entering directory '/tmp/B.1vm42abv/BUILD/wget-1.21.2/testenv'
PASS: Test-auth-retcode.py
make[4]: Leaving directory '/tmp/B.1vm42abv/BUILD/wget-1.21.2/testenv'
make[4]: Entering directory '/tmp/B.1vm42abv/BUILD/wget-1.21.2/testenv'
PASS: Test-auth-with-content-disposition.py
make[4]: Leaving directory '/tmp/B.1vm42abv/BUILD/wget-1.21.2/testenv'
make[4]: Entering directory '/tmp/B.1vm42abv/BUILD/wget-1.21.2/testenv'
PASS: Test-c-full.py
make[4]: Leaving directory '/tmp/B.1vm42abv/BUILD/wget-1.21.2/testenv'
make[4]: Entering directory '/tmp/B.1vm42abv/BUILD/wget-1.21.2/testenv'
PASS: Test-Content-disposition-2.py
make[4]: Leaving directory '/tmp/B.1vm42abv/BUILD/wget-1.21.2/testenv'
make[4]: Entering directory '/tmp/B.1vm42abv/BUILD/wget-1.21.2/testenv'
PASS: Test-Content-disposition.py
make[4]: Leaving directory '/tmp/B.1vm42abv/BUILD/wget-1.21.2/testenv'
make[4]: Entering directory '/tmp/B.1vm42abv/BUILD/wget-1.21.2/testenv'
PASS: Test--convert-links--content-on-error.py
make[4]: Leaving directory '/tmp/B.1vm42abv/BUILD/wget-1.21.2/testenv'
make[4]: Entering directory '/tmp/B.1vm42abv/BUILD/wget-1.21.2/testenv'
PASS: Test-cookie-401.py
make[4]: Leaving directory '/tmp/B.1vm42abv/BUILD/wget-1.21.2/testenv'
make[4]: Entering directory '/tmp/B.1vm42abv/BUILD/wget-1.21.2/testenv'
PASS: Test-cookie-domain-mismatch.py
make[4]: Leaving directory '/tmp/B.1vm42abv/BUILD/wget-1.21.2/testenv'
make[4]: Entering directory '/tmp/B.1vm42abv/BUILD/wget-1.21.2/testenv'
PASS: Test-hsts.py
make[4]: Leaving directory '/tmp/B.1vm42abv/BUILD/wget-1.21.2/testenv'
make[4]: Entering directory '/tmp/B.1vm42abv/BUILD/wget-1.21.2/testenv'
PASS: Test--https.py
make[4]: Leaving directory '/tmp/B.1vm42abv/BUILD/wget-1.21.2/testenv'
make[4]: Entering directory '/tmp/B.1vm42abv/BUILD/wget-1.21.2/testenv'
PASS: Test-pinnedpubkey-der-https.py
make[4]: Leaving directory '/tmp/B.1vm42abv/BUILD/wget-1.21.2/testenv'
make[4]: Entering directory '/tmp/B.1vm42abv/BUILD/wget-1.21.2/testenv'
PASS: Test-504.py
make[4]: Leaving directory '/tmp/B.1vm42abv/BUILD/wget-1.21.2/testenv'
make[4]: Entering directory '/tmp/B.1vm42abv/BUILD/wget-1.21.2/testenv'
PASS: Test-pinnedpubkey-der-no-check-https.py
make[4]: Leaving directory '/tmp/B.1vm42abv/BUILD/wget-1.21.2/testenv'
make[4]: Entering directory '/tmp/B.1vm42abv/BUILD/wget-1.21.2/testenv'
PASS: Test-pinnedpubkey-hash-https.py
make[4]: Leaving directory '/tmp/B.1vm42abv/BUILD/wget-1.21.2/testenv'
make[4]: Entering directory '/tmp/B.1vm42abv/BUILD/wget-1.21.2/testenv'
PASS: Test-cookie-expires.py
make[4]: Leaving directory '/tmp/B.1vm42abv/BUILD/wget-1.21.2/testenv'
make[4]: Entering directory '/tmp/B.1vm42abv/BUILD/wget-1.21.2/testenv'
PASS: Test-Head.py
make[4]: Leaving directory '/tmp/B.1vm42abv/BUILD/wget-1.21.2/testenv'
make[4]: Entering directory '/tmp/B.1vm42abv/BUILD/wget-1.21.2/testenv'
PASS: Test-cookie.py
make[4]: Leaving directory '/tmp/B.1vm42abv/BUILD/wget-1.21.2/testenv'
make[4]: Entering directory '/tmp/B.1vm42abv/BUILD/wget-1.21.2/testenv'
PASS: Test-pinnedpubkey-pem-https.py
make[4]: Leaving directory '/tmp/B.1vm42abv/BUILD/wget-1.21.2/testenv'
make[4]: Entering directory '/tmp/B.1vm42abv/BUILD/wget-1.21.2/testenv'
PASS: Test-missing-scheme-retval.py
make[4]: Leaving directory '/tmp/B.1vm42abv/BUILD/wget-1.21.2/testenv'
make[4]: Entering directory '/tmp/B.1vm42abv/BUILD/wget-1.21.2/testenv'
PASS: Test-O.py
make[4]: Leaving directory '/tmp/B.1vm42abv/BUILD/wget-1.21.2/testenv'
make[4]: Entering directory '/tmp/B.1vm42abv/BUILD/wget-1.21.2/testenv'
PASS: Test--https-crl.py
make[4]: Leaving directory '/tmp/B.1vm42abv/BUILD/wget-1.21.2/testenv'
make[4]: Entering directory '/tmp/B.1vm42abv/BUILD/wget-1.21.2/testenv'
PASS: Test-pinnedpubkey-hash-no-check-fail-https.py
make[4]: Leaving directory '/tmp/B.1vm42abv/BUILD/wget-1.21.2/testenv'
make[4]: Entering directory '/tmp/B.1vm42abv/BUILD/wget-1.21.2/testenv'
PASS: Test-pinnedpubkey-pem-fail-https.py
make[4]: Leaving directory '/tmp/B.1vm42abv/BUILD/wget-1.21.2/testenv'
make[4]: Entering directory '/tmp/B.1vm42abv/BUILD/wget-1.21.2/testenv'
PASS: Test-Post.py
make[4]: Leaving directory '/tmp/B.1vm42abv/BUILD/wget-1.21.2/testenv'
make[4]: Entering directory '/tmp/B.1vm42abv/BUILD/wget-1.21.2/testenv'
PASS: Test-recursive-include.py
make[4]: Leaving directory '/tmp/B.1vm42abv/BUILD/wget-1.21.2/testenv'
make[4]: Entering directory '/tmp/B.1vm42abv/BUILD/wget-1.21.2/testenv'
PASS: Test-recursive-basic.py
make[4]: Leaving directory '/tmp/B.1vm42abv/BUILD/wget-1.21.2/testenv'
make[4]: Entering directory '/tmp/B.1vm42abv/BUILD/wget-1.21.2/testenv'
PASS: Test-recursive-redirect.py
make[4]: Leaving directory '/tmp/B.1vm42abv/BUILD/wget-1.21.2/testenv'
make[4]: Entering directory '/tmp/B.1vm42abv/BUILD/wget-1.21.2/testenv'
SKIP: Test-no_proxy-env.py
make[4]: Leaving directory '/tmp/B.1vm42abv/BUILD/wget-1.21.2/testenv'
make[4]: Entering directory '/tmp/B.1vm42abv/BUILD/wget-1.21.2/testenv'
PASS: Test-redirect.py
make[4]: Leaving directory '/tmp/B.1vm42abv/BUILD/wget-1.21.2/testenv'
make[4]: Entering directory '/tmp/B.1vm42abv/BUILD/wget-1.21.2/testenv'
PASS: Test-redirect-crash.py
make[4]: Leaving directory '/tmp/B.1vm42abv/BUILD/wget-1.21.2/testenv'
make[4]: Entering directory '/tmp/B.1vm42abv/BUILD/wget-1.21.2/testenv'
PASS: Test--rejected-log.py
make[4]: Leaving directory '/tmp/B.1vm42abv/BUILD/wget-1.21.2/testenv'
make[4]: Entering directory '/tmp/B.1vm42abv/BUILD/wget-1.21.2/testenv'
PASS: Test-reserved-chars.py
make[4]: Leaving directory '/tmp/B.1vm42abv/BUILD/wget-1.21.2/testenv'
make[4]: Entering directory '/tmp/B.1vm42abv/BUILD/wget-1.21.2/testenv'
PASS: Test--spider-r.py
make[4]: Leaving directory '/tmp/B.1vm42abv/BUILD/wget-1.21.2/testenv'
make[4]: Entering directory '/tmp/B.1vm42abv/BUILD/wget-1.21.2/testenv'
PASS: Test-metalink-http-baddigest.py
make[4]: Leaving directory '/tmp/B.1vm42abv/BUILD/wget-1.21.2/testenv'
make[4]: Entering directory '/tmp/B.1vm42abv/BUILD/wget-1.21.2/testenv'
FAIL: Test-metalink-http-xml.py
make[4]: Leaving directory '/tmp/B.1vm42abv/BUILD/wget-1.21.2/testenv'
make[4]: Entering directory '/tmp/B.1vm42abv/BUILD/wget-1.21.2/testenv'
FAIL: Test-metalink-http-xml-trust.py
make[4]: Leaving directory '/tmp/B.1vm42abv/BUILD/wget-1.21.2/testenv'
make[4]: Entering directory '/tmp/B.1vm42abv/BUILD/wget-1.21.2/testenv'
FAIL: Test-metalink-http-xml-trust-name.py
make[4]: Leaving directory '/tmp/B.1vm42abv/BUILD/wget-1.21.2/testenv'
make[4]: Entering directory '/tmp/B.1vm42abv/BUILD/wget-1.21.2/testenv'
FAIL: Test-metalink-http-xml-type.py
make[4]: Leaving directory '/tmp/B.1vm42abv/BUILD/wget-1.21.2/testenv'
make[4]: Entering directory '/tmp/B.1vm42abv/BUILD/wget-1.21.2/testenv'
FAIL: Test-metalink-http-xml-type-trust.py
make[4]: Leaving directory '/tmp/B.1vm42abv/BUILD/wget-1.21.2/testenv'
make[4]: Entering directory '/tmp/B.1vm42abv/BUILD/wget-1.21.2/testenv'
FAIL: Test-metalink-http-xml-type-content.py
make[4]: Leaving directory '/tmp/B.1vm42abv/BUILD/wget-1.21.2/testenv'
make[4]: Entering directory '/tmp/B.1vm42abv/BUILD/wget-1.21.2/testenv'
FAIL: Test-metalink-xml.py
make[4]: Leaving directory '/tmp/B.1vm42abv/BUILD/wget-1.21.2/testenv'
make[4]: Entering directory '/tmp/B.1vm42abv/BUILD/wget-1.21.2/testenv'
FAIL: Test-metalink-xml-continue.py
make[4]: Leaving directory '/tmp/B.1vm42abv/BUILD/wget-1.21.2/testenv'
make[4]: Entering directory '/tmp/B.1vm42abv/BUILD/wget-1.21.2/testenv'
FAIL: Test-metalink-xml-relpath.py
make[4]: Leaving directory '/tmp/B.1vm42abv/BUILD/wget-1.21.2/testenv'
make[4]: Entering directory '/tmp/B.1vm42abv/BUILD/wget-1.21.2/testenv'
FAIL: Test-metalink-xml-abspath.py
make[4]: Leaving directory '/tmp/B.1vm42abv/BUILD/wget-1.21.2/testenv'
make[4]: Entering directory '/tmp/B.1vm42abv/BUILD/wget-1.21.2/testenv'
PASS: Test-metalink-http.py
make[4]: Leaving directory '/tmp/B.1vm42abv/BUILD/wget-1.21.2/testenv'
make[4]: Entering directory '/tmp/B.1vm42abv/BUILD/wget-1.21.2/testenv'
PASS: Test-metalink-http-quoted.py
make[4]: Leaving directory '/tmp/B.1vm42abv/BUILD/wget-1.21.2/testenv'
make[4]: Entering directory '/tmp/B.1vm42abv/BUILD/wget-1.21.2/testenv'
FAIL: Test-metalink-xml-homepath.py
make[4]: Leaving directory '/tmp/B.1vm42abv/BUILD/wget-1.21.2/testenv'
make[4]: Entering directory '/tmp/B.1vm42abv/BUILD/wget-1.21.2/testenv'
FAIL: Test-metalink-xml-trust.py
make[4]: Leaving directory '/tmp/B.1vm42abv/BUILD/wget-1.21.2/testenv'
make[4]: Entering directory '/tmp/B.1vm42abv/BUILD/wget-1.21.2/testenv'
FAIL: Test-metalink-http-xml-type-trust-content.py
make[4]: Leaving directory '/tmp/B.1vm42abv/BUILD/wget-1.21.2/testenv'
make[4]: Entering directory '/tmp/B.1vm42abv/BUILD/wget-1.21.2/testenv'
FAIL: Test-metalink-xml-relpath-trust.py
make[4]: Leaving directory '/tmp/B.1vm42abv/BUILD/wget-1.21.2/testenv'
make[4]: Entering directory '/tmp/B.1vm42abv/BUILD/wget-1.21.2/testenv'
FAIL: Test-metalink-xml-abspath-trust.py
make[4]: Leaving directory '/tmp/B.1vm42abv/BUILD/wget-1.21.2/testenv'
make[4]: Entering directory '/tmp/B.1vm42abv/BUILD/wget-1.21.2/testenv'
FAIL: Test-metalink-xml-homepath-trust.py
make[4]: Leaving directory '/tmp/B.1vm42abv/BUILD/wget-1.21.2/testenv'
make[4]: Entering directory '/tmp/B.1vm42abv/BUILD/wget-1.21.2/testenv'
FAIL: Test-metalink-xml-prefix.py
make[4]: Leaving directory '/tmp/B.1vm42abv/BUILD/wget-1.21.2/testenv'
make[4]: Entering directory '/tmp/B.1vm42abv/BUILD/wget-1.21.2/testenv'
FAIL: Test-metalink-xml-relprefix.py
make[4]: Leaving directory '/tmp/B.1vm42abv/BUILD/wget-1.21.2/testenv'
make[4]: Entering directory '/tmp/B.1vm42abv/BUILD/wget-1.21.2/testenv'
FAIL: Test-metalink-xml-absprefix.py
make[4]: Leaving directory '/tmp/B.1vm42abv/BUILD/wget-1.21.2/testenv'
make[4]: Entering directory '/tmp/B.1vm42abv/BUILD/wget-1.21.2/testenv'
FAIL: Test-metalink-xml-homeprefix.py
make[4]: Leaving directory '/tmp/B.1vm42abv/BUILD/wget-1.21.2/testenv'
make[4]: Entering directory '/tmp/B.1vm42abv/BUILD/wget-1.21.2/testenv'
FAIL: Test-metalink-xml-prefix-trust.py
make[4]: Leaving directory '/tmp/B.1vm42abv/BUILD/wget-1.21.2/testenv'
make[4]: Entering directory '/tmp/B.1vm42abv/BUILD/wget-1.21.2/testenv'
FAIL: Test-metalink-xml-relprefix-trust.py
make[4]: Leaving directory '/tmp/B.1vm42abv/BUILD/wget-1.21.2/testenv'
make[4]: Entering directory '/tmp/B.1vm42abv/BUILD/wget-1.21.2/testenv'
FAIL: Test-metalink-xml-absprefix-trust.py
make[4]: Leaving directory '/tmp/B.1vm42abv/BUILD/wget-1.21.2/testenv'
make[4]: Entering directory '/tmp/B.1vm42abv/BUILD/wget-1.21.2/testenv'
FAIL: Test-metalink-xml-homeprefix-trust.py
make[4]: Leaving directory '/tmp/B.1vm42abv/BUILD/wget-1.21.2/testenv'
make[4]: Entering directory '/tmp/B.1vm42abv/BUILD/wget-1.21.2/testenv'
FAIL: Test-metalink-xml-emptyprefix-trust.py
make[4]: Leaving directory '/tmp/B.1vm42abv/BUILD/wget-1.21.2/testenv'
make[4]: Entering directory '/tmp/B.1vm42abv/BUILD/wget-1.21.2/testenv'
FAIL: Test-metalink-xml-size.py
make[4]: Leaving directory '/tmp/B.1vm42abv/BUILD/wget-1.21.2/testenv'
make[4]: Entering directory '/tmp/B.1vm42abv/BUILD/wget-1.21.2/testenv'
FAIL: Test-metalink-xml-nohash.py
make[4]: Leaving directory '/tmp/B.1vm42abv/BUILD/wget-1.21.2/testenv'
make[4]: Entering directory '/tmp/B.1vm42abv/BUILD/wget-1.21.2/testenv'
FAIL: Test-metalink-xml-nourls.py
make[4]: Leaving directory '/tmp/B.1vm42abv/BUILD/wget-1.21.2/testenv'
make[4]: Entering directory '/tmp/B.1vm42abv/BUILD/wget-1.21.2/testenv'
FAIL: Test-metalink-xml-urlbreak.py
make[4]: Leaving directory '/tmp/B.1vm42abv/BUILD/wget-1.21.2/testenv'
make[4]: Entering directory '/tmp/B.1vm42abv/BUILD/wget-1.21.2/testenv'
============================================================================
Testsuite summary for wget 1.21.2
============================================================================
# TOTAL: 77
# PASS:  47
# SKIP:  1
# XFAIL: 0
# FAIL:  29
# XPASS: 0
# ERROR: 0
============================================================================
See testenv/test-suite.log
Please report to bug-wget@gnu.org
============================================================================
make[4]: *** [Makefile:1916: test-suite.log] Error 1
make[4]: Leaving directory '/tmp/B.1vm42abv/BUILD/wget-1.21.2/testenv'
make[3]: *** [Makefile:2024: check-TESTS] Error 2
make[2]: *** [Makefile:2090: check-am] Error 2
make[1]: *** [Makefile:1732: check-recursive] Error 1
make: *** [Makefile:2032: check] Error 2
error: Bad exit status from /tmp/B.1vm42abv/BUILD/tmp/rpm-tmp.lPoQqR (%build)


RPM build errors:
    Could not canonicalize hostname: nereid
    Bad exit status from /tmp/B.1vm42abv/BUILD/tmp/rpm-tmp.lPoQqR (%build)
ended at: Fri Sep 10 01:46:55 2021, done in 0:01:26.770010
error: No files produced.
+ chmod -R u+rwX /tmp/B.1vm42abv/BUILD
+ rm -rf /tmp/B.1vm42abv/tmp /tmp/B.1vm42abv/BUILD
+ rm -rf /tmp/B.1vm42abv
Begin-PLD-Builder-Info
Build-Time: user:127.82s sys:22.51s real:88.70s (faults io:130 non-io:4893248)

End-PLD-Builder-Info
[Back to list of logs] [View rpm -qa of builder]