FailedOk

th/SRPMS[OK]
th/x32[OK]
th/i686[OK]
th/x86_64[OK]

ac/SRPMS[OK]
ac/i386[OK]
ac/i586[OK]
ac/i686[OK]
ac/alpha[OK]
ac/amd64[OK]
ac/athlon[OK]
ac/ppc[OK]
ac/sparc[OK]
ac/sparc64[OK]

Advanced Search
main()
Powered by PLD Linux
(c) 2002-2021 PLD Team
$Revision: 1.37 $
Powered by Leppe'.
Your IP: 3.238.204.31

zbackup 8f960ff8-a997-4188-a067-6378bddf74e1

Status:Failed
Source URL:https://buildlogs.pld-linux.org/pld/th/i686/FAIL/zbackup,8f960ff8-a997-4188-a067-6378bddf74e1.bz2
text/plain URL:View!
rpm -qa of builder:View!
Date:2021/09/27 03:43:39
Runtime:0:00:03.692130

Toc:

  • prep
  • Executing(%prep): /bin/sh -e /tmp/B.l9woqxfi/BUILD/tmp/rpm-tmp.ZuNIkW
  • build
  • Executing(%build): /bin/sh -e /tmp/B.l9woqxfi/BUILD/tmp/rpm-tmp.MMubqN
  • error 1
  • /tmp/B.l9woqxfi/BUILD/zbackup-1.4.4/file.hh:43:5: error: ISO C++17 does not allow dynamic exception specifications
  • error 2
  • /tmp/B.l9woqxfi/BUILD/zbackup-1.4.4/file.hh:46:5: error: ISO C++17 does not allow dynamic exception specifications
  • error 3
  • /tmp/B.l9woqxfi/BUILD/zbackup-1.4.4/file.hh:50:40: error: ISO C++17 does not allow dynamic exception specifications
  • error 4
  • /tmp/B.l9woqxfi/BUILD/zbackup-1.4.4/file.hh:53:26: error: ISO C++17 does not allow dynamic exception specifications
  • error 5
  • /tmp/B.l9woqxfi/BUILD/zbackup-1.4.4/file.hh:57:12: error: ISO C++17 does not allow dynamic exception specifications
  • error 6
  • /tmp/B.l9woqxfi/BUILD/zbackup-1.4.4/file.hh:62:63: error: ISO C++17 does not allow dynamic exception specifications
  • error 7
  • /tmp/B.l9woqxfi/BUILD/zbackup-1.4.4/file.hh:70:47: error: ISO C++17 does not allow dynamic exception specifications
  • error 8
  • /tmp/B.l9woqxfi/BUILD/zbackup-1.4.4/file.hh:73:33: error: ISO C++17 does not allow dynamic exception specifications
  • error 9
  • /tmp/B.l9woqxfi/BUILD/zbackup-1.4.4/file.hh:81:5: error: ISO C++17 does not allow dynamic exception specifications
  • error 10
  • /tmp/B.l9woqxfi/BUILD/zbackup-1.4.4/file.hh:86:59: error: ISO C++17 does not allow dynamic exception specifications
  • error 11
  • /tmp/B.l9woqxfi/BUILD/zbackup-1.4.4/file.hh:90:43: error: ISO C++17 does not allow dynamic exception specifications
  • error 12
  • /tmp/B.l9woqxfi/BUILD/zbackup-1.4.4/file.hh:93:28: error: ISO C++17 does not allow dynamic exception specifications
  • error 13
  • /tmp/B.l9woqxfi/BUILD/zbackup-1.4.4/file.hh:95:31: error: ISO C++17 does not allow dynamic exception specifications
  • error 14
  • /tmp/B.l9woqxfi/BUILD/zbackup-1.4.4/file.hh:97:35: error: ISO C++17 does not allow dynamic exception specifications
  • error 15
  • /tmp/B.l9woqxfi/BUILD/zbackup-1.4.4/file.hh:100:17: error: ISO C++17 does not allow dynamic exception specifications
  • error 16
  • /tmp/B.l9woqxfi/BUILD/zbackup-1.4.4/file.hh:103:17: error: ISO C++17 does not allow dynamic exception specifications
  • error 17
  • /tmp/B.l9woqxfi/BUILD/zbackup-1.4.4/file.hh:106:17: error: ISO C++17 does not allow dynamic exception specifications
  • error 18
  • /tmp/B.l9woqxfi/BUILD/zbackup-1.4.4/file.hh:109:14: error: ISO C++17 does not allow dynamic exception specifications
  • error 19
  • /tmp/B.l9woqxfi/BUILD/zbackup-1.4.4/file.hh:113:17: error: ISO C++17 does not allow dynamic exception specifications
  • error 20
  • /tmp/B.l9woqxfi/BUILD/zbackup-1.4.4/file.hh:117:20: error: ISO C++17 does not allow dynamic exception specifications
  • error 21
  • /tmp/B.l9woqxfi/BUILD/zbackup-1.4.4/file.hh:120:16: error: ISO C++17 does not allow dynamic exception specifications
  • error 22
  • /tmp/B.l9woqxfi/BUILD/zbackup-1.4.4/file.hh:131:44: error: ISO C++17 does not allow dynamic exception specifications
  • error 23
  • /tmp/B.l9woqxfi/BUILD/zbackup-1.4.4/file.hh:135:48: error: ISO C++17 does not allow dynamic exception specifications
  • error 24
  • /tmp/B.l9woqxfi/BUILD/zbackup-1.4.4/file.hh:155:48: error: ISO C++17 does not allow dynamic exception specifications
  • error 25
  • /tmp/B.l9woqxfi/BUILD/zbackup-1.4.4/file.hh:156:27: error: ISO C++17 does not allow dynamic exception specifications
  • error 26
  • /tmp/B.l9woqxfi/BUILD/zbackup-1.4.4/file.hh:157:29: error: ISO C++17 does not allow dynamic exception specifications
  • error 27
  • make[2]: *** [CMakeFiles/zbackup.dir/build.make:120: CMakeFiles/zbackup.dir/backup_exchanger.cc.o] Error 1
  • error 28
  • /tmp/B.l9woqxfi/BUILD/zbackup-1.4.4/unbuffered_file.hh:40:49: error: ISO C++17 does not allow dynamic exception specifications
  • error 29
  • /tmp/B.l9woqxfi/BUILD/zbackup-1.4.4/unbuffered_file.hh:45:42: error: ISO C++17 does not allow dynamic exception specifications
  • error 30
  • /tmp/B.l9woqxfi/BUILD/zbackup-1.4.4/unbuffered_file.hh:48:47: error: ISO C++17 does not allow dynamic exception specifications
  • error 31
  • /tmp/B.l9woqxfi/BUILD/zbackup-1.4.4/unbuffered_file.hh:51:17: error: ISO C++17 does not allow dynamic exception specifications
  • error 32
  • /tmp/B.l9woqxfi/BUILD/zbackup-1.4.4/unbuffered_file.hh:54:26: error: ISO C++17 does not allow dynamic exception specifications
  • error 33
  • make[2]: *** [CMakeFiles/zbackup.dir/build.make:133: CMakeFiles/zbackup.dir/backup_file.cc.o] Error 1
  • error 34
  • /tmp/B.l9woqxfi/BUILD/zbackup-1.4.4/unbuffered_file.hh:40:49: error: ISO C++17 does not allow dynamic exception specifications
  • error 35
  • /tmp/B.l9woqxfi/BUILD/zbackup-1.4.4/unbuffered_file.hh:45:42: error: ISO C++17 does not allow dynamic exception specifications
  • error 36
  • /tmp/B.l9woqxfi/BUILD/zbackup-1.4.4/unbuffered_file.hh:48:47: error: ISO C++17 does not allow dynamic exception specifications
  • error 37
  • /tmp/B.l9woqxfi/BUILD/zbackup-1.4.4/unbuffered_file.hh:51:17: error: ISO C++17 does not allow dynamic exception specifications
  • error 38
  • /tmp/B.l9woqxfi/BUILD/zbackup-1.4.4/unbuffered_file.hh:54:26: error: ISO C++17 does not allow dynamic exception specifications
  • error 39
  • make[2]: *** [CMakeFiles/zbackup.dir/build.make:159: CMakeFiles/zbackup.dir/bundle.cc.o] Error 1
  • error 40
  • /tmp/B.l9woqxfi/BUILD/zbackup-1.4.4/unbuffered_file.hh:40:49: error: ISO C++17 does not allow dynamic exception specifications
  • error 41
  • /tmp/B.l9woqxfi/BUILD/zbackup-1.4.4/unbuffered_file.hh:45:42: error: ISO C++17 does not allow dynamic exception specifications
  • error 42
  • /tmp/B.l9woqxfi/BUILD/zbackup-1.4.4/unbuffered_file.hh:48:47: error: ISO C++17 does not allow dynamic exception specifications
  • error 43
  • /tmp/B.l9woqxfi/BUILD/zbackup-1.4.4/unbuffered_file.hh:51:17: error: ISO C++17 does not allow dynamic exception specifications
  • error 44
  • /tmp/B.l9woqxfi/BUILD/zbackup-1.4.4/unbuffered_file.hh:54:26: error: ISO C++17 does not allow dynamic exception specifications
  • error 45
  • /tmp/B.l9woqxfi/BUILD/zbackup-1.4.4/file.hh:43:5: error: ISO C++17 does not allow dynamic exception specifications
  • error 46
  • /tmp/B.l9woqxfi/BUILD/zbackup-1.4.4/file.hh:46:5: error: ISO C++17 does not allow dynamic exception specifications
  • error 47
  • /tmp/B.l9woqxfi/BUILD/zbackup-1.4.4/file.hh:50:40: error: ISO C++17 does not allow dynamic exception specifications
  • error 48
  • /tmp/B.l9woqxfi/BUILD/zbackup-1.4.4/file.hh:53:26: error: ISO C++17 does not allow dynamic exception specifications
  • error 49
  • /tmp/B.l9woqxfi/BUILD/zbackup-1.4.4/file.hh:57:12: error: ISO C++17 does not allow dynamic exception specifications
  • error 50
  • /tmp/B.l9woqxfi/BUILD/zbackup-1.4.4/file.hh:62:63: error: ISO C++17 does not allow dynamic exception specifications
  • error 51
  • /tmp/B.l9woqxfi/BUILD/zbackup-1.4.4/file.hh:70:47: error: ISO C++17 does not allow dynamic exception specifications
  • error 52
  • /tmp/B.l9woqxfi/BUILD/zbackup-1.4.4/file.hh:73:33: error: ISO C++17 does not allow dynamic exception specifications
  • error 53
  • /tmp/B.l9woqxfi/BUILD/zbackup-1.4.4/file.hh:81:5: error: ISO C++17 does not allow dynamic exception specifications
  • error 54
  • /tmp/B.l9woqxfi/BUILD/zbackup-1.4.4/file.hh:86:59: error: ISO C++17 does not allow dynamic exception specifications
  • error 55
  • /tmp/B.l9woqxfi/BUILD/zbackup-1.4.4/file.hh:90:43: error: ISO C++17 does not allow dynamic exception specifications
  • error 56
  • /tmp/B.l9woqxfi/BUILD/zbackup-1.4.4/file.hh:93:28: error: ISO C++17 does not allow dynamic exception specifications
  • error 57
  • /tmp/B.l9woqxfi/BUILD/zbackup-1.4.4/file.hh:95:31: error: ISO C++17 does not allow dynamic exception specifications
  • error 58
  • /tmp/B.l9woqxfi/BUILD/zbackup-1.4.4/file.hh:97:35: error: ISO C++17 does not allow dynamic exception specifications
  • error 59
  • /tmp/B.l9woqxfi/BUILD/zbackup-1.4.4/file.hh:100:17: error: ISO C++17 does not allow dynamic exception specifications
  • error 60
  • /tmp/B.l9woqxfi/BUILD/zbackup-1.4.4/file.hh:103:17: error: ISO C++17 does not allow dynamic exception specifications
  • error 61
  • /tmp/B.l9woqxfi/BUILD/zbackup-1.4.4/file.hh:106:17: error: ISO C++17 does not allow dynamic exception specifications
  • error 62
  • /tmp/B.l9woqxfi/BUILD/zbackup-1.4.4/file.hh:109:14: error: ISO C++17 does not allow dynamic exception specifications
  • error 63
  • /tmp/B.l9woqxfi/BUILD/zbackup-1.4.4/file.hh:113:17: error: ISO C++17 does not allow dynamic exception specifications
  • error 64
  • /tmp/B.l9woqxfi/BUILD/zbackup-1.4.4/file.hh:117:20: error: ISO C++17 does not allow dynamic exception specifications
  • error 65
  • /tmp/B.l9woqxfi/BUILD/zbackup-1.4.4/file.hh:120:16: error: ISO C++17 does not allow dynamic exception specifications
  • error 66
  • /tmp/B.l9woqxfi/BUILD/zbackup-1.4.4/file.hh:131:44: error: ISO C++17 does not allow dynamic exception specifications
  • error 67
  • /tmp/B.l9woqxfi/BUILD/zbackup-1.4.4/file.hh:135:48: error: ISO C++17 does not allow dynamic exception specifications
  • error 68
  • /tmp/B.l9woqxfi/BUILD/zbackup-1.4.4/file.hh:155:48: error: ISO C++17 does not allow dynamic exception specifications
  • error 69
  • /tmp/B.l9woqxfi/BUILD/zbackup-1.4.4/file.hh:156:27: error: ISO C++17 does not allow dynamic exception specifications
  • error 70
  • /tmp/B.l9woqxfi/BUILD/zbackup-1.4.4/file.hh:157:29: error: ISO C++17 does not allow dynamic exception specifications
  • error 71
  • make[2]: *** [CMakeFiles/zbackup.dir/build.make:185: CMakeFiles/zbackup.dir/chunk_index.cc.o] Error 1
  • error 72
  • /tmp/B.l9woqxfi/BUILD/zbackup-1.4.4/unbuffered_file.hh:40:49: error: ISO C++17 does not allow dynamic exception specifications
  • error 73
  • /tmp/B.l9woqxfi/BUILD/zbackup-1.4.4/unbuffered_file.hh:45:42: error: ISO C++17 does not allow dynamic exception specifications
  • error 74
  • /tmp/B.l9woqxfi/BUILD/zbackup-1.4.4/unbuffered_file.hh:48:47: error: ISO C++17 does not allow dynamic exception specifications
  • error 75
  • /tmp/B.l9woqxfi/BUILD/zbackup-1.4.4/unbuffered_file.hh:51:17: error: ISO C++17 does not allow dynamic exception specifications
  • error 76
  • /tmp/B.l9woqxfi/BUILD/zbackup-1.4.4/unbuffered_file.hh:54:26: error: ISO C++17 does not allow dynamic exception specifications
  • error 77
  • /tmp/B.l9woqxfi/BUILD/zbackup-1.4.4/file.hh:43:5: error: ISO C++17 does not allow dynamic exception specifications
  • error 78
  • /tmp/B.l9woqxfi/BUILD/zbackup-1.4.4/file.hh:46:5: error: ISO C++17 does not allow dynamic exception specifications
  • error 79
  • /tmp/B.l9woqxfi/BUILD/zbackup-1.4.4/file.hh:50:40: error: ISO C++17 does not allow dynamic exception specifications
  • error 80
  • /tmp/B.l9woqxfi/BUILD/zbackup-1.4.4/file.hh:53:26: error: ISO C++17 does not allow dynamic exception specifications
  • error 81
  • /tmp/B.l9woqxfi/BUILD/zbackup-1.4.4/file.hh:57:12: error: ISO C++17 does not allow dynamic exception specifications
  • error 82
  • /tmp/B.l9woqxfi/BUILD/zbackup-1.4.4/file.hh:62:63: error: ISO C++17 does not allow dynamic exception specifications
  • error 83
  • /tmp/B.l9woqxfi/BUILD/zbackup-1.4.4/file.hh:70:47: error: ISO C++17 does not allow dynamic exception specifications
  • error 84
  • /tmp/B.l9woqxfi/BUILD/zbackup-1.4.4/file.hh:73:33: error: ISO C++17 does not allow dynamic exception specifications
  • error 85
  • /tmp/B.l9woqxfi/BUILD/zbackup-1.4.4/file.hh:81:5: error: ISO C++17 does not allow dynamic exception specifications
  • error 86
  • /tmp/B.l9woqxfi/BUILD/zbackup-1.4.4/file.hh:86:59: error: ISO C++17 does not allow dynamic exception specifications
  • error 87
  • /tmp/B.l9woqxfi/BUILD/zbackup-1.4.4/file.hh:90:43: error: ISO C++17 does not allow dynamic exception specifications
  • error 88
  • /tmp/B.l9woqxfi/BUILD/zbackup-1.4.4/file.hh:93:28: error: ISO C++17 does not allow dynamic exception specifications
  • error 89
  • /tmp/B.l9woqxfi/BUILD/zbackup-1.4.4/file.hh:95:31: error: ISO C++17 does not allow dynamic exception specifications
  • error 90
  • /tmp/B.l9woqxfi/BUILD/zbackup-1.4.4/file.hh:97:35: error: ISO C++17 does not allow dynamic exception specifications
  • error 91
  • /tmp/B.l9woqxfi/BUILD/zbackup-1.4.4/file.hh:100:17: error: ISO C++17 does not allow dynamic exception specifications
  • error 92
  • /tmp/B.l9woqxfi/BUILD/zbackup-1.4.4/file.hh:103:17: error: ISO C++17 does not allow dynamic exception specifications
  • error 93
  • /tmp/B.l9woqxfi/BUILD/zbackup-1.4.4/file.hh:106:17: error: ISO C++17 does not allow dynamic exception specifications
  • error 94
  • /tmp/B.l9woqxfi/BUILD/zbackup-1.4.4/file.hh:109:14: error: ISO C++17 does not allow dynamic exception specifications
  • error 95
  • /tmp/B.l9woqxfi/BUILD/zbackup-1.4.4/file.hh:113:17: error: ISO C++17 does not allow dynamic exception specifications
  • error 96
  • /tmp/B.l9woqxfi/BUILD/zbackup-1.4.4/file.hh:117:20: error: ISO C++17 does not allow dynamic exception specifications
  • error 97
  • /tmp/B.l9woqxfi/BUILD/zbackup-1.4.4/file.hh:120:16: error: ISO C++17 does not allow dynamic exception specifications
  • error 98
  • /tmp/B.l9woqxfi/BUILD/zbackup-1.4.4/file.hh:131:44: error: ISO C++17 does not allow dynamic exception specifications
  • error 99
  • /tmp/B.l9woqxfi/BUILD/zbackup-1.4.4/file.hh:135:48: error: ISO C++17 does not allow dynamic exception specifications
  • error 100
  • /tmp/B.l9woqxfi/BUILD/zbackup-1.4.4/file.hh:155:48: error: ISO C++17 does not allow dynamic exception specifications
  • error 101
  • /tmp/B.l9woqxfi/BUILD/zbackup-1.4.4/file.hh:156:27: error: ISO C++17 does not allow dynamic exception specifications
  • error 102
  • /tmp/B.l9woqxfi/BUILD/zbackup-1.4.4/file.hh:157:29: error: ISO C++17 does not allow dynamic exception specifications
  • error 103
  • make[2]: *** [CMakeFiles/zbackup.dir/build.make:146: CMakeFiles/zbackup.dir/backup_restorer.cc.o] Error 1
  • error 104
  • /tmp/B.l9woqxfi/BUILD/zbackup-1.4.4/unbuffered_file.hh:40:49: error: ISO C++17 does not allow dynamic exception specifications
  • error 105
  • /tmp/B.l9woqxfi/BUILD/zbackup-1.4.4/unbuffered_file.hh:45:42: error: ISO C++17 does not allow dynamic exception specifications
  • error 106
  • /tmp/B.l9woqxfi/BUILD/zbackup-1.4.4/unbuffered_file.hh:48:47: error: ISO C++17 does not allow dynamic exception specifications
  • error 107
  • /tmp/B.l9woqxfi/BUILD/zbackup-1.4.4/unbuffered_file.hh:51:17: error: ISO C++17 does not allow dynamic exception specifications
  • error 108
  • /tmp/B.l9woqxfi/BUILD/zbackup-1.4.4/unbuffered_file.hh:54:26: error: ISO C++17 does not allow dynamic exception specifications
  • error 109
  • /tmp/B.l9woqxfi/BUILD/zbackup-1.4.4/file.hh:43:5: error: ISO C++17 does not allow dynamic exception specifications
  • error 110
  • /tmp/B.l9woqxfi/BUILD/zbackup-1.4.4/file.hh:46:5: error: ISO C++17 does not allow dynamic exception specifications
  • error 111
  • /tmp/B.l9woqxfi/BUILD/zbackup-1.4.4/file.hh:50:40: error: ISO C++17 does not allow dynamic exception specifications
  • error 112
  • /tmp/B.l9woqxfi/BUILD/zbackup-1.4.4/file.hh:53:26: error: ISO C++17 does not allow dynamic exception specifications
  • error 113
  • /tmp/B.l9woqxfi/BUILD/zbackup-1.4.4/file.hh:57:12: error: ISO C++17 does not allow dynamic exception specifications
  • error 114
  • /tmp/B.l9woqxfi/BUILD/zbackup-1.4.4/file.hh:62:63: error: ISO C++17 does not allow dynamic exception specifications
  • error 115
  • /tmp/B.l9woqxfi/BUILD/zbackup-1.4.4/file.hh:70:47: error: ISO C++17 does not allow dynamic exception specifications
  • error 116
  • /tmp/B.l9woqxfi/BUILD/zbackup-1.4.4/file.hh:73:33: error: ISO C++17 does not allow dynamic exception specifications
  • error 117
  • /tmp/B.l9woqxfi/BUILD/zbackup-1.4.4/file.hh:81:5: error: ISO C++17 does not allow dynamic exception specifications
  • error 118
  • /tmp/B.l9woqxfi/BUILD/zbackup-1.4.4/file.hh:86:59: error: ISO C++17 does not allow dynamic exception specifications
  • error 119
  • /tmp/B.l9woqxfi/BUILD/zbackup-1.4.4/file.hh:90:43: error: ISO C++17 does not allow dynamic exception specifications
  • error 120
  • /tmp/B.l9woqxfi/BUILD/zbackup-1.4.4/file.hh:93:28: error: ISO C++17 does not allow dynamic exception specifications
  • error 121
  • /tmp/B.l9woqxfi/BUILD/zbackup-1.4.4/file.hh:95:31: error: ISO C++17 does not allow dynamic exception specifications
  • error 122
  • /tmp/B.l9woqxfi/BUILD/zbackup-1.4.4/file.hh:97:35: error: ISO C++17 does not allow dynamic exception specifications
  • error 123
  • /tmp/B.l9woqxfi/BUILD/zbackup-1.4.4/file.hh:100:17: error: ISO C++17 does not allow dynamic exception specifications
  • error 124
  • /tmp/B.l9woqxfi/BUILD/zbackup-1.4.4/file.hh:103:17: error: ISO C++17 does not allow dynamic exception specifications
  • error 125
  • /tmp/B.l9woqxfi/BUILD/zbackup-1.4.4/file.hh:106:17: error: ISO C++17 does not allow dynamic exception specifications
  • error 126
  • /tmp/B.l9woqxfi/BUILD/zbackup-1.4.4/file.hh:109:14: error: ISO C++17 does not allow dynamic exception specifications
  • error 127
  • /tmp/B.l9woqxfi/BUILD/zbackup-1.4.4/file.hh:113:17: error: ISO C++17 does not allow dynamic exception specifications
  • error 128
  • /tmp/B.l9woqxfi/BUILD/zbackup-1.4.4/file.hh:117:20: error: ISO C++17 does not allow dynamic exception specifications
  • error 129
  • /tmp/B.l9woqxfi/BUILD/zbackup-1.4.4/file.hh:120:16: error: ISO C++17 does not allow dynamic exception specifications
  • error 130
  • /tmp/B.l9woqxfi/BUILD/zbackup-1.4.4/file.hh:131:44: error: ISO C++17 does not allow dynamic exception specifications
  • error 131
  • /tmp/B.l9woqxfi/BUILD/zbackup-1.4.4/file.hh:135:48: error: ISO C++17 does not allow dynamic exception specifications
  • error 132
  • /tmp/B.l9woqxfi/BUILD/zbackup-1.4.4/file.hh:155:48: error: ISO C++17 does not allow dynamic exception specifications
  • error 133
  • /tmp/B.l9woqxfi/BUILD/zbackup-1.4.4/file.hh:156:27: error: ISO C++17 does not allow dynamic exception specifications
  • error 134
  • /tmp/B.l9woqxfi/BUILD/zbackup-1.4.4/file.hh:157:29: error: ISO C++17 does not allow dynamic exception specifications
  • error 135
  • make[2]: *** [CMakeFiles/zbackup.dir/build.make:107: CMakeFiles/zbackup.dir/backup_creator.cc.o] Error 1
  • error 136
  • /tmp/B.l9woqxfi/BUILD/zbackup-1.4.4/unbuffered_file.hh:40:49: error: ISO C++17 does not allow dynamic exception specifications
  • error 137
  • /tmp/B.l9woqxfi/BUILD/zbackup-1.4.4/unbuffered_file.hh:45:42: error: ISO C++17 does not allow dynamic exception specifications
  • error 138
  • /tmp/B.l9woqxfi/BUILD/zbackup-1.4.4/unbuffered_file.hh:48:47: error: ISO C++17 does not allow dynamic exception specifications
  • error 139
  • /tmp/B.l9woqxfi/BUILD/zbackup-1.4.4/unbuffered_file.hh:51:17: error: ISO C++17 does not allow dynamic exception specifications
  • error 140
  • /tmp/B.l9woqxfi/BUILD/zbackup-1.4.4/unbuffered_file.hh:54:26: error: ISO C++17 does not allow dynamic exception specifications
  • error 141
  • /tmp/B.l9woqxfi/BUILD/zbackup-1.4.4/file.hh:43:5: error: ISO C++17 does not allow dynamic exception specifications
  • error 142
  • /tmp/B.l9woqxfi/BUILD/zbackup-1.4.4/file.hh:46:5: error: ISO C++17 does not allow dynamic exception specifications
  • error 143
  • /tmp/B.l9woqxfi/BUILD/zbackup-1.4.4/file.hh:50:40: error: ISO C++17 does not allow dynamic exception specifications
  • error 144
  • /tmp/B.l9woqxfi/BUILD/zbackup-1.4.4/file.hh:53:26: error: ISO C++17 does not allow dynamic exception specifications
  • error 145
  • /tmp/B.l9woqxfi/BUILD/zbackup-1.4.4/file.hh:57:12: error: ISO C++17 does not allow dynamic exception specifications
  • error 146
  • /tmp/B.l9woqxfi/BUILD/zbackup-1.4.4/file.hh:62:63: error: ISO C++17 does not allow dynamic exception specifications
  • error 147
  • /tmp/B.l9woqxfi/BUILD/zbackup-1.4.4/file.hh:70:47: error: ISO C++17 does not allow dynamic exception specifications
  • error 148
  • /tmp/B.l9woqxfi/BUILD/zbackup-1.4.4/file.hh:73:33: error: ISO C++17 does not allow dynamic exception specifications
  • error 149
  • /tmp/B.l9woqxfi/BUILD/zbackup-1.4.4/file.hh:81:5: error: ISO C++17 does not allow dynamic exception specifications
  • error 150
  • /tmp/B.l9woqxfi/BUILD/zbackup-1.4.4/file.hh:86:59: error: ISO C++17 does not allow dynamic exception specifications
  • error 151
  • /tmp/B.l9woqxfi/BUILD/zbackup-1.4.4/file.hh:90:43: error: ISO C++17 does not allow dynamic exception specifications
  • error 152
  • /tmp/B.l9woqxfi/BUILD/zbackup-1.4.4/file.hh:93:28: error: ISO C++17 does not allow dynamic exception specifications
  • error 153
  • /tmp/B.l9woqxfi/BUILD/zbackup-1.4.4/file.hh:95:31: error: ISO C++17 does not allow dynamic exception specifications
  • error 154
  • /tmp/B.l9woqxfi/BUILD/zbackup-1.4.4/file.hh:97:35: error: ISO C++17 does not allow dynamic exception specifications
  • error 155
  • /tmp/B.l9woqxfi/BUILD/zbackup-1.4.4/file.hh:100:17: error: ISO C++17 does not allow dynamic exception specifications
  • error 156
  • /tmp/B.l9woqxfi/BUILD/zbackup-1.4.4/file.hh:103:17: error: ISO C++17 does not allow dynamic exception specifications
  • error 157
  • /tmp/B.l9woqxfi/BUILD/zbackup-1.4.4/file.hh:106:17: error: ISO C++17 does not allow dynamic exception specifications
  • error 158
  • /tmp/B.l9woqxfi/BUILD/zbackup-1.4.4/file.hh:109:14: error: ISO C++17 does not allow dynamic exception specifications
  • error 159
  • /tmp/B.l9woqxfi/BUILD/zbackup-1.4.4/file.hh:113:17: error: ISO C++17 does not allow dynamic exception specifications
  • error 160
  • /tmp/B.l9woqxfi/BUILD/zbackup-1.4.4/file.hh:117:20: error: ISO C++17 does not allow dynamic exception specifications
  • error 161
  • /tmp/B.l9woqxfi/BUILD/zbackup-1.4.4/file.hh:120:16: error: ISO C++17 does not allow dynamic exception specifications
  • error 162
  • /tmp/B.l9woqxfi/BUILD/zbackup-1.4.4/file.hh:131:44: error: ISO C++17 does not allow dynamic exception specifications
  • error 163
  • /tmp/B.l9woqxfi/BUILD/zbackup-1.4.4/file.hh:135:48: error: ISO C++17 does not allow dynamic exception specifications
  • error 164
  • /tmp/B.l9woqxfi/BUILD/zbackup-1.4.4/file.hh:155:48: error: ISO C++17 does not allow dynamic exception specifications
  • error 165
  • /tmp/B.l9woqxfi/BUILD/zbackup-1.4.4/file.hh:156:27: error: ISO C++17 does not allow dynamic exception specifications
  • error 166
  • /tmp/B.l9woqxfi/BUILD/zbackup-1.4.4/file.hh:157:29: error: ISO C++17 does not allow dynamic exception specifications
  • error 167
  • /usr/include/c++/11.2.0/bits/stl_tree.h:770:15: error: static assertion failed: comparison object must be invocable as const
  • error 168
  • make[2]: *** [CMakeFiles/zbackup.dir/build.make:198: CMakeFiles/zbackup.dir/chunk_storage.cc.o] Error 1
  • error 169
  • make[1]: *** [CMakeFiles/Makefile2:99: CMakeFiles/zbackup.dir/all] Error 2
  • error 170
  • error: Bad exit status from /tmp/B.l9woqxfi/BUILD/tmp/rpm-tmp.MMubqN (%build)
  • error 171
  • RPM build errors:
  • error 172
  • error: No files produced.

Content:

request from: baggins
checking if we should skip the build
started at: Mon Sep 27 03:43:34 2021
killing old processes on a builder
sending signal 9 to pid -1
cleaning up /tmp
fetching https://srcbuilder.pld-linux.org/th//srpms/8f960ff8-a997-4188-a067-6378bddf74e1/zbackup-1.4.4-11.src.rpm
fetched 99296 bytes, 379.9 K/s
installing srpm: zbackup-1.4.4-11.src.rpm
+ install -d /tmp/B.l9woqxfi/BUILD /tmp/B.l9woqxfi/RPMS
+ LC_ALL=en_US.UTF-8
+ rpm -qp --changelog zbackup-1.4.4-11.src.rpm
* Mon Sep 27 2021 PLD Linux Team <feedback@pld-linux.org>
- For complete changelog see: http://git.pld-linux.org/?p=packages/zbackup.git;a=log;h=master
* Thu Jan 21 2021 Jan Rękorajski <baggins@pld-linux.org> 17403f8
- release 11 (by relup.sh) * Wed Sep 23 2020 Jakub Bogusz <qboosh@pld-linux.org> f9f9522
- release 10 (protobuf 3.13) * Mon Jun 01 2020 Jan Rękorajski <baggins@pld-linux.org> bb62a3f
- release 9 (by relup.sh) * Wed Apr 08 2020 Jan Rękorajski <baggins@pld-linux.org> 0275dd1
- release 8 (by relup.sh) * Fri Aug 02 2019 Jakub Bogusz <qboosh@pld-linux.org> a0c197f
- release 7 (rebuild with protobuf 3.9) * Sat Mar 16 2019 Jan Rękorajski <baggins@pld-linux.org> d60ca23
- release 6 (by relup.sh) * Thu Oct 18 2018 Adam Gołębiowski <adamg@pld-linux.org> 19bbc3d
- release 5, rebuild against protobuf 3.6 * Sat Sep 15 2018 Arkadiusz Miśkiewicz <arekm@maven.pl> 97f51e7
- release 4 (by relup.sh) * Wed Dec 13 2017 Jan Rękorajski <baggins@pld-linux.org> f87f2a4
- release 3 (by relup.sh) * Mon Apr 17 2017 Jan Rękorajski <baggins@pld-linux.org> 5fc7b95
- rebuild with protobuf 3.2 - release 2 (by relup.sh) * Tue Nov 17 2015 Andrzej Zawadzki <zawadaa@pld-linux.org> 2a4e988
- up to 1.4.4 * Tue Nov 17 2015 Arkadiusz Miśkiewicz <arekm@maven.pl> fe85304
- release 2 (by relup.sh) * Sun Feb 08 2015 Andrzej Zawadzki <zawadaa@pld-linux.org> b16c0d6
- up to 1.4.1 * Sun Nov 09 2014 Andrzej Zawadzki <zawadaa@pld-linux.org> 1b50819
- up to 1.3 * Tue Oct 28 2014 Jan Rękorajski <baggins@pld-linux.org> a005c95
- release 2 (by relup.sh) * Tue Feb 25 2014 Elan Ruusamäe <glen@delfi.ee> ac53129
- use out of tree build * Thu Oct 17 2013 Elan Ruusamäe <glen@delfi.ee> 4c9d5b7
- why start with epoch 1? fixed encoding errors; cleanup/adapter * Thu Oct 17 2013 Andrzej Zawadzki <zawadaa@pld-linux.org> cc83ce3
- initial zbackup is a globally-deduplicating backup tool, based on the ideas found in rsync. Feed a large .tar into it, and it will store duplicate regions of it only once, then compress and optionally encrypt the result. Feed another .tar file, and it will also re-use any data found in any previous backups. This way only new changes are stored, and as long as the files are not very different, the amount of storage required is very low. Any of the backup files stored previously can be read back in full at any time. The program is format-agnostic, so you can feed virtually any files to it (any types of archives, proprietary formats, even raw disk images -- but see Caveats). + rpm -Uhv --nodeps --define '_topdir /tmp/B.l9woqxfi' --define '_specdir %{_topdir}' --define '_sourcedir %{_specdir}' --define '_rpmdir %{_topdir}/RPMS' --define '_builddir %{_topdir}/BUILD' zbackup-1.4.4-11.src.rpm Updating / installing... zbackup-1.4.4-11 ######################################## + rm -f zbackup-1.4.4-11.src.rpm + install -m 700 -d /tmp/B.l9woqxfi/BUILD/tmp + TMPDIR=/tmp/B.l9woqxfi/BUILD/tmp + exec nice -n 0 rpmbuild -bp --short-circuit --nodeps --define '_topdir /tmp/B.l9woqxfi' --define '_specdir %{_topdir}' --define '_sourcedir %{_specdir}' --define '_rpmdir %{_topdir}/RPMS' --define '_builddir %{_topdir}/BUILD' --target i686-pld-linux --define 'prep exit 0' /tmp/B.l9woqxfi/zbackup.spec warning: Macro expanded in comment on line 9: %{version}/%{name}-%{version}.tar.gz warning: Could not canonicalize hostname: nereid Building target platforms: i686-pld-linux Building for target i686-pld-linux checking BuildConflict-ing packages rpm: warning: Macro expanded in comment on line 9: %{version}/%{name}-%{version}.tar.gz rpm: rpm: warning: Could not canonicalize hostname: nereid rpm: Building target platforms: i686-pld-linux rpm: Building for target i686-pld-linux no BuildConflicts found checking BR rpm: warning: Macro expanded in comment on line 9: %{version}/%{name}-%{version}.tar.gz rpm: rpm: warning: Could not canonicalize hostname: nereid rpm: Building target platforms: i686-pld-linux rpm: Building for target i686-pld-linux no BR needed building RPM using: set -ex; : build-id: 8f960ff8-a997-4188-a067-6378bddf74e1; TMPDIR=/tmp/B.l9woqxfi/BUILD/tmp exec nice -n 0 rpmbuild -bb --define '_smp_mflags -j9' --define '_make_opts -Otarget' --define '_pld_builder 1' --define '_topdir /tmp/B.l9woqxfi' --define '_specdir %{_topdir}' --define '_sourcedir %{_specdir}' --define '_rpmdir %{_topdir}/RPMS' --define '_builddir %{_topdir}/BUILD' --target i686-pld-linux /tmp/B.l9woqxfi/zbackup.spec + : build-id: 8f960ff8-a997-4188-a067-6378bddf74e1 + TMPDIR=/tmp/B.l9woqxfi/BUILD/tmp + exec nice -n 0 rpmbuild -bb --define '_smp_mflags -j9' --define '_make_opts -Otarget' --define '_pld_builder 1' --define '_topdir /tmp/B.l9woqxfi' --define '_specdir %{_topdir}' --define '_sourcedir %{_specdir}' --define '_rpmdir %{_topdir}/RPMS' --define '_builddir %{_topdir}/BUILD' --target i686-pld-linux /tmp/B.l9woqxfi/zbackup.spec warning: Macro expanded in comment on line 9: %{version}/%{name}-%{version}.tar.gz warning: Could not canonicalize hostname: nereid Building target platforms: i686-pld-linux Building for target i686-pld-linux Executing(%prep): /bin/sh -e /tmp/B.l9woqxfi/BUILD/tmp/rpm-tmp.ZuNIkW + umask 022 + cd /tmp/B.l9woqxfi/BUILD + cd /tmp/B.l9woqxfi/BUILD + rm -rf zbackup-1.4.4 + /bin/gzip -dc /tmp/B.l9woqxfi/1.4.4.tar.gz + /bin/tar -xof - + STATUS=0 + '[' 0 -ne 0 ']' + cd zbackup-1.4.4 + /bin/chmod -Rf a+rX,u+w,g-w,o-w . + RPM_EC=0 + jobs -p + exit 0 Executing(%build): /bin/sh -e /tmp/B.l9woqxfi/BUILD/tmp/rpm-tmp.MMubqN TMP=/home/users/builder/tmp HOME=/home/users/builder PATH=/home/users/builder/GNUstep/Tools:/bin:/usr/bin:/usr/local/bin:/home/users/builder/bin TMPDIR=/tmp/B.l9woqxfi/BUILD/tmp + umask 022 + cd /tmp/B.l9woqxfi/BUILD + cd zbackup-1.4.4 + install -d build + cd build + CC=i686-pld-linux-gcc CXX=i686-pld-linux-g++ CPPFLAGS='' /usr/bin/cmake '-DCMAKE_VERBOSE_MAKEFILE:BOOL=ON' '-DCMAKE_BUILD_TYPE=PLD' '-DCMAKE_INSTALL_BINDIR:PATH=/usr/bin' '-DCMAKE_INSTALL_SBINDIR:PATH=/usr/sbin' '-DCMAKE_INSTALL_LIBEXECDIR:PATH=/usr/libexec' '-DCMAKE_INSTALL_SYSCONFDIR:PATH=/etc' '-DCMAKE_INSTALL_SHAREDSTATEDIRPATH:PATH=/var/lib' '-DCMAKE_INSTALL_LOCALSTATEDIRPATH:PATH=/var' '-DCMAKE_INSTALL_LIBDIR:PATH=/usr/lib' '-DCMAKE_INSTALL_INCLUDEDIR:PATH=/usr/include' '-DCMAKE_INSTALL_OLDINCLUDEDIR:PATH=/usr/include' '-DCMAKE_INSTALL_DATAROOTDIR:PATH=/usr/share' '-DCMAKE_INSTALL_DATADIR:PATH=/usr/share' '-DCMAKE_INSTALL_INFODIR:PATH=/usr/share/info' '-DCMAKE_INSTALL_LOCALEDIR:PATH=/usr/share/locale' '-DCMAKE_INSTALL_MANDIR:PATH=/usr/share/man' '-DCMAKE_INSTALL_DOCDIR:PATH=/usr/share/doc' '-DCMAKE_INSTALL_PREFIX:PATH=/usr' '-DSYSCONF_INSTALL_DIR:PATH=/etc' '-DCMAKE_CXX_FLAGS_PLD=-O2 -fwrapv -pipe -Wformat -Werror=format-security -gdwarf-4 -fno-debug-types-section -fvar-tracking-assignments -g2 -Wp,-D_FORTIFY_SOURCE=2 -fstack-protector-strong --param=ssp-buffer-size=4 -Werror=trampolines -fomit-frame-pointer -march=i686 -fasynchronous-unwind-tables -mtune=pentium4 -gdwarf-4 -fno-debug-types-section -fvar-tracking-assignments -g2 -DNDEBUG -DQT_NO_DEBUG' '-DCMAKE_C_FLAGS_PLD=-O2 -fwrapv -pipe -Wformat -Werror=format-security -gdwarf-4 -fno-debug-types-section -fvar-tracking-assignments -g2 -Wp,-D_FORTIFY_SOURCE=2 -fstack-protector-strong --param=ssp-buffer-size=4 -Werror=trampolines -fomit-frame-pointer -march=i686 -fasynchronous-unwind-tables -mtune=pentium4 -gdwarf-4 -fno-debug-types-section -fvar-tracking-assignments -g2 -DNDEBUG -DQT_NO_DEBUG' '-DCMAKE_Fortran_FLAGS_PLD=-O2 -fwrapv -pipe -Wformat -Werror=format-security -gdwarf-4 -fno-debug-types-section -fvar-tracking-assignments -g2 -Wp,-D_FORTIFY_SOURCE=2 -fstack-protector-strong --param=ssp-buffer-size=4 -Werror=trampolines -fomit-frame-pointer -march=i686 -fasynchronous-unwind-tables -mtune=pentium4 -gdwarf-4 -fno-debug-types-section -fvar-tracking-assignments -g2 -DNDEBUG -DQT_NO_DEBUG' '-DCMAKE_EXE_LINKER_FLAGS_PLD=-Wl,--as-needed -Wl,--no-copy-dt-needed-entries -Wl,-z,relro -Wl,-z,combreloc ' '-DCMAKE_SHARED_LINKER_FLAGS_PLD=-Wl,--as-needed -Wl,--no-copy-dt-needed-entries -Wl,-z,relro -Wl,-z,combreloc ' '-DCMAKE_MODULE_LINKER_FLAGS_PLD=-Wl,--as-needed -Wl,--no-copy-dt-needed-entries -Wl,-z,relro -Wl,-z,combreloc ' '-DBUILD_SHARED_LIBS:BOOL=ON' .. -- The C compiler identification is GNU 11.2.0 -- The CXX compiler identification is GNU 11.2.0 -- Check for working C compiler: /usr/bin/i686-pld-linux-gcc -- Check for working C compiler: /usr/bin/i686-pld-linux-gcc - works -- Detecting C compiler ABI info -- Detecting C compiler ABI info - done -- Detecting C compile features -- Detecting C compile features - done -- Check for working CXX compiler: /usr/bin/i686-pld-linux-g++ -- Check for working CXX compiler: /usr/bin/i686-pld-linux-g++ - works -- Detecting CXX compiler ABI info -- Detecting CXX compiler ABI info - done -- Detecting CXX compile features -- Detecting CXX compile features - done -- Found ZLIB: /usr/lib/libz.so (found version "1.2.11") -- Found OpenSSL: /usr/lib/libcrypto.so -- Found Protobuf: /usr/lib/libprotobuf.so (found version "3.14.0") -- Found Threads: TRUE -- Looking for lzma_auto_decoder in /usr/lib/liblzma.so -- Looking for lzma_auto_decoder in /usr/lib/liblzma.so - found -- Looking for lzma_easy_encoder in /usr/lib/liblzma.so -- Looking for lzma_easy_encoder in /usr/lib/liblzma.so - found -- Looking for lzma_lzma_preset in /usr/lib/liblzma.so -- Looking for lzma_lzma_preset in /usr/lib/liblzma.so - found -- Found LibLZMA: /usr/include -- Looking for lzo1x_decompress_safe in /usr/lib/liblzo2.so -- Looking for lzo1x_decompress_safe in /usr/lib/liblzo2.so - found -- Looking for lzo1x_1_compress in /usr/lib/liblzo2.so -- Looking for lzo1x_1_compress in /usr/lib/liblzo2.so - found -- Found LibLZO: /usr/include -- Configuring done -- Generating done CMake Warning: Manually-specified variables were not used by the project: CMAKE_Fortran_FLAGS_PLD CMAKE_INSTALL_BINDIR CMAKE_INSTALL_DATADIR CMAKE_INSTALL_DATAROOTDIR CMAKE_INSTALL_DOCDIR CMAKE_INSTALL_INCLUDEDIR CMAKE_INSTALL_INFODIR CMAKE_INSTALL_LIBDIR CMAKE_INSTALL_LIBEXECDIR CMAKE_INSTALL_LOCALEDIR CMAKE_INSTALL_LOCALSTATEDIRPATH CMAKE_INSTALL_MANDIR CMAKE_INSTALL_OLDINCLUDEDIR CMAKE_INSTALL_SBINDIR CMAKE_INSTALL_SHAREDSTATEDIRPATH CMAKE_INSTALL_SYSCONFDIR SYSCONF_INSTALL_DIR -- Build files have been written to: /tmp/B.l9woqxfi/BUILD/zbackup-1.4.4/build + /usr/bin/make -Otarget -j9 /usr/bin/cmake -S/tmp/B.l9woqxfi/BUILD/zbackup-1.4.4 -B/tmp/B.l9woqxfi/BUILD/zbackup-1.4.4/build --check-build-system CMakeFiles/Makefile.cmake 0 /usr/bin/cmake -E cmake_progress_start /tmp/B.l9woqxfi/BUILD/zbackup-1.4.4/build/CMakeFiles /tmp/B.l9woqxfi/BUILD/zbackup-1.4.4/build/CMakeFiles/progress.marks /usr/bin/make -f CMakeFiles/Makefile2 all /usr/bin/make -f CMakeFiles/zbackup.dir/build.make CMakeFiles/zbackup.dir/depend make[2]: Entering directory '/tmp/B.l9woqxfi/BUILD/zbackup-1.4.4/build' [ 2%] Running cpp protocol buffer compiler on zbackup.proto /usr/bin/protoc --cpp_out /tmp/B.l9woqxfi/BUILD/zbackup-1.4.4/build -I /tmp/B.l9woqxfi/BUILD/zbackup-1.4.4 /tmp/B.l9woqxfi/BUILD/zbackup-1.4.4/zbackup.proto [libprotobuf WARNING google/protobuf/compiler/parser.cc:648] No syntax specified for the proto file: zbackup.proto. Please use 'syntax = "proto2";' or 'syntax = "proto3";' to specify a syntax version. (Defaulted to proto2 syntax.) make[2]: Leaving directory '/tmp/B.l9woqxfi/BUILD/zbackup-1.4.4/build' make[2]: Entering directory '/tmp/B.l9woqxfi/BUILD/zbackup-1.4.4/build' cd /tmp/B.l9woqxfi/BUILD/zbackup-1.4.4/build && /usr/bin/cmake -E cmake_depends "Unix Makefiles" /tmp/B.l9woqxfi/BUILD/zbackup-1.4.4 /tmp/B.l9woqxfi/BUILD/zbackup-1.4.4 /tmp/B.l9woqxfi/BUILD/zbackup-1.4.4/build /tmp/B.l9woqxfi/BUILD/zbackup-1.4.4/build /tmp/B.l9woqxfi/BUILD/zbackup-1.4.4/build/CMakeFiles/zbackup.dir/DependInfo.cmake --color= Scanning dependencies of target zbackup make[2]: Leaving directory '/tmp/B.l9woqxfi/BUILD/zbackup-1.4.4/build' /usr/bin/make -f CMakeFiles/zbackup.dir/build.make CMakeFiles/zbackup.dir/build make[2]: Entering directory '/tmp/B.l9woqxfi/BUILD/zbackup-1.4.4/build' [ 5%] Building CXX object CMakeFiles/zbackup.dir/appendallocator.cc.o /usr/bin/i686-pld-linux-g++ -DHAVE_LIBLZO -I/tmp/B.l9woqxfi/BUILD/zbackup-1.4.4/build -O3 -DNDEBUG -o CMakeFiles/zbackup.dir/appendallocator.cc.o -c /tmp/B.l9woqxfi/BUILD/zbackup-1.4.4/appendallocator.cc make[2]: Leaving directory '/tmp/B.l9woqxfi/BUILD/zbackup-1.4.4/build' make[2]: Entering directory '/tmp/B.l9woqxfi/BUILD/zbackup-1.4.4/build' [ 23%] Building CXX object CMakeFiles/zbackup.dir/backup_exchanger.cc.o /usr/bin/i686-pld-linux-g++ -DHAVE_LIBLZO -I/tmp/B.l9woqxfi/BUILD/zbackup-1.4.4/build -O3 -DNDEBUG -o CMakeFiles/zbackup.dir/backup_exchanger.cc.o -c /tmp/B.l9woqxfi/BUILD/zbackup-1.4.4/backup_exchanger.cc In file included from /tmp/B.l9woqxfi/BUILD/zbackup-1.4.4/tmp_mgr.hh:12, from /tmp/B.l9woqxfi/BUILD/zbackup-1.4.4/backup_exchanger.hh:10, from /tmp/B.l9woqxfi/BUILD/zbackup-1.4.4/backup_exchanger.cc:4: /tmp/B.l9woqxfi/BUILD/zbackup-1.4.4/file.hh:43:5: error: ISO C++17 does not allow dynamic exception specifications 43 | throw( exCantOpen ); | ^~~~~ /tmp/B.l9woqxfi/BUILD/zbackup-1.4.4/file.hh:46:5: error: ISO C++17 does not allow dynamic exception specifications 46 | throw( exCantOpen ); | ^~~~~ /tmp/B.l9woqxfi/BUILD/zbackup-1.4.4/file.hh:50:40: error: ISO C++17 does not allow dynamic exception specifications 50 | void read( void * buf, size_t size ) throw( exReadError, exWriteError ); | ^~~~~ /tmp/B.l9woqxfi/BUILD/zbackup-1.4.4/file.hh:53:26: error: ISO C++17 does not allow dynamic exception specifications 53 | void read( T & value ) throw( exReadError, exWriteError ) | ^~~~~ /tmp/B.l9woqxfi/BUILD/zbackup-1.4.4/file.hh:57:12: error: ISO C++17 does not allow dynamic exception specifications 57 | T read() throw( exReadError, exWriteError ) | ^~~~~ /tmp/B.l9woqxfi/BUILD/zbackup-1.4.4/file.hh:62:63: error: ISO C++17 does not allow dynamic exception specifications 62 | size_t readRecords( void * buf, size_t size, size_t count ) throw( exWriteError ); | ^~~~~ /tmp/B.l9woqxfi/BUILD/zbackup-1.4.4/file.hh:70:47: error: ISO C++17 does not allow dynamic exception specifications 70 | void write( void const * buf, size_t size ) throw( exWriteError ); | ^~~~~ /tmp/B.l9woqxfi/BUILD/zbackup-1.4.4/file.hh:73:33: error: ISO C++17 does not allow dynamic exception specifications 73 | void write( T const & value ) throw( exWriteError ) | ^~~~~ /tmp/B.l9woqxfi/BUILD/zbackup-1.4.4/file.hh:81:5: error: ISO C++17 does not allow dynamic exception specifications 81 | throw( exWriteError ); | ^~~~~ /tmp/B.l9woqxfi/BUILD/zbackup-1.4.4/file.hh:86:59: error: ISO C++17 does not allow dynamic exception specifications 86 | char * gets( char * s, int size, bool stripNl = false ) throw( exWriteError ); | ^~~~~ /tmp/B.l9woqxfi/BUILD/zbackup-1.4.4/file.hh:90:43: error: ISO C++17 does not allow dynamic exception specifications 90 | std::string gets( bool stripNl = true ) throw( exReadError, exWriteError ); | ^~~~~ /tmp/B.l9woqxfi/BUILD/zbackup-1.4.4/file.hh:93:28: error: ISO C++17 does not allow dynamic exception specifications 93 | void seek( long offset ) throw( exSeekError, exWriteError ); | ^~~~~ /tmp/B.l9woqxfi/BUILD/zbackup-1.4.4/file.hh:95:31: error: ISO C++17 does not allow dynamic exception specifications 95 | void seekCur( long offset ) throw( exSeekError, exWriteError ); | ^~~~~ /tmp/B.l9woqxfi/BUILD/zbackup-1.4.4/file.hh:97:35: error: ISO C++17 does not allow dynamic exception specifications 97 | void seekEnd( long offset = 0 ) throw( exSeekError, exWriteError ); | ^~~~~ /tmp/B.l9woqxfi/BUILD/zbackup-1.4.4/file.hh:100:17: error: ISO C++17 does not allow dynamic exception specifications 100 | void rewind() throw( exSeekError, exWriteError ); | ^~~~~ /tmp/B.l9woqxfi/BUILD/zbackup-1.4.4/file.hh:103:17: error: ISO C++17 does not allow dynamic exception specifications 103 | size_t tell() throw( exSeekError ); | ^~~~~ /tmp/B.l9woqxfi/BUILD/zbackup-1.4.4/file.hh:106:17: error: ISO C++17 does not allow dynamic exception specifications 106 | size_t size() throw( exSeekError, exWriteError ); | ^~~~~ /tmp/B.l9woqxfi/BUILD/zbackup-1.4.4/file.hh:109:14: error: ISO C++17 does not allow dynamic exception specifications 109 | bool eof() throw( exWriteError ); | ^~~~~ /tmp/B.l9woqxfi/BUILD/zbackup-1.4.4/file.hh:113:17: error: ISO C++17 does not allow dynamic exception specifications 113 | FILE * file() throw( exWriteError ); | ^~~~~ /tmp/B.l9woqxfi/BUILD/zbackup-1.4.4/file.hh:117:20: error: ISO C++17 does not allow dynamic exception specifications 117 | FILE * release() throw( exWriteError ); | ^~~~~ /tmp/B.l9woqxfi/BUILD/zbackup-1.4.4/file.hh:120:16: error: ISO C++17 does not allow dynamic exception specifications 120 | void close() throw( exWriteError ); | ^~~~~ /tmp/B.l9woqxfi/BUILD/zbackup-1.4.4/file.hh:131:44: error: ISO C++17 does not allow dynamic exception specifications 131 | static void erase( std::string const & ) throw( exCantErase ); | ^~~~~ /tmp/B.l9woqxfi/BUILD/zbackup-1.4.4/file.hh:135:48: error: ISO C++17 does not allow dynamic exception specifications 135 | std::string const & to ) throw( exCantRename ); | ^~~~~ /tmp/B.l9woqxfi/BUILD/zbackup-1.4.4/file.hh:155:48: error: ISO C++17 does not allow dynamic exception specifications 155 | void open( char const * filename, OpenMode ) throw( exCantOpen ); | ^~~~~ /tmp/B.l9woqxfi/BUILD/zbackup-1.4.4/file.hh:156:27: error: ISO C++17 does not allow dynamic exception specifications 156 | void flushWriteBuffer() throw( exWriteError ); | ^~~~~ /tmp/B.l9woqxfi/BUILD/zbackup-1.4.4/file.hh:157:29: error: ISO C++17 does not allow dynamic exception specifications 157 | void releaseWriteBuffer() throw( exWriteError ); | ^~~~~ make[2]: *** [CMakeFiles/zbackup.dir/build.make:120: CMakeFiles/zbackup.dir/backup_exchanger.cc.o] Error 1 make[2]: Leaving directory '/tmp/B.l9woqxfi/BUILD/zbackup-1.4.4/build' make[2]: *** Waiting for unfinished jobs.... make[2]: Entering directory '/tmp/B.l9woqxfi/BUILD/zbackup-1.4.4/build' [ 23%] Building CXX object CMakeFiles/zbackup.dir/chunk_id.cc.o /usr/bin/i686-pld-linux-g++ -DHAVE_LIBLZO -I/tmp/B.l9woqxfi/BUILD/zbackup-1.4.4/build -O3 -DNDEBUG -o CMakeFiles/zbackup.dir/chunk_id.cc.o -c /tmp/B.l9woqxfi/BUILD/zbackup-1.4.4/chunk_id.cc make[2]: Leaving directory '/tmp/B.l9woqxfi/BUILD/zbackup-1.4.4/build' make[2]: Entering directory '/tmp/B.l9woqxfi/BUILD/zbackup-1.4.4/build' [ 32%] Building CXX object CMakeFiles/zbackup.dir/compression.cc.o /usr/bin/i686-pld-linux-g++ -DHAVE_LIBLZO -I/tmp/B.l9woqxfi/BUILD/zbackup-1.4.4/build -O3 -DNDEBUG -o CMakeFiles/zbackup.dir/compression.cc.o -c /tmp/B.l9woqxfi/BUILD/zbackup-1.4.4/compression.cc make[2]: Leaving directory '/tmp/B.l9woqxfi/BUILD/zbackup-1.4.4/build' make[2]: Entering directory '/tmp/B.l9woqxfi/BUILD/zbackup-1.4.4/build' [ 23%] Building CXX object CMakeFiles/zbackup.dir/backup_file.cc.o /usr/bin/i686-pld-linux-g++ -DHAVE_LIBLZO -I/tmp/B.l9woqxfi/BUILD/zbackup-1.4.4/build -O3 -DNDEBUG -o CMakeFiles/zbackup.dir/backup_file.cc.o -c /tmp/B.l9woqxfi/BUILD/zbackup-1.4.4/backup_file.cc In file included from /tmp/B.l9woqxfi/BUILD/zbackup-1.4.4/encrypted_file.hh:18, from /tmp/B.l9woqxfi/BUILD/zbackup-1.4.4/backup_file.cc:6: /tmp/B.l9woqxfi/BUILD/zbackup-1.4.4/unbuffered_file.hh:40:49: error: ISO C++17 does not allow dynamic exception specifications 40 | UnbufferedFile( char const * fileName, Mode ) throw( exCantOpen ); | ^~~~~ /tmp/B.l9woqxfi/BUILD/zbackup-1.4.4/unbuffered_file.hh:45:42: error: ISO C++17 does not allow dynamic exception specifications 45 | size_t read( void * buf, size_t size ) throw( exReadError ); | ^~~~~ /tmp/B.l9woqxfi/BUILD/zbackup-1.4.4/unbuffered_file.hh:48:47: error: ISO C++17 does not allow dynamic exception specifications 48 | void write( void const * buf, size_t size ) throw( exWriteError ); | ^~~~~ /tmp/B.l9woqxfi/BUILD/zbackup-1.4.4/unbuffered_file.hh:51:17: error: ISO C++17 does not allow dynamic exception specifications 51 | Offset size() throw( exSeekError ); | ^~~~~ /tmp/B.l9woqxfi/BUILD/zbackup-1.4.4/unbuffered_file.hh:54:26: error: ISO C++17 does not allow dynamic exception specifications 54 | void seekCur( Offset ) throw( exSeekError ); | ^~~~~ make[2]: *** [CMakeFiles/zbackup.dir/build.make:133: CMakeFiles/zbackup.dir/backup_file.cc.o] Error 1 make[2]: Leaving directory '/tmp/B.l9woqxfi/BUILD/zbackup-1.4.4/build' make[2]: Entering directory '/tmp/B.l9woqxfi/BUILD/zbackup-1.4.4/build' [ 23%] Building CXX object CMakeFiles/zbackup.dir/bundle.cc.o /usr/bin/i686-pld-linux-g++ -DHAVE_LIBLZO -I/tmp/B.l9woqxfi/BUILD/zbackup-1.4.4/build -O3 -DNDEBUG -o CMakeFiles/zbackup.dir/bundle.cc.o -c /tmp/B.l9woqxfi/BUILD/zbackup-1.4.4/bundle.cc In file included from /tmp/B.l9woqxfi/BUILD/zbackup-1.4.4/encrypted_file.hh:18, from /tmp/B.l9woqxfi/BUILD/zbackup-1.4.4/bundle.hh:19, from /tmp/B.l9woqxfi/BUILD/zbackup-1.4.4/bundle.cc:6: /tmp/B.l9woqxfi/BUILD/zbackup-1.4.4/unbuffered_file.hh:40:49: error: ISO C++17 does not allow dynamic exception specifications 40 | UnbufferedFile( char const * fileName, Mode ) throw( exCantOpen ); | ^~~~~ /tmp/B.l9woqxfi/BUILD/zbackup-1.4.4/unbuffered_file.hh:45:42: error: ISO C++17 does not allow dynamic exception specifications 45 | size_t read( void * buf, size_t size ) throw( exReadError ); | ^~~~~ /tmp/B.l9woqxfi/BUILD/zbackup-1.4.4/unbuffered_file.hh:48:47: error: ISO C++17 does not allow dynamic exception specifications 48 | void write( void const * buf, size_t size ) throw( exWriteError ); | ^~~~~ /tmp/B.l9woqxfi/BUILD/zbackup-1.4.4/unbuffered_file.hh:51:17: error: ISO C++17 does not allow dynamic exception specifications 51 | Offset size() throw( exSeekError ); | ^~~~~ /tmp/B.l9woqxfi/BUILD/zbackup-1.4.4/unbuffered_file.hh:54:26: error: ISO C++17 does not allow dynamic exception specifications 54 | void seekCur( Offset ) throw( exSeekError ); | ^~~~~ make[2]: *** [CMakeFiles/zbackup.dir/build.make:159: CMakeFiles/zbackup.dir/bundle.cc.o] Error 1 make[2]: Leaving directory '/tmp/B.l9woqxfi/BUILD/zbackup-1.4.4/build' make[2]: Entering directory '/tmp/B.l9woqxfi/BUILD/zbackup-1.4.4/build' [ 26%] Building CXX object CMakeFiles/zbackup.dir/chunk_index.cc.o /usr/bin/i686-pld-linux-g++ -DHAVE_LIBLZO -I/tmp/B.l9woqxfi/BUILD/zbackup-1.4.4/build -O3 -DNDEBUG -o CMakeFiles/zbackup.dir/chunk_index.cc.o -c /tmp/B.l9woqxfi/BUILD/zbackup-1.4.4/chunk_index.cc In file included from /tmp/B.l9woqxfi/BUILD/zbackup-1.4.4/encrypted_file.hh:18, from /tmp/B.l9woqxfi/BUILD/zbackup-1.4.4/bundle.hh:19, from /tmp/B.l9woqxfi/BUILD/zbackup-1.4.4/chunk_index.hh:19, from /tmp/B.l9woqxfi/BUILD/zbackup-1.4.4/chunk_index.cc:9: /tmp/B.l9woqxfi/BUILD/zbackup-1.4.4/unbuffered_file.hh:40:49: error: ISO C++17 does not allow dynamic exception specifications 40 | UnbufferedFile( char const * fileName, Mode ) throw( exCantOpen ); | ^~~~~ /tmp/B.l9woqxfi/BUILD/zbackup-1.4.4/unbuffered_file.hh:45:42: error: ISO C++17 does not allow dynamic exception specifications 45 | size_t read( void * buf, size_t size ) throw( exReadError ); | ^~~~~ /tmp/B.l9woqxfi/BUILD/zbackup-1.4.4/unbuffered_file.hh:48:47: error: ISO C++17 does not allow dynamic exception specifications 48 | void write( void const * buf, size_t size ) throw( exWriteError ); | ^~~~~ /tmp/B.l9woqxfi/BUILD/zbackup-1.4.4/unbuffered_file.hh:51:17: error: ISO C++17 does not allow dynamic exception specifications 51 | Offset size() throw( exSeekError ); | ^~~~~ /tmp/B.l9woqxfi/BUILD/zbackup-1.4.4/unbuffered_file.hh:54:26: error: ISO C++17 does not allow dynamic exception specifications 54 | void seekCur( Offset ) throw( exSeekError ); | ^~~~~ In file included from /tmp/B.l9woqxfi/BUILD/zbackup-1.4.4/index_file.hh:15, from /tmp/B.l9woqxfi/BUILD/zbackup-1.4.4/chunk_index.hh:25, from /tmp/B.l9woqxfi/BUILD/zbackup-1.4.4/chunk_index.cc:9: /tmp/B.l9woqxfi/BUILD/zbackup-1.4.4/file.hh:43:5: error: ISO C++17 does not allow dynamic exception specifications 43 | throw( exCantOpen ); | ^~~~~ /tmp/B.l9woqxfi/BUILD/zbackup-1.4.4/file.hh:46:5: error: ISO C++17 does not allow dynamic exception specifications 46 | throw( exCantOpen ); | ^~~~~ /tmp/B.l9woqxfi/BUILD/zbackup-1.4.4/file.hh:50:40: error: ISO C++17 does not allow dynamic exception specifications 50 | void read( void * buf, size_t size ) throw( exReadError, exWriteError ); | ^~~~~ /tmp/B.l9woqxfi/BUILD/zbackup-1.4.4/file.hh:53:26: error: ISO C++17 does not allow dynamic exception specifications 53 | void read( T & value ) throw( exReadError, exWriteError ) | ^~~~~ /tmp/B.l9woqxfi/BUILD/zbackup-1.4.4/file.hh:57:12: error: ISO C++17 does not allow dynamic exception specifications 57 | T read() throw( exReadError, exWriteError ) | ^~~~~ /tmp/B.l9woqxfi/BUILD/zbackup-1.4.4/file.hh:62:63: error: ISO C++17 does not allow dynamic exception specifications 62 | size_t readRecords( void * buf, size_t size, size_t count ) throw( exWriteError ); | ^~~~~ /tmp/B.l9woqxfi/BUILD/zbackup-1.4.4/file.hh:70:47: error: ISO C++17 does not allow dynamic exception specifications 70 | void write( void const * buf, size_t size ) throw( exWriteError ); | ^~~~~ /tmp/B.l9woqxfi/BUILD/zbackup-1.4.4/file.hh:73:33: error: ISO C++17 does not allow dynamic exception specifications 73 | void write( T const & value ) throw( exWriteError ) | ^~~~~ /tmp/B.l9woqxfi/BUILD/zbackup-1.4.4/file.hh:81:5: error: ISO C++17 does not allow dynamic exception specifications 81 | throw( exWriteError ); | ^~~~~ /tmp/B.l9woqxfi/BUILD/zbackup-1.4.4/file.hh:86:59: error: ISO C++17 does not allow dynamic exception specifications 86 | char * gets( char * s, int size, bool stripNl = false ) throw( exWriteError ); | ^~~~~ /tmp/B.l9woqxfi/BUILD/zbackup-1.4.4/file.hh:90:43: error: ISO C++17 does not allow dynamic exception specifications 90 | std::string gets( bool stripNl = true ) throw( exReadError, exWriteError ); | ^~~~~ /tmp/B.l9woqxfi/BUILD/zbackup-1.4.4/file.hh:93:28: error: ISO C++17 does not allow dynamic exception specifications 93 | void seek( long offset ) throw( exSeekError, exWriteError ); | ^~~~~ /tmp/B.l9woqxfi/BUILD/zbackup-1.4.4/file.hh:95:31: error: ISO C++17 does not allow dynamic exception specifications 95 | void seekCur( long offset ) throw( exSeekError, exWriteError ); | ^~~~~ /tmp/B.l9woqxfi/BUILD/zbackup-1.4.4/file.hh:97:35: error: ISO C++17 does not allow dynamic exception specifications 97 | void seekEnd( long offset = 0 ) throw( exSeekError, exWriteError ); | ^~~~~ /tmp/B.l9woqxfi/BUILD/zbackup-1.4.4/file.hh:100:17: error: ISO C++17 does not allow dynamic exception specifications 100 | void rewind() throw( exSeekError, exWriteError ); | ^~~~~ /tmp/B.l9woqxfi/BUILD/zbackup-1.4.4/file.hh:103:17: error: ISO C++17 does not allow dynamic exception specifications 103 | size_t tell() throw( exSeekError ); | ^~~~~ /tmp/B.l9woqxfi/BUILD/zbackup-1.4.4/file.hh:106:17: error: ISO C++17 does not allow dynamic exception specifications 106 | size_t size() throw( exSeekError, exWriteError ); | ^~~~~ /tmp/B.l9woqxfi/BUILD/zbackup-1.4.4/file.hh:109:14: error: ISO C++17 does not allow dynamic exception specifications 109 | bool eof() throw( exWriteError ); | ^~~~~ /tmp/B.l9woqxfi/BUILD/zbackup-1.4.4/file.hh:113:17: error: ISO C++17 does not allow dynamic exception specifications 113 | FILE * file() throw( exWriteError ); | ^~~~~ /tmp/B.l9woqxfi/BUILD/zbackup-1.4.4/file.hh:117:20: error: ISO C++17 does not allow dynamic exception specifications 117 | FILE * release() throw( exWriteError ); | ^~~~~ /tmp/B.l9woqxfi/BUILD/zbackup-1.4.4/file.hh:120:16: error: ISO C++17 does not allow dynamic exception specifications 120 | void close() throw( exWriteError ); | ^~~~~ /tmp/B.l9woqxfi/BUILD/zbackup-1.4.4/file.hh:131:44: error: ISO C++17 does not allow dynamic exception specifications 131 | static void erase( std::string const & ) throw( exCantErase ); | ^~~~~ /tmp/B.l9woqxfi/BUILD/zbackup-1.4.4/file.hh:135:48: error: ISO C++17 does not allow dynamic exception specifications 135 | std::string const & to ) throw( exCantRename ); | ^~~~~ /tmp/B.l9woqxfi/BUILD/zbackup-1.4.4/file.hh:155:48: error: ISO C++17 does not allow dynamic exception specifications 155 | void open( char const * filename, OpenMode ) throw( exCantOpen ); | ^~~~~ /tmp/B.l9woqxfi/BUILD/zbackup-1.4.4/file.hh:156:27: error: ISO C++17 does not allow dynamic exception specifications 156 | void flushWriteBuffer() throw( exWriteError ); | ^~~~~ /tmp/B.l9woqxfi/BUILD/zbackup-1.4.4/file.hh:157:29: error: ISO C++17 does not allow dynamic exception specifications 157 | void releaseWriteBuffer() throw( exWriteError ); | ^~~~~ make[2]: *** [CMakeFiles/zbackup.dir/build.make:185: CMakeFiles/zbackup.dir/chunk_index.cc.o] Error 1 make[2]: Leaving directory '/tmp/B.l9woqxfi/BUILD/zbackup-1.4.4/build' make[2]: Entering directory '/tmp/B.l9woqxfi/BUILD/zbackup-1.4.4/build' [ 23%] Building CXX object CMakeFiles/zbackup.dir/backup_restorer.cc.o /usr/bin/i686-pld-linux-g++ -DHAVE_LIBLZO -I/tmp/B.l9woqxfi/BUILD/zbackup-1.4.4/build -O3 -DNDEBUG -o CMakeFiles/zbackup.dir/backup_restorer.cc.o -c /tmp/B.l9woqxfi/BUILD/zbackup-1.4.4/backup_restorer.cc In file included from /tmp/B.l9woqxfi/BUILD/zbackup-1.4.4/encrypted_file.hh:18, from /tmp/B.l9woqxfi/BUILD/zbackup-1.4.4/bundle.hh:19, from /tmp/B.l9woqxfi/BUILD/zbackup-1.4.4/chunk_storage.hh:13, from /tmp/B.l9woqxfi/BUILD/zbackup-1.4.4/backup_restorer.hh:12, from /tmp/B.l9woqxfi/BUILD/zbackup-1.4.4/backup_restorer.cc:8: /tmp/B.l9woqxfi/BUILD/zbackup-1.4.4/unbuffered_file.hh:40:49: error: ISO C++17 does not allow dynamic exception specifications 40 | UnbufferedFile( char const * fileName, Mode ) throw( exCantOpen ); | ^~~~~ /tmp/B.l9woqxfi/BUILD/zbackup-1.4.4/unbuffered_file.hh:45:42: error: ISO C++17 does not allow dynamic exception specifications 45 | size_t read( void * buf, size_t size ) throw( exReadError ); | ^~~~~ /tmp/B.l9woqxfi/BUILD/zbackup-1.4.4/unbuffered_file.hh:48:47: error: ISO C++17 does not allow dynamic exception specifications 48 | void write( void const * buf, size_t size ) throw( exWriteError ); | ^~~~~ /tmp/B.l9woqxfi/BUILD/zbackup-1.4.4/unbuffered_file.hh:51:17: error: ISO C++17 does not allow dynamic exception specifications 51 | Offset size() throw( exSeekError ); | ^~~~~ /tmp/B.l9woqxfi/BUILD/zbackup-1.4.4/unbuffered_file.hh:54:26: error: ISO C++17 does not allow dynamic exception specifications 54 | void seekCur( Offset ) throw( exSeekError ); | ^~~~~ In file included from /tmp/B.l9woqxfi/BUILD/zbackup-1.4.4/index_file.hh:15, from /tmp/B.l9woqxfi/BUILD/zbackup-1.4.4/chunk_index.hh:25, from /tmp/B.l9woqxfi/BUILD/zbackup-1.4.4/chunk_storage.hh:15, from /tmp/B.l9woqxfi/BUILD/zbackup-1.4.4/backup_restorer.hh:12, from /tmp/B.l9woqxfi/BUILD/zbackup-1.4.4/backup_restorer.cc:8: /tmp/B.l9woqxfi/BUILD/zbackup-1.4.4/file.hh:43:5: error: ISO C++17 does not allow dynamic exception specifications 43 | throw( exCantOpen ); | ^~~~~ /tmp/B.l9woqxfi/BUILD/zbackup-1.4.4/file.hh:46:5: error: ISO C++17 does not allow dynamic exception specifications 46 | throw( exCantOpen ); | ^~~~~ /tmp/B.l9woqxfi/BUILD/zbackup-1.4.4/file.hh:50:40: error: ISO C++17 does not allow dynamic exception specifications 50 | void read( void * buf, size_t size ) throw( exReadError, exWriteError ); | ^~~~~ /tmp/B.l9woqxfi/BUILD/zbackup-1.4.4/file.hh:53:26: error: ISO C++17 does not allow dynamic exception specifications 53 | void read( T & value ) throw( exReadError, exWriteError ) | ^~~~~ /tmp/B.l9woqxfi/BUILD/zbackup-1.4.4/file.hh:57:12: error: ISO C++17 does not allow dynamic exception specifications 57 | T read() throw( exReadError, exWriteError ) | ^~~~~ /tmp/B.l9woqxfi/BUILD/zbackup-1.4.4/file.hh:62:63: error: ISO C++17 does not allow dynamic exception specifications 62 | size_t readRecords( void * buf, size_t size, size_t count ) throw( exWriteError ); | ^~~~~ /tmp/B.l9woqxfi/BUILD/zbackup-1.4.4/file.hh:70:47: error: ISO C++17 does not allow dynamic exception specifications 70 | void write( void const * buf, size_t size ) throw( exWriteError ); | ^~~~~ /tmp/B.l9woqxfi/BUILD/zbackup-1.4.4/file.hh:73:33: error: ISO C++17 does not allow dynamic exception specifications 73 | void write( T const & value ) throw( exWriteError ) | ^~~~~ /tmp/B.l9woqxfi/BUILD/zbackup-1.4.4/file.hh:81:5: error: ISO C++17 does not allow dynamic exception specifications 81 | throw( exWriteError ); | ^~~~~ /tmp/B.l9woqxfi/BUILD/zbackup-1.4.4/file.hh:86:59: error: ISO C++17 does not allow dynamic exception specifications 86 | char * gets( char * s, int size, bool stripNl = false ) throw( exWriteError ); | ^~~~~ /tmp/B.l9woqxfi/BUILD/zbackup-1.4.4/file.hh:90:43: error: ISO C++17 does not allow dynamic exception specifications 90 | std::string gets( bool stripNl = true ) throw( exReadError, exWriteError ); | ^~~~~ /tmp/B.l9woqxfi/BUILD/zbackup-1.4.4/file.hh:93:28: error: ISO C++17 does not allow dynamic exception specifications 93 | void seek( long offset ) throw( exSeekError, exWriteError ); | ^~~~~ /tmp/B.l9woqxfi/BUILD/zbackup-1.4.4/file.hh:95:31: error: ISO C++17 does not allow dynamic exception specifications 95 | void seekCur( long offset ) throw( exSeekError, exWriteError ); | ^~~~~ /tmp/B.l9woqxfi/BUILD/zbackup-1.4.4/file.hh:97:35: error: ISO C++17 does not allow dynamic exception specifications 97 | void seekEnd( long offset = 0 ) throw( exSeekError, exWriteError ); | ^~~~~ /tmp/B.l9woqxfi/BUILD/zbackup-1.4.4/file.hh:100:17: error: ISO C++17 does not allow dynamic exception specifications 100 | void rewind() throw( exSeekError, exWriteError ); | ^~~~~ /tmp/B.l9woqxfi/BUILD/zbackup-1.4.4/file.hh:103:17: error: ISO C++17 does not allow dynamic exception specifications 103 | size_t tell() throw( exSeekError ); | ^~~~~ /tmp/B.l9woqxfi/BUILD/zbackup-1.4.4/file.hh:106:17: error: ISO C++17 does not allow dynamic exception specifications 106 | size_t size() throw( exSeekError, exWriteError ); | ^~~~~ /tmp/B.l9woqxfi/BUILD/zbackup-1.4.4/file.hh:109:14: error: ISO C++17 does not allow dynamic exception specifications 109 | bool eof() throw( exWriteError ); | ^~~~~ /tmp/B.l9woqxfi/BUILD/zbackup-1.4.4/file.hh:113:17: error: ISO C++17 does not allow dynamic exception specifications 113 | FILE * file() throw( exWriteError ); | ^~~~~ /tmp/B.l9woqxfi/BUILD/zbackup-1.4.4/file.hh:117:20: error: ISO C++17 does not allow dynamic exception specifications 117 | FILE * release() throw( exWriteError ); | ^~~~~ /tmp/B.l9woqxfi/BUILD/zbackup-1.4.4/file.hh:120:16: error: ISO C++17 does not allow dynamic exception specifications 120 | void close() throw( exWriteError ); | ^~~~~ /tmp/B.l9woqxfi/BUILD/zbackup-1.4.4/file.hh:131:44: error: ISO C++17 does not allow dynamic exception specifications 131 | static void erase( std::string const & ) throw( exCantErase ); | ^~~~~ /tmp/B.l9woqxfi/BUILD/zbackup-1.4.4/file.hh:135:48: error: ISO C++17 does not allow dynamic exception specifications 135 | std::string const & to ) throw( exCantRename ); | ^~~~~ /tmp/B.l9woqxfi/BUILD/zbackup-1.4.4/file.hh:155:48: error: ISO C++17 does not allow dynamic exception specifications 155 | void open( char const * filename, OpenMode ) throw( exCantOpen ); | ^~~~~ /tmp/B.l9woqxfi/BUILD/zbackup-1.4.4/file.hh:156:27: error: ISO C++17 does not allow dynamic exception specifications 156 | void flushWriteBuffer() throw( exWriteError ); | ^~~~~ /tmp/B.l9woqxfi/BUILD/zbackup-1.4.4/file.hh:157:29: error: ISO C++17 does not allow dynamic exception specifications 157 | void releaseWriteBuffer() throw( exWriteError ); | ^~~~~ /tmp/B.l9woqxfi/BUILD/zbackup-1.4.4/backup_restorer.cc: In function 'void BackupRestorer::restore(ChunkStorage::Reader&, const string&, DataSink*, BackupRestorer::ChunkSet*)': /tmp/B.l9woqxfi/BUILD/zbackup-1.4.4/backup_restorer.cc:30:25: warning: 'void google::protobuf::io::CodedInputStream::SetTotalBytesLimit(int, int)' is deprecated: Please use the single parameter version of SetTotalBytesLimit(). The second parameter is ignored. [-Wdeprecated-declarations] 30 | cis.SetTotalBytesLimit( backupData.size(), -1 ); | ~~~~~~~~~~~~~~~~~~~~~~^~~~~~~~~~~~~~~~~~~~~~~~~ In file included from /tmp/B.l9woqxfi/BUILD/zbackup-1.4.4/backup_restorer.cc:4: /usr/include/google/protobuf/io/coded_stream.h:397:8: note: declared here 397 | void SetTotalBytesLimit(int total_bytes_limit, int) { | ^~~~~~~~~~~~~~~~~~ make[2]: *** [CMakeFiles/zbackup.dir/build.make:146: CMakeFiles/zbackup.dir/backup_restorer.cc.o] Error 1 make[2]: Leaving directory '/tmp/B.l9woqxfi/BUILD/zbackup-1.4.4/build' make[2]: Entering directory '/tmp/B.l9woqxfi/BUILD/zbackup-1.4.4/build' [ 8%] Building CXX object CMakeFiles/zbackup.dir/backup_creator.cc.o /usr/bin/i686-pld-linux-g++ -DHAVE_LIBLZO -I/tmp/B.l9woqxfi/BUILD/zbackup-1.4.4/build -O3 -DNDEBUG -o CMakeFiles/zbackup.dir/backup_creator.cc.o -c /tmp/B.l9woqxfi/BUILD/zbackup-1.4.4/backup_creator.cc In file included from /tmp/B.l9woqxfi/BUILD/zbackup-1.4.4/encrypted_file.hh:18, from /tmp/B.l9woqxfi/BUILD/zbackup-1.4.4/bundle.hh:19, from /tmp/B.l9woqxfi/BUILD/zbackup-1.4.4/chunk_index.hh:19, from /tmp/B.l9woqxfi/BUILD/zbackup-1.4.4/backup_creator.hh:13, from /tmp/B.l9woqxfi/BUILD/zbackup-1.4.4/backup_creator.cc:7: /tmp/B.l9woqxfi/BUILD/zbackup-1.4.4/unbuffered_file.hh:40:49: error: ISO C++17 does not allow dynamic exception specifications 40 | UnbufferedFile( char const * fileName, Mode ) throw( exCantOpen ); | ^~~~~ /tmp/B.l9woqxfi/BUILD/zbackup-1.4.4/unbuffered_file.hh:45:42: error: ISO C++17 does not allow dynamic exception specifications 45 | size_t read( void * buf, size_t size ) throw( exReadError ); | ^~~~~ /tmp/B.l9woqxfi/BUILD/zbackup-1.4.4/unbuffered_file.hh:48:47: error: ISO C++17 does not allow dynamic exception specifications 48 | void write( void const * buf, size_t size ) throw( exWriteError ); | ^~~~~ /tmp/B.l9woqxfi/BUILD/zbackup-1.4.4/unbuffered_file.hh:51:17: error: ISO C++17 does not allow dynamic exception specifications 51 | Offset size() throw( exSeekError ); | ^~~~~ /tmp/B.l9woqxfi/BUILD/zbackup-1.4.4/unbuffered_file.hh:54:26: error: ISO C++17 does not allow dynamic exception specifications 54 | void seekCur( Offset ) throw( exSeekError ); | ^~~~~ In file included from /tmp/B.l9woqxfi/BUILD/zbackup-1.4.4/index_file.hh:15, from /tmp/B.l9woqxfi/BUILD/zbackup-1.4.4/chunk_index.hh:25, from /tmp/B.l9woqxfi/BUILD/zbackup-1.4.4/backup_creator.hh:13, from /tmp/B.l9woqxfi/BUILD/zbackup-1.4.4/backup_creator.cc:7: /tmp/B.l9woqxfi/BUILD/zbackup-1.4.4/file.hh:43:5: error: ISO C++17 does not allow dynamic exception specifications 43 | throw( exCantOpen ); | ^~~~~ /tmp/B.l9woqxfi/BUILD/zbackup-1.4.4/file.hh:46:5: error: ISO C++17 does not allow dynamic exception specifications 46 | throw( exCantOpen ); | ^~~~~ /tmp/B.l9woqxfi/BUILD/zbackup-1.4.4/file.hh:50:40: error: ISO C++17 does not allow dynamic exception specifications 50 | void read( void * buf, size_t size ) throw( exReadError, exWriteError ); | ^~~~~ /tmp/B.l9woqxfi/BUILD/zbackup-1.4.4/file.hh:53:26: error: ISO C++17 does not allow dynamic exception specifications 53 | void read( T & value ) throw( exReadError, exWriteError ) | ^~~~~ /tmp/B.l9woqxfi/BUILD/zbackup-1.4.4/file.hh:57:12: error: ISO C++17 does not allow dynamic exception specifications 57 | T read() throw( exReadError, exWriteError ) | ^~~~~ /tmp/B.l9woqxfi/BUILD/zbackup-1.4.4/file.hh:62:63: error: ISO C++17 does not allow dynamic exception specifications 62 | size_t readRecords( void * buf, size_t size, size_t count ) throw( exWriteError ); | ^~~~~ /tmp/B.l9woqxfi/BUILD/zbackup-1.4.4/file.hh:70:47: error: ISO C++17 does not allow dynamic exception specifications 70 | void write( void const * buf, size_t size ) throw( exWriteError ); | ^~~~~ /tmp/B.l9woqxfi/BUILD/zbackup-1.4.4/file.hh:73:33: error: ISO C++17 does not allow dynamic exception specifications 73 | void write( T const & value ) throw( exWriteError ) | ^~~~~ /tmp/B.l9woqxfi/BUILD/zbackup-1.4.4/file.hh:81:5: error: ISO C++17 does not allow dynamic exception specifications 81 | throw( exWriteError ); | ^~~~~ /tmp/B.l9woqxfi/BUILD/zbackup-1.4.4/file.hh:86:59: error: ISO C++17 does not allow dynamic exception specifications 86 | char * gets( char * s, int size, bool stripNl = false ) throw( exWriteError ); | ^~~~~ /tmp/B.l9woqxfi/BUILD/zbackup-1.4.4/file.hh:90:43: error: ISO C++17 does not allow dynamic exception specifications 90 | std::string gets( bool stripNl = true ) throw( exReadError, exWriteError ); | ^~~~~ /tmp/B.l9woqxfi/BUILD/zbackup-1.4.4/file.hh:93:28: error: ISO C++17 does not allow dynamic exception specifications 93 | void seek( long offset ) throw( exSeekError, exWriteError ); | ^~~~~ /tmp/B.l9woqxfi/BUILD/zbackup-1.4.4/file.hh:95:31: error: ISO C++17 does not allow dynamic exception specifications 95 | void seekCur( long offset ) throw( exSeekError, exWriteError ); | ^~~~~ /tmp/B.l9woqxfi/BUILD/zbackup-1.4.4/file.hh:97:35: error: ISO C++17 does not allow dynamic exception specifications 97 | void seekEnd( long offset = 0 ) throw( exSeekError, exWriteError ); | ^~~~~ /tmp/B.l9woqxfi/BUILD/zbackup-1.4.4/file.hh:100:17: error: ISO C++17 does not allow dynamic exception specifications 100 | void rewind() throw( exSeekError, exWriteError ); | ^~~~~ /tmp/B.l9woqxfi/BUILD/zbackup-1.4.4/file.hh:103:17: error: ISO C++17 does not allow dynamic exception specifications 103 | size_t tell() throw( exSeekError ); | ^~~~~ /tmp/B.l9woqxfi/BUILD/zbackup-1.4.4/file.hh:106:17: error: ISO C++17 does not allow dynamic exception specifications 106 | size_t size() throw( exSeekError, exWriteError ); | ^~~~~ /tmp/B.l9woqxfi/BUILD/zbackup-1.4.4/file.hh:109:14: error: ISO C++17 does not allow dynamic exception specifications 109 | bool eof() throw( exWriteError ); | ^~~~~ /tmp/B.l9woqxfi/BUILD/zbackup-1.4.4/file.hh:113:17: error: ISO C++17 does not allow dynamic exception specifications 113 | FILE * file() throw( exWriteError ); | ^~~~~ /tmp/B.l9woqxfi/BUILD/zbackup-1.4.4/file.hh:117:20: error: ISO C++17 does not allow dynamic exception specifications 117 | FILE * release() throw( exWriteError ); | ^~~~~ /tmp/B.l9woqxfi/BUILD/zbackup-1.4.4/file.hh:120:16: error: ISO C++17 does not allow dynamic exception specifications 120 | void close() throw( exWriteError ); | ^~~~~ /tmp/B.l9woqxfi/BUILD/zbackup-1.4.4/file.hh:131:44: error: ISO C++17 does not allow dynamic exception specifications 131 | static void erase( std::string const & ) throw( exCantErase ); | ^~~~~ /tmp/B.l9woqxfi/BUILD/zbackup-1.4.4/file.hh:135:48: error: ISO C++17 does not allow dynamic exception specifications 135 | std::string const & to ) throw( exCantRename ); | ^~~~~ /tmp/B.l9woqxfi/BUILD/zbackup-1.4.4/file.hh:155:48: error: ISO C++17 does not allow dynamic exception specifications 155 | void open( char const * filename, OpenMode ) throw( exCantOpen ); | ^~~~~ /tmp/B.l9woqxfi/BUILD/zbackup-1.4.4/file.hh:156:27: error: ISO C++17 does not allow dynamic exception specifications 156 | void flushWriteBuffer() throw( exWriteError ); | ^~~~~ /tmp/B.l9woqxfi/BUILD/zbackup-1.4.4/file.hh:157:29: error: ISO C++17 does not allow dynamic exception specifications 157 | void releaseWriteBuffer() throw( exWriteError ); | ^~~~~ /tmp/B.l9woqxfi/BUILD/zbackup-1.4.4/backup_creator.cc: In member function 'virtual const ChunkId& BackupCreator::getChunkId()': /tmp/B.l9woqxfi/BUILD/zbackup-1.4.4/backup_creator.cc:214:14: warning: 'int SHA1_Init(SHA_CTX*)' is deprecated: Since OpenSSL 3.0 [-Wdeprecated-declarations] 214 | SHA1_Init( &ctx ); | ~~~~~~~~~^~~~~~~~ In file included from /tmp/B.l9woqxfi/BUILD/zbackup-1.4.4/backup_creator.cc:4: /usr/include/openssl/sha.h:49:27: note: declared here 49 | OSSL_DEPRECATEDIN_3_0 int SHA1_Init(SHA_CTX *c); | ^~~~~~~~~ /tmp/B.l9woqxfi/BUILD/zbackup-1.4.4/backup_creator.cc:219:18: warning: 'int SHA1_Update(SHA_CTX*, const void*, size_t)' is deprecated: Since OpenSSL 3.0 [-Wdeprecated-declarations] 219 | SHA1_Update( &ctx, tail, head - tail ); | ~~~~~~~~~~~^~~~~~~~~~~~~~~~~~~~~~~~~~~ In file included from /tmp/B.l9woqxfi/BUILD/zbackup-1.4.4/backup_creator.cc:4: /usr/include/openssl/sha.h:50:27: note: declared here 50 | OSSL_DEPRECATEDIN_3_0 int SHA1_Update(SHA_CTX *c, const void *data, size_t len); | ^~~~~~~~~~~ /tmp/B.l9woqxfi/BUILD/zbackup-1.4.4/backup_creator.cc:224:18: warning: 'int SHA1_Update(SHA_CTX*, const void*, size_t)' is deprecated: Since OpenSSL 3.0 [-Wdeprecated-declarations] 224 | SHA1_Update( &ctx, tail, end - tail ); | ~~~~~~~~~~~^~~~~~~~~~~~~~~~~~~~~~~~~~ In file included from /tmp/B.l9woqxfi/BUILD/zbackup-1.4.4/backup_creator.cc:4: /usr/include/openssl/sha.h:50:27: note: declared here 50 | OSSL_DEPRECATEDIN_3_0 int SHA1_Update(SHA_CTX *c, const void *data, size_t len); | ^~~~~~~~~~~ /tmp/B.l9woqxfi/BUILD/zbackup-1.4.4/backup_creator.cc:225:18: warning: 'int SHA1_Update(SHA_CTX*, const void*, size_t)' is deprecated: Since OpenSSL 3.0 [-Wdeprecated-declarations] 225 | SHA1_Update( &ctx, begin, head - begin ); | ~~~~~~~~~~~^~~~~~~~~~~~~~~~~~~~~~~~~~~~~ In file included from /tmp/B.l9woqxfi/BUILD/zbackup-1.4.4/backup_creator.cc:4: /usr/include/openssl/sha.h:50:27: note: declared here 50 | OSSL_DEPRECATEDIN_3_0 int SHA1_Update(SHA_CTX *c, const void *data, size_t len); | ^~~~~~~~~~~ /tmp/B.l9woqxfi/BUILD/zbackup-1.4.4/backup_creator.cc:229:15: warning: 'int SHA1_Final(unsigned char*, SHA_CTX*)' is deprecated: Since OpenSSL 3.0 [-Wdeprecated-declarations] 229 | SHA1_Final( sha1Value, &ctx ); | ~~~~~~~~~~^~~~~~~~~~~~~~~~~~~ In file included from /tmp/B.l9woqxfi/BUILD/zbackup-1.4.4/backup_creator.cc:4: /usr/include/openssl/sha.h:51:27: note: declared here 51 | OSSL_DEPRECATEDIN_3_0 int SHA1_Final(unsigned char *md, SHA_CTX *c); | ^~~~~~~~~~ make[2]: *** [CMakeFiles/zbackup.dir/build.make:107: CMakeFiles/zbackup.dir/backup_creator.cc.o] Error 1 make[2]: Leaving directory '/tmp/B.l9woqxfi/BUILD/zbackup-1.4.4/build' make[2]: Entering directory '/tmp/B.l9woqxfi/BUILD/zbackup-1.4.4/build' [ 29%] Building CXX object CMakeFiles/zbackup.dir/chunk_storage.cc.o /usr/bin/i686-pld-linux-g++ -DHAVE_LIBLZO -I/tmp/B.l9woqxfi/BUILD/zbackup-1.4.4/build -O3 -DNDEBUG -o CMakeFiles/zbackup.dir/chunk_storage.cc.o -c /tmp/B.l9woqxfi/BUILD/zbackup-1.4.4/chunk_storage.cc In file included from /tmp/B.l9woqxfi/BUILD/zbackup-1.4.4/encrypted_file.hh:18, from /tmp/B.l9woqxfi/BUILD/zbackup-1.4.4/bundle.hh:19, from /tmp/B.l9woqxfi/BUILD/zbackup-1.4.4/chunk_storage.hh:13, from /tmp/B.l9woqxfi/BUILD/zbackup-1.4.4/chunk_storage.cc:5: /tmp/B.l9woqxfi/BUILD/zbackup-1.4.4/unbuffered_file.hh:40:49: error: ISO C++17 does not allow dynamic exception specifications 40 | UnbufferedFile( char const * fileName, Mode ) throw( exCantOpen ); | ^~~~~ /tmp/B.l9woqxfi/BUILD/zbackup-1.4.4/unbuffered_file.hh:45:42: error: ISO C++17 does not allow dynamic exception specifications 45 | size_t read( void * buf, size_t size ) throw( exReadError ); | ^~~~~ /tmp/B.l9woqxfi/BUILD/zbackup-1.4.4/unbuffered_file.hh:48:47: error: ISO C++17 does not allow dynamic exception specifications 48 | void write( void const * buf, size_t size ) throw( exWriteError ); | ^~~~~ /tmp/B.l9woqxfi/BUILD/zbackup-1.4.4/unbuffered_file.hh:51:17: error: ISO C++17 does not allow dynamic exception specifications 51 | Offset size() throw( exSeekError ); | ^~~~~ /tmp/B.l9woqxfi/BUILD/zbackup-1.4.4/unbuffered_file.hh:54:26: error: ISO C++17 does not allow dynamic exception specifications 54 | void seekCur( Offset ) throw( exSeekError ); | ^~~~~ In file included from /tmp/B.l9woqxfi/BUILD/zbackup-1.4.4/index_file.hh:15, from /tmp/B.l9woqxfi/BUILD/zbackup-1.4.4/chunk_index.hh:25, from /tmp/B.l9woqxfi/BUILD/zbackup-1.4.4/chunk_storage.hh:15, from /tmp/B.l9woqxfi/BUILD/zbackup-1.4.4/chunk_storage.cc:5: /tmp/B.l9woqxfi/BUILD/zbackup-1.4.4/file.hh:43:5: error: ISO C++17 does not allow dynamic exception specifications 43 | throw( exCantOpen ); | ^~~~~ /tmp/B.l9woqxfi/BUILD/zbackup-1.4.4/file.hh:46:5: error: ISO C++17 does not allow dynamic exception specifications 46 | throw( exCantOpen ); | ^~~~~ /tmp/B.l9woqxfi/BUILD/zbackup-1.4.4/file.hh:50:40: error: ISO C++17 does not allow dynamic exception specifications 50 | void read( void * buf, size_t size ) throw( exReadError, exWriteError ); | ^~~~~ /tmp/B.l9woqxfi/BUILD/zbackup-1.4.4/file.hh:53:26: error: ISO C++17 does not allow dynamic exception specifications 53 | void read( T & value ) throw( exReadError, exWriteError ) | ^~~~~ /tmp/B.l9woqxfi/BUILD/zbackup-1.4.4/file.hh:57:12: error: ISO C++17 does not allow dynamic exception specifications 57 | T read() throw( exReadError, exWriteError ) | ^~~~~ /tmp/B.l9woqxfi/BUILD/zbackup-1.4.4/file.hh:62:63: error: ISO C++17 does not allow dynamic exception specifications 62 | size_t readRecords( void * buf, size_t size, size_t count ) throw( exWriteError ); | ^~~~~ /tmp/B.l9woqxfi/BUILD/zbackup-1.4.4/file.hh:70:47: error: ISO C++17 does not allow dynamic exception specifications 70 | void write( void const * buf, size_t size ) throw( exWriteError ); | ^~~~~ /tmp/B.l9woqxfi/BUILD/zbackup-1.4.4/file.hh:73:33: error: ISO C++17 does not allow dynamic exception specifications 73 | void write( T const & value ) throw( exWriteError ) | ^~~~~ /tmp/B.l9woqxfi/BUILD/zbackup-1.4.4/file.hh:81:5: error: ISO C++17 does not allow dynamic exception specifications 81 | throw( exWriteError ); | ^~~~~ /tmp/B.l9woqxfi/BUILD/zbackup-1.4.4/file.hh:86:59: error: ISO C++17 does not allow dynamic exception specifications 86 | char * gets( char * s, int size, bool stripNl = false ) throw( exWriteError ); | ^~~~~ /tmp/B.l9woqxfi/BUILD/zbackup-1.4.4/file.hh:90:43: error: ISO C++17 does not allow dynamic exception specifications 90 | std::string gets( bool stripNl = true ) throw( exReadError, exWriteError ); | ^~~~~ /tmp/B.l9woqxfi/BUILD/zbackup-1.4.4/file.hh:93:28: error: ISO C++17 does not allow dynamic exception specifications 93 | void seek( long offset ) throw( exSeekError, exWriteError ); | ^~~~~ /tmp/B.l9woqxfi/BUILD/zbackup-1.4.4/file.hh:95:31: error: ISO C++17 does not allow dynamic exception specifications 95 | void seekCur( long offset ) throw( exSeekError, exWriteError ); | ^~~~~ /tmp/B.l9woqxfi/BUILD/zbackup-1.4.4/file.hh:97:35: error: ISO C++17 does not allow dynamic exception specifications 97 | void seekEnd( long offset = 0 ) throw( exSeekError, exWriteError ); | ^~~~~ /tmp/B.l9woqxfi/BUILD/zbackup-1.4.4/file.hh:100:17: error: ISO C++17 does not allow dynamic exception specifications 100 | void rewind() throw( exSeekError, exWriteError ); | ^~~~~ /tmp/B.l9woqxfi/BUILD/zbackup-1.4.4/file.hh:103:17: error: ISO C++17 does not allow dynamic exception specifications 103 | size_t tell() throw( exSeekError ); | ^~~~~ /tmp/B.l9woqxfi/BUILD/zbackup-1.4.4/file.hh:106:17: error: ISO C++17 does not allow dynamic exception specifications 106 | size_t size() throw( exSeekError, exWriteError ); | ^~~~~ /tmp/B.l9woqxfi/BUILD/zbackup-1.4.4/file.hh:109:14: error: ISO C++17 does not allow dynamic exception specifications 109 | bool eof() throw( exWriteError ); | ^~~~~ /tmp/B.l9woqxfi/BUILD/zbackup-1.4.4/file.hh:113:17: error: ISO C++17 does not allow dynamic exception specifications 113 | FILE * file() throw( exWriteError ); | ^~~~~ /tmp/B.l9woqxfi/BUILD/zbackup-1.4.4/file.hh:117:20: error: ISO C++17 does not allow dynamic exception specifications 117 | FILE * release() throw( exWriteError ); | ^~~~~ /tmp/B.l9woqxfi/BUILD/zbackup-1.4.4/file.hh:120:16: error: ISO C++17 does not allow dynamic exception specifications 120 | void close() throw( exWriteError ); | ^~~~~ /tmp/B.l9woqxfi/BUILD/zbackup-1.4.4/file.hh:131:44: error: ISO C++17 does not allow dynamic exception specifications 131 | static void erase( std::string const & ) throw( exCantErase ); | ^~~~~ /tmp/B.l9woqxfi/BUILD/zbackup-1.4.4/file.hh:135:48: error: ISO C++17 does not allow dynamic exception specifications 135 | std::string const & to ) throw( exCantRename ); | ^~~~~ /tmp/B.l9woqxfi/BUILD/zbackup-1.4.4/file.hh:155:48: error: ISO C++17 does not allow dynamic exception specifications 155 | void open( char const * filename, OpenMode ) throw( exCantOpen ); | ^~~~~ /tmp/B.l9woqxfi/BUILD/zbackup-1.4.4/file.hh:156:27: error: ISO C++17 does not allow dynamic exception specifications 156 | void flushWriteBuffer() throw( exWriteError ); | ^~~~~ /tmp/B.l9woqxfi/BUILD/zbackup-1.4.4/file.hh:157:29: error: ISO C++17 does not allow dynamic exception specifications 157 | void releaseWriteBuffer() throw( exWriteError ); | ^~~~~ In file included from /usr/include/c++/11.2.0/map:60, from /tmp/B.l9woqxfi/BUILD/zbackup-1.4.4/bundle.hh:10, from /tmp/B.l9woqxfi/BUILD/zbackup-1.4.4/chunk_storage.hh:13, from /tmp/B.l9woqxfi/BUILD/zbackup-1.4.4/chunk_storage.cc:5: /usr/include/c++/11.2.0/bits/stl_tree.h: In instantiation of 'static const _Key& std::_Rb_tree<_Key, _Val, _KeyOfValue, _Compare, _Alloc>::_S_key(std::_Rb_tree<_Key, _Val, _KeyOfValue, _Compare, _Alloc>::_Const_Link_type) [with _Key = std::_List_iterator<ObjectCache::Object>; _Val = std::_List_iterator<ObjectCache::Object>; _KeyOfValue = std::_Identity<std::_List_iterator<ObjectCache::Object> >; _Compare = ObjectCache::ObjectsIteratorComp; _Alloc = std::allocator<std::_List_iterator<ObjectCache::Object> >; std::_Rb_tree<_Key, _Val, _KeyOfValue, _Compare, _Alloc>::_Const_Link_type = const std::_Rb_tree_node<std::_List_iterator<ObjectCache::Object> >*]': /usr/include/c++/11.2.0/bits/stl_tree.h:2069:47: required from 'std::pair<std::_Rb_tree_node_base*, std::_Rb_tree_node_base*> std::_Rb_tree<_Key, _Val, _KeyOfValue, _Compare, _Alloc>::_M_get_insert_unique_pos(const key_type&) [with _Key = std::_List_iterator<ObjectCache::Object>; _Val = std::_List_iterator<ObjectCache::Object>; _KeyOfValue = std::_Identity<std::_List_iterator<ObjectCache::Object> >; _Compare = ObjectCache::ObjectsIteratorComp; _Alloc = std::allocator<std::_List_iterator<ObjectCache::Object> >; std::_Rb_tree<_Key, _Val, _KeyOfValue, _Compare, _Alloc>::key_type = std::_Rb_tree<std::_List_iterator<ObjectCache::Object>, std::_List_iterator<ObjectCache::Object>, std::_Identity<std::_List_iterator<ObjectCache::Object> >, ObjectCache::ObjectsIteratorComp, std::allocator<std::_List_iterator<ObjectCache::Object> > >::key_type]' /usr/include/c++/11.2.0/bits/stl_tree.h:2122:4: required from 'std::pair<std::_Rb_tree_iterator<_Val>, bool> std::_Rb_tree<_Key, _Val, _KeyOfValue, _Compare, _Alloc>::_M_insert_unique(_Arg&&) [with _Arg = std::_List_iterator<ObjectCache::Object>; _Key = std::_List_iterator<ObjectCache::Object>; _Val = std::_List_iterator<ObjectCache::Object>; _KeyOfValue = std::_Identity<std::_List_iterator<ObjectCache::Object> >; _Compare = ObjectCache::ObjectsIteratorComp; _Alloc = std::allocator<std::_List_iterator<ObjectCache::Object> >]' /usr/include/c++/11.2.0/bits/stl_set.h:521:25: required from 'std::pair<typename std::_Rb_tree<_Key, _Key, std::_Identity<_Tp>, _Compare, typename __gnu_cxx::__alloc_traits<_Alloc>::rebind<_Key>::other>::const_iterator, bool> std::set<_Key, _Compare, _Alloc>::insert(std::set<_Key, _Compare, _Alloc>::value_type&&) [with _Key = std::_List_iterator<ObjectCache::Object>; _Compare = ObjectCache::ObjectsIteratorComp; _Alloc = std::allocator<std::_List_iterator<ObjectCache::Object> >; typename std::_Rb_tree<_Key, _Key, std::_Identity<_Tp>, _Compare, typename __gnu_cxx::__alloc_traits<_Alloc>::rebind<_Key>::other>::const_iterator = std::_Rb_tree<std::_List_iterator<ObjectCache::Object>, std::_List_iterator<ObjectCache::Object>, std::_Identity<std::_List_iterator<ObjectCache::Object> >, ObjectCache::ObjectsIteratorComp, std::allocator<std::_List_iterator<ObjectCache::Object> > >::const_iterator; typename __gnu_cxx::__alloc_traits<_Alloc>::rebind<_Key>::other = std::allocator<std::_List_iterator<ObjectCache::Object> >; typename __gnu_cxx::__alloc_traits<_Alloc>::rebind<_Key> = __gnu_cxx::__alloc_traits<std::allocator<std::_List_iterator<ObjectCache::Object> >, std::_List_iterator<ObjectCache::Object> >::rebind<std::_List_iterator<ObjectCache::Object> >; typename _Alloc::value_type = std::allocator<std::_List_iterator<ObjectCache::Object> >::value_type; std::set<_Key, _Compare, _Alloc>::value_type = std::set<std::_List_iterator<ObjectCache::Object>, ObjectCache::ObjectsIteratorComp>::value_type]' /tmp/B.l9woqxfi/BUILD/zbackup-1.4.4/objectcache.hh:89:62: required from 'sptr<T>& ObjectCache::entry(const ObjectId&) [with T = Bundle::Reader; ObjectCache::ObjectId = std::__cxx11::basic_string<char>]' /tmp/B.l9woqxfi/BUILD/zbackup-1.4.4/chunk_storage.cc:228:74: required from here /usr/include/c++/11.2.0/bits/stl_tree.h:770:15: error: static assertion failed: comparison object must be invocable as const 770 | is_invocable_v<const _Compare&, const _Key&, const _Key&>, | ^~~~~~~~~~~~~~~~~~~~~~~~~~~~~~~~~~~~~~~~~~~~~~~~~~~~~~~~~ /usr/include/c++/11.2.0/bits/stl_tree.h:770:15: note: 'std::is_invocable_v<const ObjectCache::ObjectsIteratorComp&, const std::_List_iterator<ObjectCache::Object>&, const std::_List_iterator<ObjectCache::Object>&>' evaluates to false make[2]: *** [CMakeFiles/zbackup.dir/build.make:198: CMakeFiles/zbackup.dir/chunk_storage.cc.o] Error 1 make[2]: Leaving directory '/tmp/B.l9woqxfi/BUILD/zbackup-1.4.4/build' make[1]: *** [CMakeFiles/Makefile2:99: CMakeFiles/zbackup.dir/all] Error 2 make: *** [Makefile:153: all] Error 2 error: Bad exit status from /tmp/B.l9woqxfi/BUILD/tmp/rpm-tmp.MMubqN (%build) RPM build errors: Macro expanded in comment on line 9: %{version}/%{name}-%{version}.tar.gz Could not canonicalize hostname: nereid Bad exit status from /tmp/B.l9woqxfi/BUILD/tmp/rpm-tmp.MMubqN (%build) ended at: Mon Sep 27 03:43:39 2021, done in 0:00:03.692130 error: No files produced. + chmod -R u+rwX /tmp/B.l9woqxfi/BUILD + rm -rf /tmp/B.l9woqxfi/tmp /tmp/B.l9woqxfi/BUILD + rm -rf /tmp/B.l9woqxfi Begin-PLD-Builder-Info Build-Time: user:12.18s sys:1.99s real:5.37s (faults io:33 non-io:372910) End-PLD-Builder-Info
[Back to list of logs] [View rpm -qa of builder]