FailedOk

th/SRPMS[OK]
th/x32[OK]
th/i686[OK]
th/x86_64[OK]

ac/SRPMS[OK]
ac/i386[OK]
ac/i586[OK]
ac/i686[OK]
ac/alpha[OK]
ac/amd64[OK]
ac/athlon[OK]
ac/ppc[OK]
ac/sparc[OK]
ac/sparc64[OK]

Advanced Search
main()
Powered by PLD Linux
(c) 2002-2021 PLD Team
$Revision: 1.37 $
Powered by Unix conspiracy.
Your IP: 52.23.219.12

zephyr ce901fa8-f17a-4397-882a-6912162f02ad

Status:Failed
Source URL:https://buildlogs.pld-linux.org/pld/th/i686/FAIL/zephyr,ce901fa8-f17a-4397-882a-6912162f02ad.bz2
text/plain URL:View!
rpm -qa of builder:View!
Date:2021/11/21 08:58:17
Runtime:0:00:25.850588

Toc:

  • prep
  • Executing(%prep): /bin/sh -e /tmp/B.o_glf5h0/BUILD/tmp/rpm-tmp.jZuI84
  • build
  • Executing(%build): /bin/sh -e /tmp/B.o_glf5h0/BUILD/tmp/rpm-tmp.fmUbkI
  • error 1
  • string_dictionary.h:2:1: error: unknown type name 'the'
  • error 2
  • string_dictionary.h:2:13: error: expected '=', ',', ';', 'asm' or '__attribute__' before 'Athena'
  • error 3
  • string_dictionary.h:2:13: error: unknown type name 'Athena'
  • error 4
  • string_dictionary.h:6:44: error: stray '@' in program
  • error 5
  • string_dictionary.h:26:5: error: expected specifier-qualifier-list before 'string_dictionary_binding'
  • error 6
  • string_dictionary.h:68:69: error: expected declaration specifiers or '...' before 'string_dictionary_binding'
  • error 7
  • string_dictionary.h:78:34: error: expected '=', ',', ';', 'asm' or '__attribute__' before '*' token
  • error 8
  • string_dictionary.h:97:34: error: expected '=', ',', ';', 'asm' or '__attribute__' before '*' token
  • error 9
  • string_dictionary.h:111:38: error: expected declaration specifiers or '...' before 'string_dictionary_binding'
  • error 10
  • make[2]: *** [Makefile:91: formatter.o] Error 1
  • error 11
  • string_dictionary.h:2:1: error: unknown type name 'the'
  • error 12
  • string_dictionary.h:2:13: error: expected '=', ',', ';', 'asm' or '__attribute__' before 'Athena'
  • error 13
  • string_dictionary.h:2:13: error: unknown type name 'Athena'
  • error 14
  • string_dictionary.h:6:44: error: stray '@' in program
  • error 15
  • string_dictionary.h:26:5: error: expected specifier-qualifier-list before 'string_dictionary_binding'
  • error 16
  • string_dictionary.h:68:69: error: expected declaration specifiers or '...' before 'string_dictionary_binding'
  • error 17
  • string_dictionary.h:78:34: error: expected '=', ',', ';', 'asm' or '__attribute__' before '*' token
  • error 18
  • string_dictionary.h:97:34: error: expected '=', ',', ';', 'asm' or '__attribute__' before '*' token
  • error 19
  • string_dictionary.h:111:38: error: expected declaration specifiers or '...' before 'string_dictionary_binding'
  • error 20
  • variables.c:199:32: error: 'binding' undeclared (first use in this function)
  • error 21
  • make[2]: *** [Makefile:91: variables.o] Error 1
  • error 22
  • string_dictionary.h:2:1: error: unknown type name 'the'
  • error 23
  • string_dictionary.h:2:13: error: expected '=', ',', ';', 'asm' or '__attribute__' before 'Athena'
  • error 24
  • string_dictionary.h:2:13: error: unknown type name 'Athena'
  • error 25
  • string_dictionary.h:6:44: error: stray '@' in program
  • error 26
  • string_dictionary.h:26:5: error: expected specifier-qualifier-list before 'string_dictionary_binding'
  • error 27
  • string_dictionary.h:68:69: error: expected declaration specifiers or '...' before 'string_dictionary_binding'
  • error 28
  • string_dictionary.h:78:34: error: expected '=', ',', ';', 'asm' or '__attribute__' before '*' token
  • error 29
  • string_dictionary.h:97:34: error: expected '=', ',', ';', 'asm' or '__attribute__' before '*' token
  • error 30
  • string_dictionary.h:111:38: error: expected declaration specifiers or '...' before 'string_dictionary_binding'
  • error 31
  • tty_filter.c:114:32: error: 'b' undeclared (first use in this function)
  • error 32
  • tty_filter.c:92:70: error: invalid type argument of '->' (have 'int')
  • error 33
  • tty_filter.c:92:70: error: invalid type argument of '->' (have 'int')
  • error 34
  • tty_filter.c:92:70: error: invalid type argument of '->' (have 'int')
  • error 35
  • tty_filter.c:92:70: error: invalid type argument of '->' (have 'int')
  • error 36
  • tty_filter.c:92:70: error: invalid type argument of '->' (have 'int')
  • error 37
  • tty_filter.c:92:70: error: invalid type argument of '->' (have 'int')
  • error 38
  • tty_filter.c:92:70: error: invalid type argument of '->' (have 'int')
  • error 39
  • tty_filter.c:92:70: error: invalid type argument of '->' (have 'int')
  • error 40
  • tty_filter.c:92:70: error: invalid type argument of '->' (have 'int')
  • error 41
  • tty_filter.c:92:70: error: invalid type argument of '->' (have 'int')
  • error 42
  • tty_filter.c:92:70: error: invalid type argument of '->' (have 'int')
  • error 43
  • tty_filter.c:92:70: error: invalid type argument of '->' (have 'int')
  • error 44
  • tty_filter.c:92:70: error: invalid type argument of '->' (have 'int')
  • error 45
  • tty_filter.c:92:70: error: invalid type argument of '->' (have 'int')
  • error 46
  • tty_filter.c:193:66: error: invalid type argument of '->' (have 'int')
  • error 47
  • tty_filter.c:92:70: error: invalid type argument of '->' (have 'int')
  • error 48
  • tty_filter.c:92:70: error: invalid type argument of '->' (have 'int')
  • error 49
  • tty_filter.c:197:66: error: invalid type argument of '->' (have 'int')
  • error 50
  • tty_filter.c:92:70: error: invalid type argument of '->' (have 'int')
  • error 51
  • tty_filter.c:92:70: error: invalid type argument of '->' (have 'int')
  • error 52
  • tty_filter.c:201:65: error: invalid type argument of '->' (have 'int')
  • error 53
  • tty_filter.c:92:70: error: invalid type argument of '->' (have 'int')
  • error 54
  • tty_filter.c:92:70: error: invalid type argument of '->' (have 'int')
  • error 55
  • tty_filter.c:379:40: error: 'b' undeclared (first use in this function)
  • error 56
  • make[2]: *** [Makefile:91: tty_filter.o] Error 1
  • error 57
  • make[1]: *** [Makefile:35: all] Error 1
  • error 58
  • error: Bad exit status from /tmp/B.o_glf5h0/BUILD/tmp/rpm-tmp.fmUbkI (%build)
  • error 59
  • RPM build errors:
  • error 60
  • error: No files produced.

Content:

request from: baggins
checking if we should skip the build
started at: Sun Nov 21 08:57:49 2021
killing old processes on a builder
sending signal 9 to pid -1
cleaning up /tmp
fetching https://srcbuilder.pld-linux.org/th//srpms/ce901fa8-f17a-4397-882a-6912162f02ad/zephyr-3.1.2-2.src.rpm
fetched 398792 bytes, 1076.5 K/s
installing srpm: zephyr-3.1.2-2.src.rpm
+ install -d /tmp/B.o_glf5h0/BUILD /tmp/B.o_glf5h0/RPMS
+ LC_ALL=en_US.UTF-8
+ rpm -qp --changelog zephyr-3.1.2-2.src.rpm
* Sat Nov 20 2021 PLD Linux Team <feedback@pld-linux.org>
- For complete changelog see: http://git.pld-linux.org/?p=packages/zephyr.git;a=log;h=master
* Sat Nov 20 2021 Jan Rękorajski <baggins@pld-linux.org> e7c54ef
- rebuild with separate debuginfo build-ids * Sun Mar 07 2021 Jakub Bogusz <qboosh@pld-linux.org> 58f98ed
- updated to 3.1.2 - heimdal patch to complete heimdal Kerberos5 support + rpm -Uhv --nodeps --define '_topdir /tmp/B.o_glf5h0' --define '_specdir %{_topdir}' --define '_sourcedir %{_specdir}' --define '_rpmdir %{_topdir}/RPMS' --define '_builddir %{_topdir}/BUILD' zephyr-3.1.2-2.src.rpm Updating / installing... zephyr-3.1.2-2 ######################################## + rm -f zephyr-3.1.2-2.src.rpm + install -m 700 -d /tmp/B.o_glf5h0/BUILD/tmp + TMPDIR=/tmp/B.o_glf5h0/BUILD/tmp + exec nice -n 0 rpmbuild -bp --short-circuit --nodeps --define '_topdir /tmp/B.o_glf5h0' --define '_specdir %{_topdir}' --define '_sourcedir %{_specdir}' --define '_rpmdir %{_topdir}/RPMS' --define '_builddir %{_topdir}/BUILD' --target i686-pld-linux --define 'prep exit 0' /tmp/B.o_glf5h0/zephyr.spec warning: Could not canonicalize hostname: nereid Building target platforms: i686-pld-linux Building for target i686-pld-linux checking BuildConflict-ing packages rpm: warning: Could not canonicalize hostname: nereid rpm: Building target platforms: i686-pld-linux rpm: Building for target i686-pld-linux no BuildConflicts found checking BR rpm: warning: Could not canonicalize hostname: nereid rpm: Building target platforms: i686-pld-linux rpm: Building for target i686-pld-linux no BR needed building RPM using: set -ex; : build-id: ce901fa8-f17a-4397-882a-6912162f02ad; TMPDIR=/tmp/B.o_glf5h0/BUILD/tmp exec nice -n 0 rpmbuild -bb --define '_smp_mflags -j9' --define '_make_opts -Otarget' --define '_pld_builder 1' --define '_topdir /tmp/B.o_glf5h0' --define '_specdir %{_topdir}' --define '_sourcedir %{_specdir}' --define '_rpmdir %{_topdir}/RPMS' --define '_builddir %{_topdir}/BUILD' --target i686-pld-linux /tmp/B.o_glf5h0/zephyr.spec + : build-id: ce901fa8-f17a-4397-882a-6912162f02ad + TMPDIR=/tmp/B.o_glf5h0/BUILD/tmp + exec nice -n 0 rpmbuild -bb --define '_smp_mflags -j9' --define '_make_opts -Otarget' --define '_pld_builder 1' --define '_topdir /tmp/B.o_glf5h0' --define '_specdir %{_topdir}' --define '_sourcedir %{_specdir}' --define '_rpmdir %{_topdir}/RPMS' --define '_builddir %{_topdir}/BUILD' --target i686-pld-linux /tmp/B.o_glf5h0/zephyr.spec warning: Could not canonicalize hostname: nereid Building target platforms: i686-pld-linux Building for target i686-pld-linux Executing(%prep): /bin/sh -e /tmp/B.o_glf5h0/BUILD/tmp/rpm-tmp.jZuI84 + umask 022 + cd /tmp/B.o_glf5h0/BUILD + cd /tmp/B.o_glf5h0/BUILD + rm -rf zephyr-3.1.2 + /bin/gzip -dc /tmp/B.o_glf5h0/zephyr-3.1.2.tar.gz + /bin/tar -xof - + STATUS=0 + '[' 0 -ne 0 ']' + cd zephyr-3.1.2 + /bin/chmod -Rf a+rX,u+w,g-w,o-w . + echo 'Patch #0 (zephyr-heimdal.patch):' Patch #0 (zephyr-heimdal.patch): + </tmp/B.o_glf5h0/zephyr-heimdal.patch + /usr/bin/patch -s -p1 '--fuzz=0' + /bin/sed -i -e s/__DEV__/3.1.2/ configure.ac + RPM_EC=0 + jobs -p + exit 0 Executing(%build): /bin/sh -e /tmp/B.o_glf5h0/BUILD/tmp/rpm-tmp.fmUbkI TMP=/home/users/builder/tmp HOME=/home/users/builder PATH=/home/users/builder/GNUstep/Tools:/bin:/usr/bin:/usr/local/bin:/home/users/builder/bin TMPDIR=/tmp/B.o_glf5h0/BUILD/tmp + umask 022 + cd /tmp/B.o_glf5h0/BUILD + cd zephyr-3.1.2 + libtoolize --copy --force --install libtoolize: putting auxiliary files in '.'. libtoolize: copying file './config.guess' libtoolize: copying file './config.sub' libtoolize: copying file './install-sh' libtoolize: copying file './ltmain.sh' libtoolize: putting macros in AC_CONFIG_MACRO_DIRS, 'm4'. libtoolize: copying file 'm4/libtool.m4' libtoolize: copying file 'm4/ltoptions.m4' libtoolize: copying file 'm4/ltsugar.m4' libtoolize: copying file 'm4/ltversion.m4' libtoolize: copying file 'm4/lt~obsolete.m4' libtoolize: Consider adding '-I m4' to ACLOCAL_AMFLAGS in Makefile.am. + aclocal -I m4 + autoconf configure.ac:13: warning: The macro `AC_CANONICAL_SYSTEM' is obsolete. configure.ac:13: You should run autoupdate. ./lib/autoconf/general.m4:2081: AC_CANONICAL_SYSTEM is expanded from... configure.ac:13: the top level configure.ac:20: warning: AC_PROG_LEX without either yywrap or noyywrap is obsolete ./lib/autoconf/programs.m4:716: _AC_PROG_LEX is expanded from... ./lib/autoconf/programs.m4:709: AC_PROG_LEX is expanded from... configure.ac:20: the top level configure.ac:22: warning: The macro `AC_PROG_LIBTOOL' is obsolete. configure.ac:22: You should run autoupdate. m4/libtool.m4:99: AC_PROG_LIBTOOL is expanded from... configure.ac:22: the top level configure.ac:37: warning: The macro `AC_HEADER_STDC' is obsolete. configure.ac:37: You should run autoupdate. ./lib/autoconf/headers.m4:704: AC_HEADER_STDC is expanded from... configure.ac:37: the top level configure.ac:56: warning: The macro `AC_TYPE_SIGNAL' is obsolete. configure.ac:56: You should run autoupdate. ./lib/autoconf/types.m4:776: AC_TYPE_SIGNAL is expanded from... configure.ac:56: the top level configure.ac:69: warning: The macro `AC_WARN' is obsolete. configure.ac:69: You should run autoupdate. ./lib/autoconf/oldnames.m4:33: AC_WARN is expanded from... configure.ac:69: the top level configure.ac:279: warning: The macro `AC_TRY_COMPILE' is obsolete. configure.ac:279: You should run autoupdate. ./lib/autoconf/general.m4:2847: AC_TRY_COMPILE is expanded from... lib/m4sugar/m4sh.m4:692: _AS_IF_ELSE is expanded from... lib/m4sugar/m4sh.m4:699: AS_IF is expanded from... ./lib/autoconf/general.m4:2249: AC_CACHE_VAL is expanded from... configure.ac:279: the top level configure.ac:279: warning: The macro `AC_TRY_COMPILE' is obsolete. configure.ac:279: You should run autoupdate. ./lib/autoconf/general.m4:2847: AC_TRY_COMPILE is expanded from... lib/m4sugar/m4sh.m4:692: _AS_IF_ELSE is expanded from... lib/m4sugar/m4sh.m4:699: AS_IF is expanded from... ./lib/autoconf/general.m4:2823: _AC_COMPILE_IFELSE is expanded from... ./lib/autoconf/general.m4:2839: AC_COMPILE_IFELSE is expanded from... ./lib/autoconf/general.m4:2847: AC_TRY_COMPILE is expanded from... lib/m4sugar/m4sh.m4:692: _AS_IF_ELSE is expanded from... lib/m4sugar/m4sh.m4:699: AS_IF is expanded from... ./lib/autoconf/general.m4:2249: AC_CACHE_VAL is expanded from... configure.ac:279: the top level configure.ac:310: warning: The macro `AC_TRY_COMPILE' is obsolete. configure.ac:310: You should run autoupdate. ./lib/autoconf/general.m4:2847: AC_TRY_COMPILE is expanded from... lib/m4sugar/m4sh.m4:692: _AS_IF_ELSE is expanded from... lib/m4sugar/m4sh.m4:699: AS_IF is expanded from... ./lib/autoconf/general.m4:2249: AC_CACHE_VAL is expanded from... ./lib/autoconf/general.m4:2270: AC_CACHE_CHECK is expanded from... configure.ac:310: the top level configure.ac:332: warning: The macro `AC_TRY_COMPILE' is obsolete. configure.ac:332: You should run autoupdate. ./lib/autoconf/general.m4:2847: AC_TRY_COMPILE is expanded from... lib/m4sugar/m4sh.m4:692: _AS_IF_ELSE is expanded from... lib/m4sugar/m4sh.m4:699: AS_IF is expanded from... ./lib/autoconf/general.m4:2249: AC_CACHE_VAL is expanded from... configure.ac:332: the top level configure.ac:348: warning: The macro `AC_TRY_COMPILE' is obsolete. configure.ac:348: You should run autoupdate. ./lib/autoconf/general.m4:2847: AC_TRY_COMPILE is expanded from... lib/m4sugar/m4sh.m4:692: _AS_IF_ELSE is expanded from... lib/m4sugar/m4sh.m4:699: AS_IF is expanded from... ./lib/autoconf/general.m4:2249: AC_CACHE_VAL is expanded from... configure.ac:348: the top level configure.ac:394: warning: The macro `AC_CONFIG_HEADER' is obsolete. configure.ac:394: You should run autoupdate. ./lib/autoconf/status.m4:719: AC_CONFIG_HEADER is expanded from... configure.ac:394: the top level configure.ac:395: warning: AC_OUTPUT should be used without arguments. configure.ac:395: You should run autoupdate. + autoheader + ./configure 'LDFLAGS=-Wl,--as-needed -Wl,--no-copy-dt-needed-entries -Wl,-z,relro -Wl,-z,combreloc ' 'CFLAGS=-O2 -fwrapv -pipe -Wformat -Werror=format-security -gdwarf-4 -fno-debug-types-section -fvar-tracking-assignments -g2 -Wp,-D_FORTIFY_SOURCE=2 -fstack-protector-strong --param=ssp-buffer-size=4 -Werror=trampolines -fomit-frame-pointer -march=i686 -fasynchronous-unwind-tables -mtune=pentium4 -gdwarf-4 -fno-debug-types-section -fvar-tracking-assignments -g2 ' 'CXXFLAGS=-O2 -fwrapv -pipe -Wformat -Werror=format-security -gdwarf-4 -fno-debug-types-section -fvar-tracking-assignments -g2 -Wp,-D_FORTIFY_SOURCE=2 -fstack-protector-strong --param=ssp-buffer-size=4 -Werror=trampolines -fomit-frame-pointer -march=i686 -fasynchronous-unwind-tables -mtune=pentium4 -gdwarf-4 -fno-debug-types-section -fvar-tracking-assignments -g2 ' 'FFLAGS=-O2 -fwrapv -pipe -Wformat -Werror=format-security -gdwarf-4 -fno-debug-types-section -fvar-tracking-assignments -g2 -Wp,-D_FORTIFY_SOURCE=2 -fstack-protector-strong --param=ssp-buffer-size=4 -Werror=trampolines -fomit-frame-pointer -march=i686 -fasynchronous-unwind-tables -mtune=pentium4 -gdwarf-4 -fno-debug-types-section -fvar-tracking-assignments -g2 ' 'FCFLAGS=-O2 -fwrapv -pipe -Wformat -Werror=format-security -gdwarf-4 -fno-debug-types-section -fvar-tracking-assignments -g2 -Wp,-D_FORTIFY_SOURCE=2 -fstack-protector-strong --param=ssp-buffer-size=4 -Werror=trampolines -fomit-frame-pointer -march=i686 -fasynchronous-unwind-tables -mtune=pentium4 -gdwarf-4 -fno-debug-types-section -fvar-tracking-assignments -g2 ' 'CPPFLAGS=' 'CC=i686-pld-linux-gcc' 'CXX=i686-pld-linux-g++' '--host=i686-pld-linux' '--build=i686-pld-linux' '--prefix=/usr' '--exec-prefix=/usr' '--bindir=/usr/bin' '--sbindir=/usr/sbin' '--sysconfdir=/etc' '--datadir=/usr/share' '--includedir=/usr/include' '--libdir=/usr/lib' '--libexecdir=/usr/libexec' '--localstatedir=/var' '--sharedstatedir=/var/lib' '--mandir=/usr/share/man' '--infodir=/usr/share/info' '--x-libraries=/usr/lib' --with-krb5 checking build system type... i686-pld-linux-gnu checking host system type... i686-pld-linux-gnu checking target system type... i686-pld-linux-gnu checking for i686-pld-linux-gcc... i686-pld-linux-gcc checking whether the C compiler works... yes checking for C compiler default output file name... a.out checking for suffix of executables... checking whether we are cross compiling... no checking for suffix of object files... o checking whether the compiler supports GNU C... yes checking whether i686-pld-linux-gcc accepts -g... yes checking for i686-pld-linux-gcc option to enable C11 features... none needed checking for bison... bison -y checking for flex... flex checking for lex output file root... lex.yy checking for lex library... none needed checking for library containing yywrap... -lfl checking whether yytext is a pointer... yes checking for a BSD-compatible install... /usr/bin/install -c checking how to print strings... print -r checking for a sed that does not truncate output... /bin/sed checking for grep that handles long lines and -e... /bin/grep checking for egrep... /bin/grep -E checking for fgrep... /bin/grep -F checking for ld used by i686-pld-linux-gcc... /usr/bin/ld checking if the linker (/usr/bin/ld) is GNU ld... yes checking for BSD- or MS-compatible name lister (nm)... /usr/bin/nm -B checking the name lister (/usr/bin/nm -B) interface... BSD nm checking whether ln -s works... yes checking the maximum length of command line arguments... 1572864 checking how to convert i686-pld-linux-gnu file names to i686-pld-linux-gnu format... func_convert_file_noop checking how to convert i686-pld-linux-gnu file names to toolchain format... func_convert_file_noop checking for /usr/bin/ld option to reload object files... -r checking for i686-pld-linux-objdump... no checking for objdump... objdump checking how to recognize dependent libraries... pass_all checking for i686-pld-linux-dlltool... no checking for dlltool... no checking how to associate runtime and link libraries... print -r -- checking for i686-pld-linux-ar... no checking for ar... ar checking for archiver @FILE support... @ checking for i686-pld-linux-strip... no checking for strip... strip checking for i686-pld-linux-ranlib... no checking for ranlib... ranlib checking for mawk... mawk checking command to parse /usr/bin/nm -B output from i686-pld-linux-gcc object... ok checking for sysroot... no checking for a working dd... /bin/dd checking how to truncate binary pipes... /bin/dd bs=4096 count=1 checking for i686-pld-linux-mt... no checking for mt... no checking if : is a manifest tool... no checking for stdio.h... yes checking for stdlib.h... yes checking for string.h... yes checking for inttypes.h... yes checking for stdint.h... yes checking for strings.h... yes checking for sys/stat.h... yes checking for sys/types.h... yes checking for unistd.h... yes checking for dlfcn.h... yes checking for objdir... .libs checking if i686-pld-linux-gcc supports -fno-rtti -fno-exceptions... no checking for i686-pld-linux-gcc option to produce PIC... -fPIC -DPIC checking if i686-pld-linux-gcc PIC flag -fPIC -DPIC works... yes checking if i686-pld-linux-gcc static flag -static works... yes checking if i686-pld-linux-gcc supports -c -o file.o... yes checking if i686-pld-linux-gcc supports -c -o file.o... (cached) yes checking whether the i686-pld-linux-gcc linker (/usr/bin/ld) supports shared libraries... yes checking whether -lc should be explicitly linked in... no checking dynamic linker characteristics... GNU/Linux ld.so checking how to hardcode library paths into programs... immediate checking whether stripping libraries is possible... yes checking if libtool supports shared libraries... yes checking whether to build shared libraries... yes checking whether to build static libraries... yes checking location of temporary directory... /var/tmp/ checking how to run the C preprocessor... i686-pld-linux-gcc -E checking for X... libraries /usr/lib, headers checking whether -R must be followed by a space... no checking for gethostbyname... yes checking for connect... yes checking for remove... yes checking for shmat... yes checking for IceConnectionNumber in -lICE... yes checking for egrep... (cached) /bin/grep -E checking for sys/wait.h that is POSIX.1 compatible... yes checking for fcntl.h... yes checking for paths.h... yes checking for sgtty.h... yes checking for unistd.h... (cached) yes checking for malloc.h... yes checking for sys/filio.h... no checking for sys/ioctl.h... yes checking for sys/time.h... yes checking for sys/file.h... yes checking for sys/utsname.h... yes checking for sys/select.h... yes checking for sys/msgbuf.h... no checking for sys/cdefs.h... yes checking for krb5_err.h... yes checking for termcap.h... yes checking for arpa/nameser_compat.h... yes checking for stdbool.h... yes checking for termio.h... yes checking for curses.h... yes checking for term.h... yes checking return type of signal handlers... void checking for uid_t in sys/types.h... yes checking size of short... 2 checking size of int... 4 checking size of long... 4 checking for 32-bit integer type... long checking for wslen in -lw... no checking for struct sockaddr_in.sin_len... no checking for struct sockaddr_in6.sin6_len... no checking for library containing gethostbyname... none required checking for library containing socket... none required checking for strerror in -l44bsd... no checking for iconv_open... yes checking for tgetstr in -lcurses... yes checking for library containing gethostbyname... (cached) none required checking for library containing socket... (cached) none required checking for compile in -lgen... no checking for krb5-config... yes checking for krb5.h... yes checking for krb5_init_context... yes checking for res_send... yes checking for regcomp... yes checking for com_err in -lcom_err... yes checking for ss_perror in -lss... yes checking for ares_getnameinfo in -lcares... yes checking whether i686-pld-linux-gcc needs -traditional... no checking for vprintf... yes checking whether getpgrp requires zero arguments... yes checking whether setpgrp requires zero arguments... yes checking for putenv... yes checking for strchr... yes checking for memcpy... yes checking for memmove... yes checking for waitpid... yes checking for getlogin... yes checking for strerror... yes checking for random... yes checking for lrand48... yes checking for gethostid... yes checking for getsid... yes checking for getpgid... yes checking for etext... yes checking for krb_get_err_text... no checking for krb_log... no checking for krb5_free_data... yes checking for krb5_c_make_checksum... yes checking for krb5_cc_set_default_name... yes checking for krb5_crypto_init... yes checking for krb5_c_decrypt... yes checking for krb5_free_unparsed_name... yes checking krb5_auth_con_getauthenticator out argument type... krb5_authenticator * checking krb5_auth_con_getflags out argument type... int32_t checking for enc_part2 in struct krb5_ticket... no checking for enctype in struct krb5_keyblock... no configure: creating ./config.status config.status: creating Makefile config.status: creating clients/Makefile config.status: creating clients/zaway/Makefile config.status: creating clients/zctl/Makefile config.status: creating clients/zleave/Makefile config.status: creating clients/zlocate/Makefile config.status: creating clients/znol/Makefile config.status: creating clients/zshutdown_notify/Makefile config.status: creating clients/zstat/Makefile config.status: creating clients/zwrite/Makefile config.status: creating lib/Makefile config.status: creating server/Makefile config.status: creating zhm/Makefile config.status: creating zwgc/Makefile config.status: creating zephyr.pc config.status: creating h/config.h config.status: executing libtool commands + /usr/bin/make -Otarget -j9 /usr/bin/make all make[1]: Entering directory '/tmp/B.o_glf5h0/BUILD/zephyr-3.1.2' sh -x ./new_vers.sh . + top_srcdir=. + u=builder + hostname + h=nereid + date + t='Sun Nov 21 08:58:05 CET 2021' + sh ./get_vers.sh . + v='FROM SPACE' + umask 002 + >h/zephyr_version.h + /bin/echo '#define ZEPHYR_VERSION_STRING "FROM SPACE (Sun Nov 21 08:58:05 CET 2021) builder@nereid"' make[1]: Leaving directory '/tmp/B.o_glf5h0/BUILD/zephyr-3.1.2' for i in lib clients server zhm zwgc; do (cd $i; /usr/bin/make all) || exit 1; done make[2]: Entering directory '/tmp/B.o_glf5h0/BUILD/zephyr-3.1.2/lib' compile_et ./zephyr_err.et cp -f zephyr_err.h ../h/zephyr make[2]: Leaving directory '/tmp/B.o_glf5h0/BUILD/zephyr-3.1.2/lib' make[2]: Entering directory '/tmp/B.o_glf5h0/BUILD/zephyr-3.1.2/lib' /bin/sh ../libtool --mode=compile i686-pld-linux-gcc -c -o zephyr_err.lo -O2 -fwrapv -pipe -Wformat -Werror=format-security -gdwarf-4 -fno-debug-types-section -fvar-tracking-assignments -g2 -Wp,-D_FORTIFY_SOURCE=2 -fstack-protector-strong --param=ssp-buffer-size=4 -Werror=trampolines -fomit-frame-pointer -march=i686 -fasynchronous-unwind-tables -mtune=pentium4 -gdwarf-4 -fno-debug-types-section -fvar-tracking-assignments -g2 -O -DSYSCONFDIR=\"/etc\" -I../h -I../h zephyr_err.c libtool: compile: i686-pld-linux-gcc -c -O2 -fwrapv -pipe -Wformat -Werror=format-security -gdwarf-4 -fno-debug-types-section -fvar-tracking-assignments -g2 -Wp,-D_FORTIFY_SOURCE=2 -fstack-protector-strong --param=ssp-buffer-size=4 -Werror=trampolines -fomit-frame-pointer -march=i686 -fasynchronous-unwind-tables -mtune=pentium4 -gdwarf-4 -fno-debug-types-section -fvar-tracking-assignments -g2 -O -DSYSCONFDIR=\"/etc\" -I../h -I../h zephyr_err.c -fPIC -DPIC -o .libs/zephyr_err.o libtool: compile: i686-pld-linux-gcc -c -O2 -fwrapv -pipe -Wformat -Werror=format-security -gdwarf-4 -fno-debug-types-section -fvar-tracking-assignments -g2 -Wp,-D_FORTIFY_SOURCE=2 -fstack-protector-strong --param=ssp-buffer-size=4 -Werror=trampolines -fomit-frame-pointer -march=i686 -fasynchronous-unwind-tables -mtune=pentium4 -gdwarf-4 -fno-debug-types-section -fvar-tracking-assignments -g2 -O -DSYSCONFDIR=\"/etc\" -I../h -I../h zephyr_err.c -o zephyr_err.o >/dev/null 2>&1 make[2]: Leaving directory '/tmp/B.o_glf5h0/BUILD/zephyr-3.1.2/lib' make[2]: Entering directory '/tmp/B.o_glf5h0/BUILD/zephyr-3.1.2/lib' /bin/sh ../libtool --mode=compile i686-pld-linux-gcc -c -o ZCkAuth.lo -O2 -fwrapv -pipe -Wformat -Werror=format-security -gdwarf-4 -fno-debug-types-section -fvar-tracking-assignments -g2 -Wp,-D_FORTIFY_SOURCE=2 -fstack-protector-strong --param=ssp-buffer-size=4 -Werror=trampolines -fomit-frame-pointer -march=i686 -fasynchronous-unwind-tables -mtune=pentium4 -gdwarf-4 -fno-debug-types-section -fvar-tracking-assignments -g2 -O -DSYSCONFDIR=\"/etc\" -I../h -I../h ZCkAuth.c libtool: compile: i686-pld-linux-gcc -c -O2 -fwrapv -pipe -Wformat -Werror=format-security -gdwarf-4 -fno-debug-types-section -fvar-tracking-assignments -g2 -Wp,-D_FORTIFY_SOURCE=2 -fstack-protector-strong --param=ssp-buffer-size=4 -Werror=trampolines -fomit-frame-pointer -march=i686 -fasynchronous-unwind-tables -mtune=pentium4 -gdwarf-4 -fno-debug-types-section -fvar-tracking-assignments -g2 -O -DSYSCONFDIR=\"/etc\" -I../h -I../h ZCkAuth.c -fPIC -DPIC -o .libs/ZCkAuth.o libtool: compile: i686-pld-linux-gcc -c -O2 -fwrapv -pipe -Wformat -Werror=format-security -gdwarf-4 -fno-debug-types-section -fvar-tracking-assignments -g2 -Wp,-D_FORTIFY_SOURCE=2 -fstack-protector-strong --param=ssp-buffer-size=4 -Werror=trampolines -fomit-frame-pointer -march=i686 -fasynchronous-unwind-tables -mtune=pentium4 -gdwarf-4 -fno-debug-types-section -fvar-tracking-assignments -g2 -O -DSYSCONFDIR=\"/etc\" -I../h -I../h ZCkAuth.c -o ZCkAuth.o >/dev/null 2>&1 make[2]: Leaving directory '/tmp/B.o_glf5h0/BUILD/zephyr-3.1.2/lib' make[2]: Entering directory '/tmp/B.o_glf5h0/BUILD/zephyr-3.1.2/lib' /bin/sh ../libtool --mode=compile i686-pld-linux-gcc -c -o ZCmpUIDP.lo -O2 -fwrapv -pipe -Wformat -Werror=format-security -gdwarf-4 -fno-debug-types-section -fvar-tracking-assignments -g2 -Wp,-D_FORTIFY_SOURCE=2 -fstack-protector-strong --param=ssp-buffer-size=4 -Werror=trampolines -fomit-frame-pointer -march=i686 -fasynchronous-unwind-tables -mtune=pentium4 -gdwarf-4 -fno-debug-types-section -fvar-tracking-assignments -g2 -O -DSYSCONFDIR=\"/etc\" -I../h -I../h ZCmpUIDP.c libtool: compile: i686-pld-linux-gcc -c -O2 -fwrapv -pipe -Wformat -Werror=format-security -gdwarf-4 -fno-debug-types-section -fvar-tracking-assignments -g2 -Wp,-D_FORTIFY_SOURCE=2 -fstack-protector-strong --param=ssp-buffer-size=4 -Werror=trampolines -fomit-frame-pointer -march=i686 -fasynchronous-unwind-tables -mtune=pentium4 -gdwarf-4 -fno-debug-types-section -fvar-tracking-assignments -g2 -O -DSYSCONFDIR=\"/etc\" -I../h -I../h ZCmpUIDP.c -fPIC -DPIC -o .libs/ZCmpUIDP.o libtool: compile: i686-pld-linux-gcc -c -O2 -fwrapv -pipe -Wformat -Werror=format-security -gdwarf-4 -fno-debug-types-section -fvar-tracking-assignments -g2 -Wp,-D_FORTIFY_SOURCE=2 -fstack-protector-strong --param=ssp-buffer-size=4 -Werror=trampolines -fomit-frame-pointer -march=i686 -fasynchronous-unwind-tables -mtune=pentium4 -gdwarf-4 -fno-debug-types-section -fvar-tracking-assignments -g2 -O -DSYSCONFDIR=\"/etc\" -I../h -I../h ZCmpUIDP.c -o ZCmpUIDP.o >/dev/null 2>&1 make[2]: Leaving directory '/tmp/B.o_glf5h0/BUILD/zephyr-3.1.2/lib' make[2]: Entering directory '/tmp/B.o_glf5h0/BUILD/zephyr-3.1.2/lib' /bin/sh ../libtool --mode=compile i686-pld-linux-gcc -c -o ZCmpUID.lo -O2 -fwrapv -pipe -Wformat -Werror=format-security -gdwarf-4 -fno-debug-types-section -fvar-tracking-assignments -g2 -Wp,-D_FORTIFY_SOURCE=2 -fstack-protector-strong --param=ssp-buffer-size=4 -Werror=trampolines -fomit-frame-pointer -march=i686 -fasynchronous-unwind-tables -mtune=pentium4 -gdwarf-4 -fno-debug-types-section -fvar-tracking-assignments -g2 -O -DSYSCONFDIR=\"/etc\" -I../h -I../h ZCmpUID.c libtool: compile: i686-pld-linux-gcc -c -O2 -fwrapv -pipe -Wformat -Werror=format-security -gdwarf-4 -fno-debug-types-section -fvar-tracking-assignments -g2 -Wp,-D_FORTIFY_SOURCE=2 -fstack-protector-strong --param=ssp-buffer-size=4 -Werror=trampolines -fomit-frame-pointer -march=i686 -fasynchronous-unwind-tables -mtune=pentium4 -gdwarf-4 -fno-debug-types-section -fvar-tracking-assignments -g2 -O -DSYSCONFDIR=\"/etc\" -I../h -I../h ZCmpUID.c -fPIC -DPIC -o .libs/ZCmpUID.o libtool: compile: i686-pld-linux-gcc -c -O2 -fwrapv -pipe -Wformat -Werror=format-security -gdwarf-4 -fno-debug-types-section -fvar-tracking-assignments -g2 -Wp,-D_FORTIFY_SOURCE=2 -fstack-protector-strong --param=ssp-buffer-size=4 -Werror=trampolines -fomit-frame-pointer -march=i686 -fasynchronous-unwind-tables -mtune=pentium4 -gdwarf-4 -fno-debug-types-section -fvar-tracking-assignments -g2 -O -DSYSCONFDIR=\"/etc\" -I../h -I../h ZCmpUID.c -o ZCmpUID.o >/dev/null 2>&1 make[2]: Leaving directory '/tmp/B.o_glf5h0/BUILD/zephyr-3.1.2/lib' make[2]: Entering directory '/tmp/B.o_glf5h0/BUILD/zephyr-3.1.2/lib' /bin/sh ../libtool --mode=compile i686-pld-linux-gcc -c -o ZClosePort.lo -O2 -fwrapv -pipe -Wformat -Werror=format-security -gdwarf-4 -fno-debug-types-section -fvar-tracking-assignments -g2 -Wp,-D_FORTIFY_SOURCE=2 -fstack-protector-strong --param=ssp-buffer-size=4 -Werror=trampolines -fomit-frame-pointer -march=i686 -fasynchronous-unwind-tables -mtune=pentium4 -gdwarf-4 -fno-debug-types-section -fvar-tracking-assignments -g2 -O -DSYSCONFDIR=\"/etc\" -I../h -I../h ZClosePort.c libtool: compile: i686-pld-linux-gcc -c -O2 -fwrapv -pipe -Wformat -Werror=format-security -gdwarf-4 -fno-debug-types-section -fvar-tracking-assignments -g2 -Wp,-D_FORTIFY_SOURCE=2 -fstack-protector-strong --param=ssp-buffer-size=4 -Werror=trampolines -fomit-frame-pointer -march=i686 -fasynchronous-unwind-tables -mtune=pentium4 -gdwarf-4 -fno-debug-types-section -fvar-tracking-assignments -g2 -O -DSYSCONFDIR=\"/etc\" -I../h -I../h ZClosePort.c -fPIC -DPIC -o .libs/ZClosePort.o libtool: compile: i686-pld-linux-gcc -c -O2 -fwrapv -pipe -Wformat -Werror=format-security -gdwarf-4 -fno-debug-types-section -fvar-tracking-assignments -g2 -Wp,-D_FORTIFY_SOURCE=2 -fstack-protector-strong --param=ssp-buffer-size=4 -Werror=trampolines -fomit-frame-pointer -march=i686 -fasynchronous-unwind-tables -mtune=pentium4 -gdwarf-4 -fno-debug-types-section -fvar-tracking-assignments -g2 -O -DSYSCONFDIR=\"/etc\" -I../h -I../h ZClosePort.c -o ZClosePort.o >/dev/null 2>&1 make[2]: Leaving directory '/tmp/B.o_glf5h0/BUILD/zephyr-3.1.2/lib' make[2]: Entering directory '/tmp/B.o_glf5h0/BUILD/zephyr-3.1.2/lib' /bin/sh ../libtool --mode=compile i686-pld-linux-gcc -c -o ZCkIfNot.lo -O2 -fwrapv -pipe -Wformat -Werror=format-security -gdwarf-4 -fno-debug-types-section -fvar-tracking-assignments -g2 -Wp,-D_FORTIFY_SOURCE=2 -fstack-protector-strong --param=ssp-buffer-size=4 -Werror=trampolines -fomit-frame-pointer -march=i686 -fasynchronous-unwind-tables -mtune=pentium4 -gdwarf-4 -fno-debug-types-section -fvar-tracking-assignments -g2 -O -DSYSCONFDIR=\"/etc\" -I../h -I../h ZCkIfNot.c libtool: compile: i686-pld-linux-gcc -c -O2 -fwrapv -pipe -Wformat -Werror=format-security -gdwarf-4 -fno-debug-types-section -fvar-tracking-assignments -g2 -Wp,-D_FORTIFY_SOURCE=2 -fstack-protector-strong --param=ssp-buffer-size=4 -Werror=trampolines -fomit-frame-pointer -march=i686 -fasynchronous-unwind-tables -mtune=pentium4 -gdwarf-4 -fno-debug-types-section -fvar-tracking-assignments -g2 -O -DSYSCONFDIR=\"/etc\" -I../h -I../h ZCkIfNot.c -fPIC -DPIC -o .libs/ZCkIfNot.o libtool: compile: i686-pld-linux-gcc -c -O2 -fwrapv -pipe -Wformat -Werror=format-security -gdwarf-4 -fno-debug-types-section -fvar-tracking-assignments -g2 -Wp,-D_FORTIFY_SOURCE=2 -fstack-protector-strong --param=ssp-buffer-size=4 -Werror=trampolines -fomit-frame-pointer -march=i686 -fasynchronous-unwind-tables -mtune=pentium4 -gdwarf-4 -fno-debug-types-section -fvar-tracking-assignments -g2 -O -DSYSCONFDIR=\"/etc\" -I../h -I../h ZCkIfNot.c -o ZCkIfNot.o >/dev/null 2>&1 make[2]: Leaving directory '/tmp/B.o_glf5h0/BUILD/zephyr-3.1.2/lib' make[2]: Entering directory '/tmp/B.o_glf5h0/BUILD/zephyr-3.1.2/lib' /bin/sh ../libtool --mode=compile i686-pld-linux-gcc -c -o ZFlsSubs.lo -O2 -fwrapv -pipe -Wformat -Werror=format-security -gdwarf-4 -fno-debug-types-section -fvar-tracking-assignments -g2 -Wp,-D_FORTIFY_SOURCE=2 -fstack-protector-strong --param=ssp-buffer-size=4 -Werror=trampolines -fomit-frame-pointer -march=i686 -fasynchronous-unwind-tables -mtune=pentium4 -gdwarf-4 -fno-debug-types-section -fvar-tracking-assignments -g2 -O -DSYSCONFDIR=\"/etc\" -I../h -I../h ZFlsSubs.c libtool: compile: i686-pld-linux-gcc -c -O2 -fwrapv -pipe -Wformat -Werror=format-security -gdwarf-4 -fno-debug-types-section -fvar-tracking-assignments -g2 -Wp,-D_FORTIFY_SOURCE=2 -fstack-protector-strong --param=ssp-buffer-size=4 -Werror=trampolines -fomit-frame-pointer -march=i686 -fasynchronous-unwind-tables -mtune=pentium4 -gdwarf-4 -fno-debug-types-section -fvar-tracking-assignments -g2 -O -DSYSCONFDIR=\"/etc\" -I../h -I../h ZFlsSubs.c -fPIC -DPIC -o .libs/ZFlsSubs.o libtool: compile: i686-pld-linux-gcc -c -O2 -fwrapv -pipe -Wformat -Werror=format-security -gdwarf-4 -fno-debug-types-section -fvar-tracking-assignments -g2 -Wp,-D_FORTIFY_SOURCE=2 -fstack-protector-strong --param=ssp-buffer-size=4 -Werror=trampolines -fomit-frame-pointer -march=i686 -fasynchronous-unwind-tables -mtune=pentium4 -gdwarf-4 -fno-debug-types-section -fvar-tracking-assignments -g2 -O -DSYSCONFDIR=\"/etc\" -I../h -I../h ZFlsSubs.c -o ZFlsSubs.o >/dev/null 2>&1 make[2]: Leaving directory '/tmp/B.o_glf5h0/BUILD/zephyr-3.1.2/lib' make[2]: Entering directory '/tmp/B.o_glf5h0/BUILD/zephyr-3.1.2/lib' /bin/sh ../libtool --mode=compile i686-pld-linux-gcc -c -o ZFlsLocs.lo -O2 -fwrapv -pipe -Wformat -Werror=format-security -gdwarf-4 -fno-debug-types-section -fvar-tracking-assignments -g2 -Wp,-D_FORTIFY_SOURCE=2 -fstack-protector-strong --param=ssp-buffer-size=4 -Werror=trampolines -fomit-frame-pointer -march=i686 -fasynchronous-unwind-tables -mtune=pentium4 -gdwarf-4 -fno-debug-types-section -fvar-tracking-assignments -g2 -O -DSYSCONFDIR=\"/etc\" -I../h -I../h ZFlsLocs.c libtool: compile: i686-pld-linux-gcc -c -O2 -fwrapv -pipe -Wformat -Werror=format-security -gdwarf-4 -fno-debug-types-section -fvar-tracking-assignments -g2 -Wp,-D_FORTIFY_SOURCE=2 -fstack-protector-strong --param=ssp-buffer-size=4 -Werror=trampolines -fomit-frame-pointer -march=i686 -fasynchronous-unwind-tables -mtune=pentium4 -gdwarf-4 -fno-debug-types-section -fvar-tracking-assignments -g2 -O -DSYSCONFDIR=\"/etc\" -I../h -I../h ZFlsLocs.c -fPIC -DPIC -o .libs/ZFlsLocs.o libtool: compile: i686-pld-linux-gcc -c -O2 -fwrapv -pipe -Wformat -Werror=format-security -gdwarf-4 -fno-debug-types-section -fvar-tracking-assignments -g2 -Wp,-D_FORTIFY_SOURCE=2 -fstack-protector-strong --param=ssp-buffer-size=4 -Werror=trampolines -fomit-frame-pointer -march=i686 -fasynchronous-unwind-tables -mtune=pentium4 -gdwarf-4 -fno-debug-types-section -fvar-tracking-assignments -g2 -O -DSYSCONFDIR=\"/etc\" -I../h -I../h ZFlsLocs.c -o ZFlsLocs.o >/dev/null 2>&1 make[2]: Leaving directory '/tmp/B.o_glf5h0/BUILD/zephyr-3.1.2/lib' make[2]: Entering directory '/tmp/B.o_glf5h0/BUILD/zephyr-3.1.2/lib' /bin/sh ../libtool --mode=compile i686-pld-linux-gcc -c -o ZAsyncLocate.lo -O2 -fwrapv -pipe -Wformat -Werror=format-security -gdwarf-4 -fno-debug-types-section -fvar-tracking-assignments -g2 -Wp,-D_FORTIFY_SOURCE=2 -fstack-protector-strong --param=ssp-buffer-size=4 -Werror=trampolines -fomit-frame-pointer -march=i686 -fasynchronous-unwind-tables -mtune=pentium4 -gdwarf-4 -fno-debug-types-section -fvar-tracking-assignments -g2 -O -DSYSCONFDIR=\"/etc\" -I../h -I../h ZAsyncLocate.c libtool: compile: i686-pld-linux-gcc -c -O2 -fwrapv -pipe -Wformat -Werror=format-security -gdwarf-4 -fno-debug-types-section -fvar-tracking-assignments -g2 -Wp,-D_FORTIFY_SOURCE=2 -fstack-protector-strong --param=ssp-buffer-size=4 -Werror=trampolines -fomit-frame-pointer -march=i686 -fasynchronous-unwind-tables -mtune=pentium4 -gdwarf-4 -fno-debug-types-section -fvar-tracking-assignments -g2 -O -DSYSCONFDIR=\"/etc\" -I../h -I../h ZAsyncLocate.c -fPIC -DPIC -o .libs/ZAsyncLocate.o libtool: compile: i686-pld-linux-gcc -c -O2 -fwrapv -pipe -Wformat -Werror=format-security -gdwarf-4 -fno-debug-types-section -fvar-tracking-assignments -g2 -Wp,-D_FORTIFY_SOURCE=2 -fstack-protector-strong --param=ssp-buffer-size=4 -Werror=trampolines -fomit-frame-pointer -march=i686 -fasynchronous-unwind-tables -mtune=pentium4 -gdwarf-4 -fno-debug-types-section -fvar-tracking-assignments -g2 -O -DSYSCONFDIR=\"/etc\" -I../h -I../h ZAsyncLocate.c -o ZAsyncLocate.o >/dev/null 2>&1 make[2]: Leaving directory '/tmp/B.o_glf5h0/BUILD/zephyr-3.1.2/lib' make[2]: Entering directory '/tmp/B.o_glf5h0/BUILD/zephyr-3.1.2/lib' /bin/sh ../libtool --mode=compile i686-pld-linux-gcc -c -o ZFmtAuth.lo -O2 -fwrapv -pipe -Wformat -Werror=format-security -gdwarf-4 -fno-debug-types-section -fvar-tracking-assignments -g2 -Wp,-D_FORTIFY_SOURCE=2 -fstack-protector-strong --param=ssp-buffer-size=4 -Werror=trampolines -fomit-frame-pointer -march=i686 -fasynchronous-unwind-tables -mtune=pentium4 -gdwarf-4 -fno-debug-types-section -fvar-tracking-assignments -g2 -O -DSYSCONFDIR=\"/etc\" -I../h -I../h ZFmtAuth.c libtool: compile: i686-pld-linux-gcc -c -O2 -fwrapv -pipe -Wformat -Werror=format-security -gdwarf-4 -fno-debug-types-section -fvar-tracking-assignments -g2 -Wp,-D_FORTIFY_SOURCE=2 -fstack-protector-strong --param=ssp-buffer-size=4 -Werror=trampolines -fomit-frame-pointer -march=i686 -fasynchronous-unwind-tables -mtune=pentium4 -gdwarf-4 -fno-debug-types-section -fvar-tracking-assignments -g2 -O -DSYSCONFDIR=\"/etc\" -I../h -I../h ZFmtAuth.c -fPIC -DPIC -o .libs/ZFmtAuth.o libtool: compile: i686-pld-linux-gcc -c -O2 -fwrapv -pipe -Wformat -Werror=format-security -gdwarf-4 -fno-debug-types-section -fvar-tracking-assignments -g2 -Wp,-D_FORTIFY_SOURCE=2 -fstack-protector-strong --param=ssp-buffer-size=4 -Werror=trampolines -fomit-frame-pointer -march=i686 -fasynchronous-unwind-tables -mtune=pentium4 -gdwarf-4 -fno-debug-types-section -fvar-tracking-assignments -g2 -O -DSYSCONFDIR=\"/etc\" -I../h -I../h ZFmtAuth.c -o ZFmtAuth.o >/dev/null 2>&1 make[2]: Leaving directory '/tmp/B.o_glf5h0/BUILD/zephyr-3.1.2/lib' make[2]: Entering directory '/tmp/B.o_glf5h0/BUILD/zephyr-3.1.2/lib' /bin/sh ../libtool --mode=compile i686-pld-linux-gcc -c -o ZFmtRaw.lo -O2 -fwrapv -pipe -Wformat -Werror=format-security -gdwarf-4 -fno-debug-types-section -fvar-tracking-assignments -g2 -Wp,-D_FORTIFY_SOURCE=2 -fstack-protector-strong --param=ssp-buffer-size=4 -Werror=trampolines -fomit-frame-pointer -march=i686 -fasynchronous-unwind-tables -mtune=pentium4 -gdwarf-4 -fno-debug-types-section -fvar-tracking-assignments -g2 -O -DSYSCONFDIR=\"/etc\" -I../h -I../h ZFmtRaw.c libtool: compile: i686-pld-linux-gcc -c -O2 -fwrapv -pipe -Wformat -Werror=format-security -gdwarf-4 -fno-debug-types-section -fvar-tracking-assignments -g2 -Wp,-D_FORTIFY_SOURCE=2 -fstack-protector-strong --param=ssp-buffer-size=4 -Werror=trampolines -fomit-frame-pointer -march=i686 -fasynchronous-unwind-tables -mtune=pentium4 -gdwarf-4 -fno-debug-types-section -fvar-tracking-assignments -g2 -O -DSYSCONFDIR=\"/etc\" -I../h -I../h ZFmtRaw.c -fPIC -DPIC -o .libs/ZFmtRaw.o libtool: compile: i686-pld-linux-gcc -c -O2 -fwrapv -pipe -Wformat -Werror=format-security -gdwarf-4 -fno-debug-types-section -fvar-tracking-assignments -g2 -Wp,-D_FORTIFY_SOURCE=2 -fstack-protector-strong --param=ssp-buffer-size=4 -Werror=trampolines -fomit-frame-pointer -march=i686 -fasynchronous-unwind-tables -mtune=pentium4 -gdwarf-4 -fno-debug-types-section -fvar-tracking-assignments -g2 -O -DSYSCONFDIR=\"/etc\" -I../h -I../h ZFmtRaw.c -o ZFmtRaw.o >/dev/null 2>&1 make[2]: Leaving directory '/tmp/B.o_glf5h0/BUILD/zephyr-3.1.2/lib' make[2]: Entering directory '/tmp/B.o_glf5h0/BUILD/zephyr-3.1.2/lib' /bin/sh ../libtool --mode=compile i686-pld-linux-gcc -c -o ZFmtList.lo -O2 -fwrapv -pipe -Wformat -Werror=format-security -gdwarf-4 -fno-debug-types-section -fvar-tracking-assignments -g2 -Wp,-D_FORTIFY_SOURCE=2 -fstack-protector-strong --param=ssp-buffer-size=4 -Werror=trampolines -fomit-frame-pointer -march=i686 -fasynchronous-unwind-tables -mtune=pentium4 -gdwarf-4 -fno-debug-types-section -fvar-tracking-assignments -g2 -O -DSYSCONFDIR=\"/etc\" -I../h -I../h ZFmtList.c libtool: compile: i686-pld-linux-gcc -c -O2 -fwrapv -pipe -Wformat -Werror=format-security -gdwarf-4 -fno-debug-types-section -fvar-tracking-assignments -g2 -Wp,-D_FORTIFY_SOURCE=2 -fstack-protector-strong --param=ssp-buffer-size=4 -Werror=trampolines -fomit-frame-pointer -march=i686 -fasynchronous-unwind-tables -mtune=pentium4 -gdwarf-4 -fno-debug-types-section -fvar-tracking-assignments -g2 -O -DSYSCONFDIR=\"/etc\" -I../h -I../h ZFmtList.c -fPIC -DPIC -o .libs/ZFmtList.o libtool: compile: i686-pld-linux-gcc -c -O2 -fwrapv -pipe -Wformat -Werror=format-security -gdwarf-4 -fno-debug-types-section -fvar-tracking-assignments -g2 -Wp,-D_FORTIFY_SOURCE=2 -fstack-protector-strong --param=ssp-buffer-size=4 -Werror=trampolines -fomit-frame-pointer -march=i686 -fasynchronous-unwind-tables -mtune=pentium4 -gdwarf-4 -fno-debug-types-section -fvar-tracking-assignments -g2 -O -DSYSCONFDIR=\"/etc\" -I../h -I../h ZFmtList.c -o ZFmtList.o >/dev/null 2>&1 make[2]: Leaving directory '/tmp/B.o_glf5h0/BUILD/zephyr-3.1.2/lib' make[2]: Entering directory '/tmp/B.o_glf5h0/BUILD/zephyr-3.1.2/lib' /bin/sh ../libtool --mode=compile i686-pld-linux-gcc -c -o ZFmtRawLst.lo -O2 -fwrapv -pipe -Wformat -Werror=format-security -gdwarf-4 -fno-debug-types-section -fvar-tracking-assignments -g2 -Wp,-D_FORTIFY_SOURCE=2 -fstack-protector-strong --param=ssp-buffer-size=4 -Werror=trampolines -fomit-frame-pointer -march=i686 -fasynchronous-unwind-tables -mtune=pentium4 -gdwarf-4 -fno-debug-types-section -fvar-tracking-assignments -g2 -O -DSYSCONFDIR=\"/etc\" -I../h -I../h ZFmtRawLst.c libtool: compile: i686-pld-linux-gcc -c -O2 -fwrapv -pipe -Wformat -Werror=format-security -gdwarf-4 -fno-debug-types-section -fvar-tracking-assignments -g2 -Wp,-D_FORTIFY_SOURCE=2 -fstack-protector-strong --param=ssp-buffer-size=4 -Werror=trampolines -fomit-frame-pointer -march=i686 -fasynchronous-unwind-tables -mtune=pentium4 -gdwarf-4 -fno-debug-types-section -fvar-tracking-assignments -g2 -O -DSYSCONFDIR=\"/etc\" -I../h -I../h ZFmtRawLst.c -fPIC -DPIC -o .libs/ZFmtRawLst.o libtool: compile: i686-pld-linux-gcc -c -O2 -fwrapv -pipe -Wformat -Werror=format-security -gdwarf-4 -fno-debug-types-section -fvar-tracking-assignments -g2 -Wp,-D_FORTIFY_SOURCE=2 -fstack-protector-strong --param=ssp-buffer-size=4 -Werror=trampolines -fomit-frame-pointer -march=i686 -fasynchronous-unwind-tables -mtune=pentium4 -gdwarf-4 -fno-debug-types-section -fvar-tracking-assignments -g2 -O -DSYSCONFDIR=\"/etc\" -I../h -I../h ZFmtRawLst.c -o ZFmtRawLst.o >/dev/null 2>&1 make[2]: Leaving directory '/tmp/B.o_glf5h0/BUILD/zephyr-3.1.2/lib' make[2]: Entering directory '/tmp/B.o_glf5h0/BUILD/zephyr-3.1.2/lib' /bin/sh ../libtool --mode=compile i686-pld-linux-gcc -c -o ZFmtNotice.lo -O2 -fwrapv -pipe -Wformat -Werror=format-security -gdwarf-4 -fno-debug-types-section -fvar-tracking-assignments -g2 -Wp,-D_FORTIFY_SOURCE=2 -fstack-protector-strong --param=ssp-buffer-size=4 -Werror=trampolines -fomit-frame-pointer -march=i686 -fasynchronous-unwind-tables -mtune=pentium4 -gdwarf-4 -fno-debug-types-section -fvar-tracking-assignments -g2 -O -DSYSCONFDIR=\"/etc\" -I../h -I../h ZFmtNotice.c libtool: compile: i686-pld-linux-gcc -c -O2 -fwrapv -pipe -Wformat -Werror=format-security -gdwarf-4 -fno-debug-types-section -fvar-tracking-assignments -g2 -Wp,-D_FORTIFY_SOURCE=2 -fstack-protector-strong --param=ssp-buffer-size=4 -Werror=trampolines -fomit-frame-pointer -march=i686 -fasynchronous-unwind-tables -mtune=pentium4 -gdwarf-4 -fno-debug-types-section -fvar-tracking-assignments -g2 -O -DSYSCONFDIR=\"/etc\" -I../h -I../h ZFmtNotice.c -fPIC -DPIC -o .libs/ZFmtNotice.o libtool: compile: i686-pld-linux-gcc -c -O2 -fwrapv -pipe -Wformat -Werror=format-security -gdwarf-4 -fno-debug-types-section -fvar-tracking-assignments -g2 -Wp,-D_FORTIFY_SOURCE=2 -fstack-protector-strong --param=ssp-buffer-size=4 -Werror=trampolines -fomit-frame-pointer -march=i686 -fasynchronous-unwind-tables -mtune=pentium4 -gdwarf-4 -fno-debug-types-section -fvar-tracking-assignments -g2 -O -DSYSCONFDIR=\"/etc\" -I../h -I../h ZFmtNotice.c -o ZFmtNotice.o >/dev/null 2>&1 make[2]: Leaving directory '/tmp/B.o_glf5h0/BUILD/zephyr-3.1.2/lib' make[2]: Entering directory '/tmp/B.o_glf5h0/BUILD/zephyr-3.1.2/lib' /bin/sh ../libtool --mode=compile i686-pld-linux-gcc -c -o ZFmtSmRLst.lo -O2 -fwrapv -pipe -Wformat -Werror=format-security -gdwarf-4 -fno-debug-types-section -fvar-tracking-assignments -g2 -Wp,-D_FORTIFY_SOURCE=2 -fstack-protector-strong --param=ssp-buffer-size=4 -Werror=trampolines -fomit-frame-pointer -march=i686 -fasynchronous-unwind-tables -mtune=pentium4 -gdwarf-4 -fno-debug-types-section -fvar-tracking-assignments -g2 -O -DSYSCONFDIR=\"/etc\" -I../h -I../h ZFmtSmRLst.c libtool: compile: i686-pld-linux-gcc -c -O2 -fwrapv -pipe -Wformat -Werror=format-security -gdwarf-4 -fno-debug-types-section -fvar-tracking-assignments -g2 -Wp,-D_FORTIFY_SOURCE=2 -fstack-protector-strong --param=ssp-buffer-size=4 -Werror=trampolines -fomit-frame-pointer -march=i686 -fasynchronous-unwind-tables -mtune=pentium4 -gdwarf-4 -fno-debug-types-section -fvar-tracking-assignments -g2 -O -DSYSCONFDIR=\"/etc\" -I../h -I../h ZFmtSmRLst.c -fPIC -DPIC -o .libs/ZFmtSmRLst.o libtool: compile: i686-pld-linux-gcc -c -O2 -fwrapv -pipe -Wformat -Werror=format-security -gdwarf-4 -fno-debug-types-section -fvar-tracking-assignments -g2 -Wp,-D_FORTIFY_SOURCE=2 -fstack-protector-strong --param=ssp-buffer-size=4 -Werror=trampolines -fomit-frame-pointer -march=i686 -fasynchronous-unwind-tables -mtune=pentium4 -gdwarf-4 -fno-debug-types-section -fvar-tracking-assignments -g2 -O -DSYSCONFDIR=\"/etc\" -I../h -I../h ZFmtSmRLst.c -o ZFmtSmRLst.o >/dev/null 2>&1 make[2]: Leaving directory '/tmp/B.o_glf5h0/BUILD/zephyr-3.1.2/lib' make[2]: Entering directory '/tmp/B.o_glf5h0/BUILD/zephyr-3.1.2/lib' /bin/sh ../libtool --mode=compile i686-pld-linux-gcc -c -o ZFmtSmRaw.lo -O2 -fwrapv -pipe -Wformat -Werror=format-security -gdwarf-4 -fno-debug-types-section -fvar-tracking-assignments -g2 -Wp,-D_FORTIFY_SOURCE=2 -fstack-protector-strong --param=ssp-buffer-size=4 -Werror=trampolines -fomit-frame-pointer -march=i686 -fasynchronous-unwind-tables -mtune=pentium4 -gdwarf-4 -fno-debug-types-section -fvar-tracking-assignments -g2 -O -DSYSCONFDIR=\"/etc\" -I../h -I../h ZFmtSmRaw.c libtool: compile: i686-pld-linux-gcc -c -O2 -fwrapv -pipe -Wformat -Werror=format-security -gdwarf-4 -fno-debug-types-section -fvar-tracking-assignments -g2 -Wp,-D_FORTIFY_SOURCE=2 -fstack-protector-strong --param=ssp-buffer-size=4 -Werror=trampolines -fomit-frame-pointer -march=i686 -fasynchronous-unwind-tables -mtune=pentium4 -gdwarf-4 -fno-debug-types-section -fvar-tracking-assignments -g2 -O -DSYSCONFDIR=\"/etc\" -I../h -I../h ZFmtSmRaw.c -fPIC -DPIC -o .libs/ZFmtSmRaw.o libtool: compile: i686-pld-linux-gcc -c -O2 -fwrapv -pipe -Wformat -Werror=format-security -gdwarf-4 -fno-debug-types-section -fvar-tracking-assignments -g2 -Wp,-D_FORTIFY_SOURCE=2 -fstack-protector-strong --param=ssp-buffer-size=4 -Werror=trampolines -fomit-frame-pointer -march=i686 -fasynchronous-unwind-tables -mtune=pentium4 -gdwarf-4 -fno-debug-types-section -fvar-tracking-assignments -g2 -O -DSYSCONFDIR=\"/etc\" -I../h -I../h ZFmtSmRaw.c -o ZFmtSmRaw.o >/dev/null 2>&1 make[2]: Leaving directory '/tmp/B.o_glf5h0/BUILD/zephyr-3.1.2/lib' make[2]: Entering directory '/tmp/B.o_glf5h0/BUILD/zephyr-3.1.2/lib' /bin/sh ../libtool --mode=compile i686-pld-linux-gcc -c -o ZFreeNot.lo -O2 -fwrapv -pipe -Wformat -Werror=format-security -gdwarf-4 -fno-debug-types-section -fvar-tracking-assignments -g2 -Wp,-D_FORTIFY_SOURCE=2 -fstack-protector-strong --param=ssp-buffer-size=4 -Werror=trampolines -fomit-frame-pointer -march=i686 -fasynchronous-unwind-tables -mtune=pentium4 -gdwarf-4 -fno-debug-types-section -fvar-tracking-assignments -g2 -O -DSYSCONFDIR=\"/etc\" -I../h -I../h ZFreeNot.c libtool: compile: i686-pld-linux-gcc -c -O2 -fwrapv -pipe -Wformat -Werror=format-security -gdwarf-4 -fno-debug-types-section -fvar-tracking-assignments -g2 -Wp,-D_FORTIFY_SOURCE=2 -fstack-protector-strong --param=ssp-buffer-size=4 -Werror=trampolines -fomit-frame-pointer -march=i686 -fasynchronous-unwind-tables -mtune=pentium4 -gdwarf-4 -fno-debug-types-section -fvar-tracking-assignments -g2 -O -DSYSCONFDIR=\"/etc\" -I../h -I../h ZFreeNot.c -fPIC -DPIC -o .libs/ZFreeNot.o libtool: compile: i686-pld-linux-gcc -c -O2 -fwrapv -pipe -Wformat -Werror=format-security -gdwarf-4 -fno-debug-types-section -fvar-tracking-assignments -g2 -Wp,-D_FORTIFY_SOURCE=2 -fstack-protector-strong --param=ssp-buffer-size=4 -Werror=trampolines -fomit-frame-pointer -march=i686 -fasynchronous-unwind-tables -mtune=pentium4 -gdwarf-4 -fno-debug-types-section -fvar-tracking-assignments -g2 -O -DSYSCONFDIR=\"/etc\" -I../h -I../h ZFreeNot.c -o ZFreeNot.o >/dev/null 2>&1 make[2]: Leaving directory '/tmp/B.o_glf5h0/BUILD/zephyr-3.1.2/lib' make[2]: Entering directory '/tmp/B.o_glf5h0/BUILD/zephyr-3.1.2/lib' /bin/sh ../libtool --mode=compile i686-pld-linux-gcc -c -o ZGetLocs.lo -O2 -fwrapv -pipe -Wformat -Werror=format-security -gdwarf-4 -fno-debug-types-section -fvar-tracking-assignments -g2 -Wp,-D_FORTIFY_SOURCE=2 -fstack-protector-strong --param=ssp-buffer-size=4 -Werror=trampolines -fomit-frame-pointer -march=i686 -fasynchronous-unwind-tables -mtune=pentium4 -gdwarf-4 -fno-debug-types-section -fvar-tracking-assignments -g2 -O -DSYSCONFDIR=\"/etc\" -I../h -I../h ZGetLocs.c libtool: compile: i686-pld-linux-gcc -c -O2 -fwrapv -pipe -Wformat -Werror=format-security -gdwarf-4 -fno-debug-types-section -fvar-tracking-assignments -g2 -Wp,-D_FORTIFY_SOURCE=2 -fstack-protector-strong --param=ssp-buffer-size=4 -Werror=trampolines -fomit-frame-pointer -march=i686 -fasynchronous-unwind-tables -mtune=pentium4 -gdwarf-4 -fno-debug-types-section -fvar-tracking-assignments -g2 -O -DSYSCONFDIR=\"/etc\" -I../h -I../h ZGetLocs.c -fPIC -DPIC -o .libs/ZGetLocs.o libtool: compile: i686-pld-linux-gcc -c -O2 -fwrapv -pipe -Wformat -Werror=format-security -gdwarf-4 -fno-debug-types-section -fvar-tracking-assignments -g2 -Wp,-D_FORTIFY_SOURCE=2 -fstack-protector-strong --param=ssp-buffer-size=4 -Werror=trampolines -fomit-frame-pointer -march=i686 -fasynchronous-unwind-tables -mtune=pentium4 -gdwarf-4 -fno-debug-types-section -fvar-tracking-assignments -g2 -O -DSYSCONFDIR=\"/etc\" -I../h -I../h ZGetLocs.c -o ZGetLocs.o >/dev/null 2>&1 make[2]: Leaving directory '/tmp/B.o_glf5h0/BUILD/zephyr-3.1.2/lib' make[2]: Entering directory '/tmp/B.o_glf5h0/BUILD/zephyr-3.1.2/lib' /bin/sh ../libtool --mode=compile i686-pld-linux-gcc -c -o ZGetWGPort.lo -O2 -fwrapv -pipe -Wformat -Werror=format-security -gdwarf-4 -fno-debug-types-section -fvar-tracking-assignments -g2 -Wp,-D_FORTIFY_SOURCE=2 -fstack-protector-strong --param=ssp-buffer-size=4 -Werror=trampolines -fomit-frame-pointer -march=i686 -fasynchronous-unwind-tables -mtune=pentium4 -gdwarf-4 -fno-debug-types-section -fvar-tracking-assignments -g2 -O -DSYSCONFDIR=\"/etc\" -I../h -I../h ZGetWGPort.c libtool: compile: i686-pld-linux-gcc -c -O2 -fwrapv -pipe -Wformat -Werror=format-security -gdwarf-4 -fno-debug-types-section -fvar-tracking-assignments -g2 -Wp,-D_FORTIFY_SOURCE=2 -fstack-protector-strong --param=ssp-buffer-size=4 -Werror=trampolines -fomit-frame-pointer -march=i686 -fasynchronous-unwind-tables -mtune=pentium4 -gdwarf-4 -fno-debug-types-section -fvar-tracking-assignments -g2 -O -DSYSCONFDIR=\"/etc\" -I../h -I../h ZGetWGPort.c -fPIC -DPIC -o .libs/ZGetWGPort.o libtool: compile: i686-pld-linux-gcc -c -O2 -fwrapv -pipe -Wformat -Werror=format-security -gdwarf-4 -fno-debug-types-section -fvar-tracking-assignments -g2 -Wp,-D_FORTIFY_SOURCE=2 -fstack-protector-strong --param=ssp-buffer-size=4 -Werror=trampolines -fomit-frame-pointer -march=i686 -fasynchronous-unwind-tables -mtune=pentium4 -gdwarf-4 -fno-debug-types-section -fvar-tracking-assignments -g2 -O -DSYSCONFDIR=\"/etc\" -I../h -I../h ZGetWGPort.c -o ZGetWGPort.o >/dev/null 2>&1 make[2]: Leaving directory '/tmp/B.o_glf5h0/BUILD/zephyr-3.1.2/lib' make[2]: Entering directory '/tmp/B.o_glf5h0/BUILD/zephyr-3.1.2/lib' /bin/sh ../libtool --mode=compile i686-pld-linux-gcc -c -o ZGetSender.lo -O2 -fwrapv -pipe -Wformat -Werror=format-security -gdwarf-4 -fno-debug-types-section -fvar-tracking-assignments -g2 -Wp,-D_FORTIFY_SOURCE=2 -fstack-protector-strong --param=ssp-buffer-size=4 -Werror=trampolines -fomit-frame-pointer -march=i686 -fasynchronous-unwind-tables -mtune=pentium4 -gdwarf-4 -fno-debug-types-section -fvar-tracking-assignments -g2 -O -DSYSCONFDIR=\"/etc\" -I../h -I../h ZGetSender.c libtool: compile: i686-pld-linux-gcc -c -O2 -fwrapv -pipe -Wformat -Werror=format-security -gdwarf-4 -fno-debug-types-section -fvar-tracking-assignments -g2 -Wp,-D_FORTIFY_SOURCE=2 -fstack-protector-strong --param=ssp-buffer-size=4 -Werror=trampolines -fomit-frame-pointer -march=i686 -fasynchronous-unwind-tables -mtune=pentium4 -gdwarf-4 -fno-debug-types-section -fvar-tracking-assignments -g2 -O -DSYSCONFDIR=\"/etc\" -I../h -I../h ZGetSender.c -fPIC -DPIC -o .libs/ZGetSender.o ZGetSender.c: In function 'ZGetSender': ZGetSender.c:49:9: warning: 'krb5_free_unparsed_name' is deprecated [-Wdeprecated-declarations] 49 | krb5_free_unparsed_name(Z_krb5_ctx, prname); | ^~~~~~~~~~~~~~~~~~~~~~~ In file included from /usr/include/krb5.h:967, from ../h/internal.h:15, from ZGetSender.c:13: /usr/include/krb5-protos.h:3843:1: note: declared here 3843 | krb5_free_unparsed_name ( | ^~~~~~~~~~~~~~~~~~~~~~~ libtool: compile: i686-pld-linux-gcc -c -O2 -fwrapv -pipe -Wformat -Werror=format-security -gdwarf-4 -fno-debug-types-section -fvar-tracking-assignments -g2 -Wp,-D_FORTIFY_SOURCE=2 -fstack-protector-strong --param=ssp-buffer-size=4 -Werror=trampolines -fomit-frame-pointer -march=i686 -fasynchronous-unwind-tables -mtune=pentium4 -gdwarf-4 -fno-debug-types-section -fvar-tracking-assignments -g2 -O -DSYSCONFDIR=\"/etc\" -I../h -I../h ZGetSender.c -o ZGetSender.o >/dev/null 2>&1 make[2]: Leaving directory '/tmp/B.o_glf5h0/BUILD/zephyr-3.1.2/lib' make[2]: Entering directory '/tmp/B.o_glf5h0/BUILD/zephyr-3.1.2/lib' /bin/sh ../libtool --mode=compile i686-pld-linux-gcc -c -o ZGetSubs.lo -O2 -fwrapv -pipe -Wformat -Werror=format-security -gdwarf-4 -fno-debug-types-section -fvar-tracking-assignments -g2 -Wp,-D_FORTIFY_SOURCE=2 -fstack-protector-strong --param=ssp-buffer-size=4 -Werror=trampolines -fomit-frame-pointer -march=i686 -fasynchronous-unwind-tables -mtune=pentium4 -gdwarf-4 -fno-debug-types-section -fvar-tracking-assignments -g2 -O -DSYSCONFDIR=\"/etc\" -I../h -I../h ZGetSubs.c libtool: compile: i686-pld-linux-gcc -c -O2 -fwrapv -pipe -Wformat -Werror=format-security -gdwarf-4 -fno-debug-types-section -fvar-tracking-assignments -g2 -Wp,-D_FORTIFY_SOURCE=2 -fstack-protector-strong --param=ssp-buffer-size=4 -Werror=trampolines -fomit-frame-pointer -march=i686 -fasynchronous-unwind-tables -mtune=pentium4 -gdwarf-4 -fno-debug-types-section -fvar-tracking-assignments -g2 -O -DSYSCONFDIR=\"/etc\" -I../h -I../h ZGetSubs.c -fPIC -DPIC -o .libs/ZGetSubs.o libtool: compile: i686-pld-linux-gcc -c -O2 -fwrapv -pipe -Wformat -Werror=format-security -gdwarf-4 -fno-debug-types-section -fvar-tracking-assignments -g2 -Wp,-D_FORTIFY_SOURCE=2 -fstack-protector-strong --param=ssp-buffer-size=4 -Werror=trampolines -fomit-frame-pointer -march=i686 -fasynchronous-unwind-tables -mtune=pentium4 -gdwarf-4 -fno-debug-types-section -fvar-tracking-assignments -g2 -O -DSYSCONFDIR=\"/etc\" -I../h -I../h ZGetSubs.c -o ZGetSubs.o >/dev/null 2>&1 make[2]: Leaving directory '/tmp/B.o_glf5h0/BUILD/zephyr-3.1.2/lib' make[2]: Entering directory '/tmp/B.o_glf5h0/BUILD/zephyr-3.1.2/lib' /bin/sh ../libtool --mode=compile i686-pld-linux-gcc -c -o ZInit.lo -O2 -fwrapv -pipe -Wformat -Werror=format-security -gdwarf-4 -fno-debug-types-section -fvar-tracking-assignments -g2 -Wp,-D_FORTIFY_SOURCE=2 -fstack-protector-strong --param=ssp-buffer-size=4 -Werror=trampolines -fomit-frame-pointer -march=i686 -fasynchronous-unwind-tables -mtune=pentium4 -gdwarf-4 -fno-debug-types-section -fvar-tracking-assignments -g2 -O -DSYSCONFDIR=\"/etc\" -I../h -I../h ZInit.c libtool: compile: i686-pld-linux-gcc -c -O2 -fwrapv -pipe -Wformat -Werror=format-security -gdwarf-4 -fno-debug-types-section -fvar-tracking-assignments -g2 -Wp,-D_FORTIFY_SOURCE=2 -fstack-protector-strong --param=ssp-buffer-size=4 -Werror=trampolines -fomit-frame-pointer -march=i686 -fasynchronous-unwind-tables -mtune=pentium4 -gdwarf-4 -fno-debug-types-section -fvar-tracking-assignments -g2 -O -DSYSCONFDIR=\"/etc\" -I../h -I../h ZInit.c -fPIC -DPIC -o .libs/ZInit.o libtool: compile: i686-pld-linux-gcc -c -O2 -fwrapv -pipe -Wformat -Werror=format-security -gdwarf-4 -fno-debug-types-section -fvar-tracking-assignments -g2 -Wp,-D_FORTIFY_SOURCE=2 -fstack-protector-strong --param=ssp-buffer-size=4 -Werror=trampolines -fomit-frame-pointer -march=i686 -fasynchronous-unwind-tables -mtune=pentium4 -gdwarf-4 -fno-debug-types-section -fvar-tracking-assignments -g2 -O -DSYSCONFDIR=\"/etc\" -I../h -I../h ZInit.c -o ZInit.o >/dev/null 2>&1 make[2]: Leaving directory '/tmp/B.o_glf5h0/BUILD/zephyr-3.1.2/lib' make[2]: Entering directory '/tmp/B.o_glf5h0/BUILD/zephyr-3.1.2/lib' /bin/sh ../libtool --mode=compile i686-pld-linux-gcc -c -o ZIfNotice.lo -O2 -fwrapv -pipe -Wformat -Werror=format-security -gdwarf-4 -fno-debug-types-section -fvar-tracking-assignments -g2 -Wp,-D_FORTIFY_SOURCE=2 -fstack-protector-strong --param=ssp-buffer-size=4 -Werror=trampolines -fomit-frame-pointer -march=i686 -fasynchronous-unwind-tables -mtune=pentium4 -gdwarf-4 -fno-debug-types-section -fvar-tracking-assignments -g2 -O -DSYSCONFDIR=\"/etc\" -I../h -I../h ZIfNotice.c libtool: compile: i686-pld-linux-gcc -c -O2 -fwrapv -pipe -Wformat -Werror=format-security -gdwarf-4 -fno-debug-types-section -fvar-tracking-assignments -g2 -Wp,-D_FORTIFY_SOURCE=2 -fstack-protector-strong --param=ssp-buffer-size=4 -Werror=trampolines -fomit-frame-pointer -march=i686 -fasynchronous-unwind-tables -mtune=pentium4 -gdwarf-4 -fno-debug-types-section -fvar-tracking-assignments -g2 -O -DSYSCONFDIR=\"/etc\" -I../h -I../h ZIfNotice.c -fPIC -DPIC -o .libs/ZIfNotice.o libtool: compile: i686-pld-linux-gcc -c -O2 -fwrapv -pipe -Wformat -Werror=format-security -gdwarf-4 -fno-debug-types-section -fvar-tracking-assignments -g2 -Wp,-D_FORTIFY_SOURCE=2 -fstack-protector-strong --param=ssp-buffer-size=4 -Werror=trampolines -fomit-frame-pointer -march=i686 -fasynchronous-unwind-tables -mtune=pentium4 -gdwarf-4 -fno-debug-types-section -fvar-tracking-assignments -g2 -O -DSYSCONFDIR=\"/etc\" -I../h -I../h ZIfNotice.c -o ZIfNotice.o >/dev/null 2>&1 make[2]: Leaving directory '/tmp/B.o_glf5h0/BUILD/zephyr-3.1.2/lib' make[2]: Entering directory '/tmp/B.o_glf5h0/BUILD/zephyr-3.1.2/lib' /bin/sh ../libtool --mode=compile i686-pld-linux-gcc -c -o ZMakeAscii.lo -O2 -fwrapv -pipe -Wformat -Werror=format-security -gdwarf-4 -fno-debug-types-section -fvar-tracking-assignments -g2 -Wp,-D_FORTIFY_SOURCE=2 -fstack-protector-strong --param=ssp-buffer-size=4 -Werror=trampolines -fomit-frame-pointer -march=i686 -fasynchronous-unwind-tables -mtune=pentium4 -gdwarf-4 -fno-debug-types-section -fvar-tracking-assignments -g2 -O -DSYSCONFDIR=\"/etc\" -I../h -I../h ZMakeAscii.c libtool: compile: i686-pld-linux-gcc -c -O2 -fwrapv -pipe -Wformat -Werror=format-security -gdwarf-4 -fno-debug-types-section -fvar-tracking-assignments -g2 -Wp,-D_FORTIFY_SOURCE=2 -fstack-protector-strong --param=ssp-buffer-size=4 -Werror=trampolines -fomit-frame-pointer -march=i686 -fasynchronous-unwind-tables -mtune=pentium4 -gdwarf-4 -fno-debug-types-section -fvar-tracking-assignments -g2 -O -DSYSCONFDIR=\"/etc\" -I../h -I../h ZMakeAscii.c -fPIC -DPIC -o .libs/ZMakeAscii.o libtool: compile: i686-pld-linux-gcc -c -O2 -fwrapv -pipe -Wformat -Werror=format-security -gdwarf-4 -fno-debug-types-section -fvar-tracking-assignments -g2 -Wp,-D_FORTIFY_SOURCE=2 -fstack-protector-strong --param=ssp-buffer-size=4 -Werror=trampolines -fomit-frame-pointer -march=i686 -fasynchronous-unwind-tables -mtune=pentium4 -gdwarf-4 -fno-debug-types-section -fvar-tracking-assignments -g2 -O -DSYSCONFDIR=\"/etc\" -I../h -I../h ZMakeAscii.c -o ZMakeAscii.o >/dev/null 2>&1 make[2]: Leaving directory '/tmp/B.o_glf5h0/BUILD/zephyr-3.1.2/lib' make[2]: Entering directory '/tmp/B.o_glf5h0/BUILD/zephyr-3.1.2/lib' /bin/sh ../libtool --mode=compile i686-pld-linux-gcc -c -o ZhmStat.lo -O2 -fwrapv -pipe -Wformat -Werror=format-security -gdwarf-4 -fno-debug-types-section -fvar-tracking-assignments -g2 -Wp,-D_FORTIFY_SOURCE=2 -fstack-protector-strong --param=ssp-buffer-size=4 -Werror=trampolines -fomit-frame-pointer -march=i686 -fasynchronous-unwind-tables -mtune=pentium4 -gdwarf-4 -fno-debug-types-section -fvar-tracking-assignments -g2 -O -DSYSCONFDIR=\"/etc\" -I../h -I../h ZhmStat.c libtool: compile: i686-pld-linux-gcc -c -O2 -fwrapv -pipe -Wformat -Werror=format-security -gdwarf-4 -fno-debug-types-section -fvar-tracking-assignments -g2 -Wp,-D_FORTIFY_SOURCE=2 -fstack-protector-strong --param=ssp-buffer-size=4 -Werror=trampolines -fomit-frame-pointer -march=i686 -fasynchronous-unwind-tables -mtune=pentium4 -gdwarf-4 -fno-debug-types-section -fvar-tracking-assignments -g2 -O -DSYSCONFDIR=\"/etc\" -I../h -I../h ZhmStat.c -fPIC -DPIC -o .libs/ZhmStat.o libtool: compile: i686-pld-linux-gcc -c -O2 -fwrapv -pipe -Wformat -Werror=format-security -gdwarf-4 -fno-debug-types-section -fvar-tracking-assignments -g2 -Wp,-D_FORTIFY_SOURCE=2 -fstack-protector-strong --param=ssp-buffer-size=4 -Werror=trampolines -fomit-frame-pointer -march=i686 -fasynchronous-unwind-tables -mtune=pentium4 -gdwarf-4 -fno-debug-types-section -fvar-tracking-assignments -g2 -O -DSYSCONFDIR=\"/etc\" -I../h -I../h ZhmStat.c -o ZhmStat.o >/dev/null 2>&1 make[2]: Leaving directory '/tmp/B.o_glf5h0/BUILD/zephyr-3.1.2/lib' make[2]: Entering directory '/tmp/B.o_glf5h0/BUILD/zephyr-3.1.2/lib' /bin/sh ../libtool --mode=compile i686-pld-linux-gcc -c -o ZLocations.lo -O2 -fwrapv -pipe -Wformat -Werror=format-security -gdwarf-4 -fno-debug-types-section -fvar-tracking-assignments -g2 -Wp,-D_FORTIFY_SOURCE=2 -fstack-protector-strong --param=ssp-buffer-size=4 -Werror=trampolines -fomit-frame-pointer -march=i686 -fasynchronous-unwind-tables -mtune=pentium4 -gdwarf-4 -fno-debug-types-section -fvar-tracking-assignments -g2 -O -DSYSCONFDIR=\"/etc\" -I../h -I../h ZLocations.c libtool: compile: i686-pld-linux-gcc -c -O2 -fwrapv -pipe -Wformat -Werror=format-security -gdwarf-4 -fno-debug-types-section -fvar-tracking-assignments -g2 -Wp,-D_FORTIFY_SOURCE=2 -fstack-protector-strong --param=ssp-buffer-size=4 -Werror=trampolines -fomit-frame-pointer -march=i686 -fasynchronous-unwind-tables -mtune=pentium4 -gdwarf-4 -fno-debug-types-section -fvar-tracking-assignments -g2 -O -DSYSCONFDIR=\"/etc\" -I../h -I../h ZLocations.c -fPIC -DPIC -o .libs/ZLocations.o libtool: compile: i686-pld-linux-gcc -c -O2 -fwrapv -pipe -Wformat -Werror=format-security -gdwarf-4 -fno-debug-types-section -fvar-tracking-assignments -g2 -Wp,-D_FORTIFY_SOURCE=2 -fstack-protector-strong --param=ssp-buffer-size=4 -Werror=trampolines -fomit-frame-pointer -march=i686 -fasynchronous-unwind-tables -mtune=pentium4 -gdwarf-4 -fno-debug-types-section -fvar-tracking-assignments -g2 -O -DSYSCONFDIR=\"/etc\" -I../h -I../h ZLocations.c -o ZLocations.o >/dev/null 2>&1 make[2]: Leaving directory '/tmp/B.o_glf5h0/BUILD/zephyr-3.1.2/lib' make[2]: Entering directory '/tmp/B.o_glf5h0/BUILD/zephyr-3.1.2/lib' /bin/sh ../libtool --mode=compile i686-pld-linux-gcc -c -o ZMkAuth.lo -O2 -fwrapv -pipe -Wformat -Werror=format-security -gdwarf-4 -fno-debug-types-section -fvar-tracking-assignments -g2 -Wp,-D_FORTIFY_SOURCE=2 -fstack-protector-strong --param=ssp-buffer-size=4 -Werror=trampolines -fomit-frame-pointer -march=i686 -fasynchronous-unwind-tables -mtune=pentium4 -gdwarf-4 -fno-debug-types-section -fvar-tracking-assignments -g2 -O -DSYSCONFDIR=\"/etc\" -I../h -I../h ZMkAuth.c libtool: compile: i686-pld-linux-gcc -c -O2 -fwrapv -pipe -Wformat -Werror=format-security -gdwarf-4 -fno-debug-types-section -fvar-tracking-assignments -g2 -Wp,-D_FORTIFY_SOURCE=2 -fstack-protector-strong --param=ssp-buffer-size=4 -Werror=trampolines -fomit-frame-pointer -march=i686 -fasynchronous-unwind-tables -mtune=pentium4 -gdwarf-4 -fno-debug-types-section -fvar-tracking-assignments -g2 -O -DSYSCONFDIR=\"/etc\" -I../h -I../h ZMkAuth.c -fPIC -DPIC -o .libs/ZMkAuth.o ZMkAuth.c: In function 'Z_MakeZcodeAuthentication': ZMkAuth.c:266:5: warning: 'krb5_free_data_contents' is deprecated [-Wdeprecated-declarations] 266 | krb5_free_data_contents(Z_krb5_ctx, authent); | ^~~~~~~~~~~~~~~~~~~~~~~ In file included from /usr/include/krb5.h:967, from ../h/internal.h:15, from ZMkAuth.c:13: /usr/include/krb5-protos.h:3674:1: note: declared here 3674 | krb5_free_data_contents ( | ^~~~~~~~~~~~~~~~~~~~~~~ libtool: compile: i686-pld-linux-gcc -c -O2 -fwrapv -pipe -Wformat -Werror=format-security -gdwarf-4 -fno-debug-types-section -fvar-tracking-assignments -g2 -Wp,-D_FORTIFY_SOURCE=2 -fstack-protector-strong --param=ssp-buffer-size=4 -Werror=trampolines -fomit-frame-pointer -march=i686 -fasynchronous-unwind-tables -mtune=pentium4 -gdwarf-4 -fno-debug-types-section -fvar-tracking-assignments -g2 -O -DSYSCONFDIR=\"/etc\" -I../h -I../h ZMkAuth.c -o ZMkAuth.o >/dev/null 2>&1 make[2]: Leaving directory '/tmp/B.o_glf5h0/BUILD/zephyr-3.1.2/lib' make[2]: Entering directory '/tmp/B.o_glf5h0/BUILD/zephyr-3.1.2/lib' /bin/sh ../libtool --mode=compile i686-pld-linux-gcc -c -o ZNewLocU.lo -O2 -fwrapv -pipe -Wformat -Werror=format-security -gdwarf-4 -fno-debug-types-section -fvar-tracking-assignments -g2 -Wp,-D_FORTIFY_SOURCE=2 -fstack-protector-strong --param=ssp-buffer-size=4 -Werror=trampolines -fomit-frame-pointer -march=i686 -fasynchronous-unwind-tables -mtune=pentium4 -gdwarf-4 -fno-debug-types-section -fvar-tracking-assignments -g2 -O -DSYSCONFDIR=\"/etc\" -I../h -I../h ZNewLocU.c libtool: compile: i686-pld-linux-gcc -c -O2 -fwrapv -pipe -Wformat -Werror=format-security -gdwarf-4 -fno-debug-types-section -fvar-tracking-assignments -g2 -Wp,-D_FORTIFY_SOURCE=2 -fstack-protector-strong --param=ssp-buffer-size=4 -Werror=trampolines -fomit-frame-pointer -march=i686 -fasynchronous-unwind-tables -mtune=pentium4 -gdwarf-4 -fno-debug-types-section -fvar-tracking-assignments -g2 -O -DSYSCONFDIR=\"/etc\" -I../h -I../h ZNewLocU.c -fPIC -DPIC -o .libs/ZNewLocU.o libtool: compile: i686-pld-linux-gcc -c -O2 -fwrapv -pipe -Wformat -Werror=format-security -gdwarf-4 -fno-debug-types-section -fvar-tracking-assignments -g2 -Wp,-D_FORTIFY_SOURCE=2 -fstack-protector-strong --param=ssp-buffer-size=4 -Werror=trampolines -fomit-frame-pointer -march=i686 -fasynchronous-unwind-tables -mtune=pentium4 -gdwarf-4 -fno-debug-types-section -fvar-tracking-assignments -g2 -O -DSYSCONFDIR=\"/etc\" -I../h -I../h ZNewLocU.c -o ZNewLocU.o >/dev/null 2>&1 make[2]: Leaving directory '/tmp/B.o_glf5h0/BUILD/zephyr-3.1.2/lib' make[2]: Entering directory '/tmp/B.o_glf5h0/BUILD/zephyr-3.1.2/lib' /bin/sh ../libtool --mode=compile i686-pld-linux-gcc -c -o ZPeekNot.lo -O2 -fwrapv -pipe -Wformat -Werror=format-security -gdwarf-4 -fno-debug-types-section -fvar-tracking-assignments -g2 -Wp,-D_FORTIFY_SOURCE=2 -fstack-protector-strong --param=ssp-buffer-size=4 -Werror=trampolines -fomit-frame-pointer -march=i686 -fasynchronous-unwind-tables -mtune=pentium4 -gdwarf-4 -fno-debug-types-section -fvar-tracking-assignments -g2 -O -DSYSCONFDIR=\"/etc\" -I../h -I../h ZPeekNot.c libtool: compile: i686-pld-linux-gcc -c -O2 -fwrapv -pipe -Wformat -Werror=format-security -gdwarf-4 -fno-debug-types-section -fvar-tracking-assignments -g2 -Wp,-D_FORTIFY_SOURCE=2 -fstack-protector-strong --param=ssp-buffer-size=4 -Werror=trampolines -fomit-frame-pointer -march=i686 -fasynchronous-unwind-tables -mtune=pentium4 -gdwarf-4 -fno-debug-types-section -fvar-tracking-assignments -g2 -O -DSYSCONFDIR=\"/etc\" -I../h -I../h ZPeekNot.c -fPIC -DPIC -o .libs/ZPeekNot.o libtool: compile: i686-pld-linux-gcc -c -O2 -fwrapv -pipe -Wformat -Werror=format-security -gdwarf-4 -fno-debug-types-section -fvar-tracking-assignments -g2 -Wp,-D_FORTIFY_SOURCE=2 -fstack-protector-strong --param=ssp-buffer-size=4 -Werror=trampolines -fomit-frame-pointer -march=i686 -fasynchronous-unwind-tables -mtune=pentium4 -gdwarf-4 -fno-debug-types-section -fvar-tracking-assignments -g2 -O -DSYSCONFDIR=\"/etc\" -I../h -I../h ZPeekNot.c -o ZPeekNot.o >/dev/null 2>&1 make[2]: Leaving directory '/tmp/B.o_glf5h0/BUILD/zephyr-3.1.2/lib' make[2]: Entering directory '/tmp/B.o_glf5h0/BUILD/zephyr-3.1.2/lib' /bin/sh ../libtool --mode=compile i686-pld-linux-gcc -c -o ZOpenPort.lo -O2 -fwrapv -pipe -Wformat -Werror=format-security -gdwarf-4 -fno-debug-types-section -fvar-tracking-assignments -g2 -Wp,-D_FORTIFY_SOURCE=2 -fstack-protector-strong --param=ssp-buffer-size=4 -Werror=trampolines -fomit-frame-pointer -march=i686 -fasynchronous-unwind-tables -mtune=pentium4 -gdwarf-4 -fno-debug-types-section -fvar-tracking-assignments -g2 -O -DSYSCONFDIR=\"/etc\" -I../h -I../h ZOpenPort.c libtool: compile: i686-pld-linux-gcc -c -O2 -fwrapv -pipe -Wformat -Werror=format-security -gdwarf-4 -fno-debug-types-section -fvar-tracking-assignments -g2 -Wp,-D_FORTIFY_SOURCE=2 -fstack-protector-strong --param=ssp-buffer-size=4 -Werror=trampolines -fomit-frame-pointer -march=i686 -fasynchronous-unwind-tables -mtune=pentium4 -gdwarf-4 -fno-debug-types-section -fvar-tracking-assignments -g2 -O -DSYSCONFDIR=\"/etc\" -I../h -I../h ZOpenPort.c -fPIC -DPIC -o .libs/ZOpenPort.o libtool: compile: i686-pld-linux-gcc -c -O2 -fwrapv -pipe -Wformat -Werror=format-security -gdwarf-4 -fno-debug-types-section -fvar-tracking-assignments -g2 -Wp,-D_FORTIFY_SOURCE=2 -fstack-protector-strong --param=ssp-buffer-size=4 -Werror=trampolines -fomit-frame-pointer -march=i686 -fasynchronous-unwind-tables -mtune=pentium4 -gdwarf-4 -fno-debug-types-section -fvar-tracking-assignments -g2 -O -DSYSCONFDIR=\"/etc\" -I../h -I../h ZOpenPort.c -o ZOpenPort.o >/dev/null 2>&1 make[2]: Leaving directory '/tmp/B.o_glf5h0/BUILD/zephyr-3.1.2/lib' make[2]: Entering directory '/tmp/B.o_glf5h0/BUILD/zephyr-3.1.2/lib' /bin/sh ../libtool --mode=compile i686-pld-linux-gcc -c -o ZPeekIfNot.lo -O2 -fwrapv -pipe -Wformat -Werror=format-security -gdwarf-4 -fno-debug-types-section -fvar-tracking-assignments -g2 -Wp,-D_FORTIFY_SOURCE=2 -fstack-protector-strong --param=ssp-buffer-size=4 -Werror=trampolines -fomit-frame-pointer -march=i686 -fasynchronous-unwind-tables -mtune=pentium4 -gdwarf-4 -fno-debug-types-section -fvar-tracking-assignments -g2 -O -DSYSCONFDIR=\"/etc\" -I../h -I../h ZPeekIfNot.c libtool: compile: i686-pld-linux-gcc -c -O2 -fwrapv -pipe -Wformat -Werror=format-security -gdwarf-4 -fno-debug-types-section -fvar-tracking-assignments -g2 -Wp,-D_FORTIFY_SOURCE=2 -fstack-protector-strong --param=ssp-buffer-size=4 -Werror=trampolines -fomit-frame-pointer -march=i686 -fasynchronous-unwind-tables -mtune=pentium4 -gdwarf-4 -fno-debug-types-section -fvar-tracking-assignments -g2 -O -DSYSCONFDIR=\"/etc\" -I../h -I../h ZPeekIfNot.c -fPIC -DPIC -o .libs/ZPeekIfNot.o libtool: compile: i686-pld-linux-gcc -c -O2 -fwrapv -pipe -Wformat -Werror=format-security -gdwarf-4 -fno-debug-types-section -fvar-tracking-assignments -g2 -Wp,-D_FORTIFY_SOURCE=2 -fstack-protector-strong --param=ssp-buffer-size=4 -Werror=trampolines -fomit-frame-pointer -march=i686 -fasynchronous-unwind-tables -mtune=pentium4 -gdwarf-4 -fno-debug-types-section -fvar-tracking-assignments -g2 -O -DSYSCONFDIR=\"/etc\" -I../h -I../h ZPeekIfNot.c -o ZPeekIfNot.o >/dev/null 2>&1 make[2]: Leaving directory '/tmp/B.o_glf5h0/BUILD/zephyr-3.1.2/lib' make[2]: Entering directory '/tmp/B.o_glf5h0/BUILD/zephyr-3.1.2/lib' /bin/sh ../libtool --mode=compile i686-pld-linux-gcc -c -o ZPending.lo -O2 -fwrapv -pipe -Wformat -Werror=format-security -gdwarf-4 -fno-debug-types-section -fvar-tracking-assignments -g2 -Wp,-D_FORTIFY_SOURCE=2 -fstack-protector-strong --param=ssp-buffer-size=4 -Werror=trampolines -fomit-frame-pointer -march=i686 -fasynchronous-unwind-tables -mtune=pentium4 -gdwarf-4 -fno-debug-types-section -fvar-tracking-assignments -g2 -O -DSYSCONFDIR=\"/etc\" -I../h -I../h ZPending.c libtool: compile: i686-pld-linux-gcc -c -O2 -fwrapv -pipe -Wformat -Werror=format-security -gdwarf-4 -fno-debug-types-section -fvar-tracking-assignments -g2 -Wp,-D_FORTIFY_SOURCE=2 -fstack-protector-strong --param=ssp-buffer-size=4 -Werror=trampolines -fomit-frame-pointer -march=i686 -fasynchronous-unwind-tables -mtune=pentium4 -gdwarf-4 -fno-debug-types-section -fvar-tracking-assignments -g2 -O -DSYSCONFDIR=\"/etc\" -I../h -I../h ZPending.c -fPIC -DPIC -o .libs/ZPending.o libtool: compile: i686-pld-linux-gcc -c -O2 -fwrapv -pipe -Wformat -Werror=format-security -gdwarf-4 -fno-debug-types-section -fvar-tracking-assignments -g2 -Wp,-D_FORTIFY_SOURCE=2 -fstack-protector-strong --param=ssp-buffer-size=4 -Werror=trampolines -fomit-frame-pointer -march=i686 -fasynchronous-unwind-tables -mtune=pentium4 -gdwarf-4 -fno-debug-types-section -fvar-tracking-assignments -g2 -O -DSYSCONFDIR=\"/etc\" -I../h -I../h ZPending.c -o ZPending.o >/dev/null 2>&1 make[2]: Leaving directory '/tmp/B.o_glf5h0/BUILD/zephyr-3.1.2/lib' make[2]: Entering directory '/tmp/B.o_glf5h0/BUILD/zephyr-3.1.2/lib' /bin/sh ../libtool --mode=compile i686-pld-linux-gcc -c -o ZPeekPkt.lo -O2 -fwrapv -pipe -Wformat -Werror=format-security -gdwarf-4 -fno-debug-types-section -fvar-tracking-assignments -g2 -Wp,-D_FORTIFY_SOURCE=2 -fstack-protector-strong --param=ssp-buffer-size=4 -Werror=trampolines -fomit-frame-pointer -march=i686 -fasynchronous-unwind-tables -mtune=pentium4 -gdwarf-4 -fno-debug-types-section -fvar-tracking-assignments -g2 -O -DSYSCONFDIR=\"/etc\" -I../h -I../h ZPeekPkt.c libtool: compile: i686-pld-linux-gcc -c -O2 -fwrapv -pipe -Wformat -Werror=format-security -gdwarf-4 -fno-debug-types-section -fvar-tracking-assignments -g2 -Wp,-D_FORTIFY_SOURCE=2 -fstack-protector-strong --param=ssp-buffer-size=4 -Werror=trampolines -fomit-frame-pointer -march=i686 -fasynchronous-unwind-tables -mtune=pentium4 -gdwarf-4 -fno-debug-types-section -fvar-tracking-assignments -g2 -O -DSYSCONFDIR=\"/etc\" -I../h -I../h ZPeekPkt.c -fPIC -DPIC -o .libs/ZPeekPkt.o libtool: compile: i686-pld-linux-gcc -c -O2 -fwrapv -pipe -Wformat -Werror=format-security -gdwarf-4 -fno-debug-types-section -fvar-tracking-assignments -g2 -Wp,-D_FORTIFY_SOURCE=2 -fstack-protector-strong --param=ssp-buffer-size=4 -Werror=trampolines -fomit-frame-pointer -march=i686 -fasynchronous-unwind-tables -mtune=pentium4 -gdwarf-4 -fno-debug-types-section -fvar-tracking-assignments -g2 -O -DSYSCONFDIR=\"/etc\" -I../h -I../h ZPeekPkt.c -o ZPeekPkt.o >/dev/null 2>&1 make[2]: Leaving directory '/tmp/B.o_glf5h0/BUILD/zephyr-3.1.2/lib' make[2]: Entering directory '/tmp/B.o_glf5h0/BUILD/zephyr-3.1.2/lib' /bin/sh ../libtool --mode=compile i686-pld-linux-gcc -c -o ZReadAscii.lo -O2 -fwrapv -pipe -Wformat -Werror=format-security -gdwarf-4 -fno-debug-types-section -fvar-tracking-assignments -g2 -Wp,-D_FORTIFY_SOURCE=2 -fstack-protector-strong --param=ssp-buffer-size=4 -Werror=trampolines -fomit-frame-pointer -march=i686 -fasynchronous-unwind-tables -mtune=pentium4 -gdwarf-4 -fno-debug-types-section -fvar-tracking-assignments -g2 -O -DSYSCONFDIR=\"/etc\" -I../h -I../h ZReadAscii.c libtool: compile: i686-pld-linux-gcc -c -O2 -fwrapv -pipe -Wformat -Werror=format-security -gdwarf-4 -fno-debug-types-section -fvar-tracking-assignments -g2 -Wp,-D_FORTIFY_SOURCE=2 -fstack-protector-strong --param=ssp-buffer-size=4 -Werror=trampolines -fomit-frame-pointer -march=i686 -fasynchronous-unwind-tables -mtune=pentium4 -gdwarf-4 -fno-debug-types-section -fvar-tracking-assignments -g2 -O -DSYSCONFDIR=\"/etc\" -I../h -I../h ZReadAscii.c -fPIC -DPIC -o .libs/ZReadAscii.o libtool: compile: i686-pld-linux-gcc -c -O2 -fwrapv -pipe -Wformat -Werror=format-security -gdwarf-4 -fno-debug-types-section -fvar-tracking-assignments -g2 -Wp,-D_FORTIFY_SOURCE=2 -fstack-protector-strong --param=ssp-buffer-size=4 -Werror=trampolines -fomit-frame-pointer -march=i686 -fasynchronous-unwind-tables -mtune=pentium4 -gdwarf-4 -fno-debug-types-section -fvar-tracking-assignments -g2 -O -DSYSCONFDIR=\"/etc\" -I../h -I../h ZReadAscii.c -o ZReadAscii.o >/dev/null 2>&1 make[2]: Leaving directory '/tmp/B.o_glf5h0/BUILD/zephyr-3.1.2/lib' make[2]: Entering directory '/tmp/B.o_glf5h0/BUILD/zephyr-3.1.2/lib' /bin/sh ../libtool --mode=compile i686-pld-linux-gcc -c -o ZRecvPkt.lo -O2 -fwrapv -pipe -Wformat -Werror=format-security -gdwarf-4 -fno-debug-types-section -fvar-tracking-assignments -g2 -Wp,-D_FORTIFY_SOURCE=2 -fstack-protector-strong --param=ssp-buffer-size=4 -Werror=trampolines -fomit-frame-pointer -march=i686 -fasynchronous-unwind-tables -mtune=pentium4 -gdwarf-4 -fno-debug-types-section -fvar-tracking-assignments -g2 -O -DSYSCONFDIR=\"/etc\" -I../h -I../h ZRecvPkt.c libtool: compile: i686-pld-linux-gcc -c -O2 -fwrapv -pipe -Wformat -Werror=format-security -gdwarf-4 -fno-debug-types-section -fvar-tracking-assignments -g2 -Wp,-D_FORTIFY_SOURCE=2 -fstack-protector-strong --param=ssp-buffer-size=4 -Werror=trampolines -fomit-frame-pointer -march=i686 -fasynchronous-unwind-tables -mtune=pentium4 -gdwarf-4 -fno-debug-types-section -fvar-tracking-assignments -g2 -O -DSYSCONFDIR=\"/etc\" -I../h -I../h ZRecvPkt.c -fPIC -DPIC -o .libs/ZRecvPkt.o libtool: compile: i686-pld-linux-gcc -c -O2 -fwrapv -pipe -Wformat -Werror=format-security -gdwarf-4 -fno-debug-types-section -fvar-tracking-assignments -g2 -Wp,-D_FORTIFY_SOURCE=2 -fstack-protector-strong --param=ssp-buffer-size=4 -Werror=trampolines -fomit-frame-pointer -march=i686 -fasynchronous-unwind-tables -mtune=pentium4 -gdwarf-4 -fno-debug-types-section -fvar-tracking-assignments -g2 -O -DSYSCONFDIR=\"/etc\" -I../h -I../h ZRecvPkt.c -o ZRecvPkt.o >/dev/null 2>&1 make[2]: Leaving directory '/tmp/B.o_glf5h0/BUILD/zephyr-3.1.2/lib' make[2]: Entering directory '/tmp/B.o_glf5h0/BUILD/zephyr-3.1.2/lib' /bin/sh ../libtool --mode=compile i686-pld-linux-gcc -c -o ZRecvNot.lo -O2 -fwrapv -pipe -Wformat -Werror=format-security -gdwarf-4 -fno-debug-types-section -fvar-tracking-assignments -g2 -Wp,-D_FORTIFY_SOURCE=2 -fstack-protector-strong --param=ssp-buffer-size=4 -Werror=trampolines -fomit-frame-pointer -march=i686 -fasynchronous-unwind-tables -mtune=pentium4 -gdwarf-4 -fno-debug-types-section -fvar-tracking-assignments -g2 -O -DSYSCONFDIR=\"/etc\" -I../h -I../h ZRecvNot.c libtool: compile: i686-pld-linux-gcc -c -O2 -fwrapv -pipe -Wformat -Werror=format-security -gdwarf-4 -fno-debug-types-section -fvar-tracking-assignments -g2 -Wp,-D_FORTIFY_SOURCE=2 -fstack-protector-strong --param=ssp-buffer-size=4 -Werror=trampolines -fomit-frame-pointer -march=i686 -fasynchronous-unwind-tables -mtune=pentium4 -gdwarf-4 -fno-debug-types-section -fvar-tracking-assignments -g2 -O -DSYSCONFDIR=\"/etc\" -I../h -I../h ZRecvNot.c -fPIC -DPIC -o .libs/ZRecvNot.o libtool: compile: i686-pld-linux-gcc -c -O2 -fwrapv -pipe -Wformat -Werror=format-security -gdwarf-4 -fno-debug-types-section -fvar-tracking-assignments -g2 -Wp,-D_FORTIFY_SOURCE=2 -fstack-protector-strong --param=ssp-buffer-size=4 -Werror=trampolines -fomit-frame-pointer -march=i686 -fasynchronous-unwind-tables -mtune=pentium4 -gdwarf-4 -fno-debug-types-section -fvar-tracking-assignments -g2 -O -DSYSCONFDIR=\"/etc\" -I../h -I../h ZRecvNot.c -o ZRecvNot.o >/dev/null 2>&1 make[2]: Leaving directory '/tmp/B.o_glf5h0/BUILD/zephyr-3.1.2/lib' make[2]: Entering directory '/tmp/B.o_glf5h0/BUILD/zephyr-3.1.2/lib' /bin/sh ../libtool --mode=compile i686-pld-linux-gcc -c -o ZParseNot.lo -O2 -fwrapv -pipe -Wformat -Werror=format-security -gdwarf-4 -fno-debug-types-section -fvar-tracking-assignments -g2 -Wp,-D_FORTIFY_SOURCE=2 -fstack-protector-strong --param=ssp-buffer-size=4 -Werror=trampolines -fomit-frame-pointer -march=i686 -fasynchronous-unwind-tables -mtune=pentium4 -gdwarf-4 -fno-debug-types-section -fvar-tracking-assignments -g2 -O -DSYSCONFDIR=\"/etc\" -I../h -I../h ZParseNot.c libtool: compile: i686-pld-linux-gcc -c -O2 -fwrapv -pipe -Wformat -Werror=format-security -gdwarf-4 -fno-debug-types-section -fvar-tracking-assignments -g2 -Wp,-D_FORTIFY_SOURCE=2 -fstack-protector-strong --param=ssp-buffer-size=4 -Werror=trampolines -fomit-frame-pointer -march=i686 -fasynchronous-unwind-tables -mtune=pentium4 -gdwarf-4 -fno-debug-types-section -fvar-tracking-assignments -g2 -O -DSYSCONFDIR=\"/etc\" -I../h -I../h ZParseNot.c -fPIC -DPIC -o .libs/ZParseNot.o libtool: compile: i686-pld-linux-gcc -c -O2 -fwrapv -pipe -Wformat -Werror=format-security -gdwarf-4 -fno-debug-types-section -fvar-tracking-assignments -g2 -Wp,-D_FORTIFY_SOURCE=2 -fstack-protector-strong --param=ssp-buffer-size=4 -Werror=trampolines -fomit-frame-pointer -march=i686 -fasynchronous-unwind-tables -mtune=pentium4 -gdwarf-4 -fno-debug-types-section -fvar-tracking-assignments -g2 -O -DSYSCONFDIR=\"/etc\" -I../h -I../h ZParseNot.c -o ZParseNot.o >/dev/null 2>&1 make[2]: Leaving directory '/tmp/B.o_glf5h0/BUILD/zephyr-3.1.2/lib' make[2]: Entering directory '/tmp/B.o_glf5h0/BUILD/zephyr-3.1.2/lib' /bin/sh ../libtool --mode=compile i686-pld-linux-gcc -c -o ZSendNot.lo -O2 -fwrapv -pipe -Wformat -Werror=format-security -gdwarf-4 -fno-debug-types-section -fvar-tracking-assignments -g2 -Wp,-D_FORTIFY_SOURCE=2 -fstack-protector-strong --param=ssp-buffer-size=4 -Werror=trampolines -fomit-frame-pointer -march=i686 -fasynchronous-unwind-tables -mtune=pentium4 -gdwarf-4 -fno-debug-types-section -fvar-tracking-assignments -g2 -O -DSYSCONFDIR=\"/etc\" -I../h -I../h ZSendNot.c libtool: compile: i686-pld-linux-gcc -c -O2 -fwrapv -pipe -Wformat -Werror=format-security -gdwarf-4 -fno-debug-types-section -fvar-tracking-assignments -g2 -Wp,-D_FORTIFY_SOURCE=2 -fstack-protector-strong --param=ssp-buffer-size=4 -Werror=trampolines -fomit-frame-pointer -march=i686 -fasynchronous-unwind-tables -mtune=pentium4 -gdwarf-4 -fno-debug-types-section -fvar-tracking-assignments -g2 -O -DSYSCONFDIR=\"/etc\" -I../h -I../h ZSendNot.c -fPIC -DPIC -o .libs/ZSendNot.o libtool: compile: i686-pld-linux-gcc -c -O2 -fwrapv -pipe -Wformat -Werror=format-security -gdwarf-4 -fno-debug-types-section -fvar-tracking-assignments -g2 -Wp,-D_FORTIFY_SOURCE=2 -fstack-protector-strong --param=ssp-buffer-size=4 -Werror=trampolines -fomit-frame-pointer -march=i686 -fasynchronous-unwind-tables -mtune=pentium4 -gdwarf-4 -fno-debug-types-section -fvar-tracking-assignments -g2 -O -DSYSCONFDIR=\"/etc\" -I../h -I../h ZSendNot.c -o ZSendNot.o >/dev/null 2>&1 make[2]: Leaving directory '/tmp/B.o_glf5h0/BUILD/zephyr-3.1.2/lib' make[2]: Entering directory '/tmp/B.o_glf5h0/BUILD/zephyr-3.1.2/lib' /bin/sh ../libtool --mode=compile i686-pld-linux-gcc -c -o ZSendPkt.lo -O2 -fwrapv -pipe -Wformat -Werror=format-security -gdwarf-4 -fno-debug-types-section -fvar-tracking-assignments -g2 -Wp,-D_FORTIFY_SOURCE=2 -fstack-protector-strong --param=ssp-buffer-size=4 -Werror=trampolines -fomit-frame-pointer -march=i686 -fasynchronous-unwind-tables -mtune=pentium4 -gdwarf-4 -fno-debug-types-section -fvar-tracking-assignments -g2 -O -DSYSCONFDIR=\"/etc\" -I../h -I../h ZSendPkt.c libtool: compile: i686-pld-linux-gcc -c -O2 -fwrapv -pipe -Wformat -Werror=format-security -gdwarf-4 -fno-debug-types-section -fvar-tracking-assignments -g2 -Wp,-D_FORTIFY_SOURCE=2 -fstack-protector-strong --param=ssp-buffer-size=4 -Werror=trampolines -fomit-frame-pointer -march=i686 -fasynchronous-unwind-tables -mtune=pentium4 -gdwarf-4 -fno-debug-types-section -fvar-tracking-assignments -g2 -O -DSYSCONFDIR=\"/etc\" -I../h -I../h ZSendPkt.c -fPIC -DPIC -o .libs/ZSendPkt.o libtool: compile: i686-pld-linux-gcc -c -O2 -fwrapv -pipe -Wformat -Werror=format-security -gdwarf-4 -fno-debug-types-section -fvar-tracking-assignments -g2 -Wp,-D_FORTIFY_SOURCE=2 -fstack-protector-strong --param=ssp-buffer-size=4 -Werror=trampolines -fomit-frame-pointer -march=i686 -fasynchronous-unwind-tables -mtune=pentium4 -gdwarf-4 -fno-debug-types-section -fvar-tracking-assignments -g2 -O -DSYSCONFDIR=\"/etc\" -I../h -I../h ZSendPkt.c -o ZSendPkt.o >/dev/null 2>&1 make[2]: Leaving directory '/tmp/B.o_glf5h0/BUILD/zephyr-3.1.2/lib' make[2]: Entering directory '/tmp/B.o_glf5h0/BUILD/zephyr-3.1.2/lib' /bin/sh ../libtool --mode=compile i686-pld-linux-gcc -c -o ZSendList.lo -O2 -fwrapv -pipe -Wformat -Werror=format-security -gdwarf-4 -fno-debug-types-section -fvar-tracking-assignments -g2 -Wp,-D_FORTIFY_SOURCE=2 -fstack-protector-strong --param=ssp-buffer-size=4 -Werror=trampolines -fomit-frame-pointer -march=i686 -fasynchronous-unwind-tables -mtune=pentium4 -gdwarf-4 -fno-debug-types-section -fvar-tracking-assignments -g2 -O -DSYSCONFDIR=\"/etc\" -I../h -I../h ZSendList.c libtool: compile: i686-pld-linux-gcc -c -O2 -fwrapv -pipe -Wformat -Werror=format-security -gdwarf-4 -fno-debug-types-section -fvar-tracking-assignments -g2 -Wp,-D_FORTIFY_SOURCE=2 -fstack-protector-strong --param=ssp-buffer-size=4 -Werror=trampolines -fomit-frame-pointer -march=i686 -fasynchronous-unwind-tables -mtune=pentium4 -gdwarf-4 -fno-debug-types-section -fvar-tracking-assignments -g2 -O -DSYSCONFDIR=\"/etc\" -I../h -I../h ZSendList.c -fPIC -DPIC -o .libs/ZSendList.o libtool: compile: i686-pld-linux-gcc -c -O2 -fwrapv -pipe -Wformat -Werror=format-security -gdwarf-4 -fno-debug-types-section -fvar-tracking-assignments -g2 -Wp,-D_FORTIFY_SOURCE=2 -fstack-protector-strong --param=ssp-buffer-size=4 -Werror=trampolines -fomit-frame-pointer -march=i686 -fasynchronous-unwind-tables -mtune=pentium4 -gdwarf-4 -fno-debug-types-section -fvar-tracking-assignments -g2 -O -DSYSCONFDIR=\"/etc\" -I../h -I../h ZSendList.c -o ZSendList.o >/dev/null 2>&1 make[2]: Leaving directory '/tmp/B.o_glf5h0/BUILD/zephyr-3.1.2/lib' make[2]: Entering directory '/tmp/B.o_glf5h0/BUILD/zephyr-3.1.2/lib' /bin/sh ../libtool --mode=compile i686-pld-linux-gcc -c -o ZRetSubs.lo -O2 -fwrapv -pipe -Wformat -Werror=format-security -gdwarf-4 -fno-debug-types-section -fvar-tracking-assignments -g2 -Wp,-D_FORTIFY_SOURCE=2 -fstack-protector-strong --param=ssp-buffer-size=4 -Werror=trampolines -fomit-frame-pointer -march=i686 -fasynchronous-unwind-tables -mtune=pentium4 -gdwarf-4 -fno-debug-types-section -fvar-tracking-assignments -g2 -O -DSYSCONFDIR=\"/etc\" -I../h -I../h ZRetSubs.c libtool: compile: i686-pld-linux-gcc -c -O2 -fwrapv -pipe -Wformat -Werror=format-security -gdwarf-4 -fno-debug-types-section -fvar-tracking-assignments -g2 -Wp,-D_FORTIFY_SOURCE=2 -fstack-protector-strong --param=ssp-buffer-size=4 -Werror=trampolines -fomit-frame-pointer -march=i686 -fasynchronous-unwind-tables -mtune=pentium4 -gdwarf-4 -fno-debug-types-section -fvar-tracking-assignments -g2 -O -DSYSCONFDIR=\"/etc\" -I../h -I../h ZRetSubs.c -fPIC -DPIC -o .libs/ZRetSubs.o libtool: compile: i686-pld-linux-gcc -c -O2 -fwrapv -pipe -Wformat -Werror=format-security -gdwarf-4 -fno-debug-types-section -fvar-tracking-assignments -g2 -Wp,-D_FORTIFY_SOURCE=2 -fstack-protector-strong --param=ssp-buffer-size=4 -Werror=trampolines -fomit-frame-pointer -march=i686 -fasynchronous-unwind-tables -mtune=pentium4 -gdwarf-4 -fno-debug-types-section -fvar-tracking-assignments -g2 -O -DSYSCONFDIR=\"/etc\" -I../h -I../h ZRetSubs.c -o ZRetSubs.o >/dev/null 2>&1 make[2]: Leaving directory '/tmp/B.o_glf5h0/BUILD/zephyr-3.1.2/lib' make[2]: Entering directory '/tmp/B.o_glf5h0/BUILD/zephyr-3.1.2/lib' /bin/sh ../libtool --mode=compile i686-pld-linux-gcc -c -o ZSendRaw.lo -O2 -fwrapv -pipe -Wformat -Werror=format-security -gdwarf-4 -fno-debug-types-section -fvar-tracking-assignments -g2 -Wp,-D_FORTIFY_SOURCE=2 -fstack-protector-strong --param=ssp-buffer-size=4 -Werror=trampolines -fomit-frame-pointer -march=i686 -fasynchronous-unwind-tables -mtune=pentium4 -gdwarf-4 -fno-debug-types-section -fvar-tracking-assignments -g2 -O -DSYSCONFDIR=\"/etc\" -I../h -I../h ZSendRaw.c libtool: compile: i686-pld-linux-gcc -c -O2 -fwrapv -pipe -Wformat -Werror=format-security -gdwarf-4 -fno-debug-types-section -fvar-tracking-assignments -g2 -Wp,-D_FORTIFY_SOURCE=2 -fstack-protector-strong --param=ssp-buffer-size=4 -Werror=trampolines -fomit-frame-pointer -march=i686 -fasynchronous-unwind-tables -mtune=pentium4 -gdwarf-4 -fno-debug-types-section -fvar-tracking-assignments -g2 -O -DSYSCONFDIR=\"/etc\" -I../h -I../h ZSendRaw.c -fPIC -DPIC -o .libs/ZSendRaw.o libtool: compile: i686-pld-linux-gcc -c -O2 -fwrapv -pipe -Wformat -Werror=format-security -gdwarf-4 -fno-debug-types-section -fvar-tracking-assignments -g2 -Wp,-D_FORTIFY_SOURCE=2 -fstack-protector-strong --param=ssp-buffer-size=4 -Werror=trampolines -fomit-frame-pointer -march=i686 -fasynchronous-unwind-tables -mtune=pentium4 -gdwarf-4 -fno-debug-types-section -fvar-tracking-assignments -g2 -O -DSYSCONFDIR=\"/etc\" -I../h -I../h ZSendRaw.c -o ZSendRaw.o >/dev/null 2>&1 make[2]: Leaving directory '/tmp/B.o_glf5h0/BUILD/zephyr-3.1.2/lib' make[2]: Entering directory '/tmp/B.o_glf5h0/BUILD/zephyr-3.1.2/lib' /bin/sh ../libtool --mode=compile i686-pld-linux-gcc -c -o ZSendRLst.lo -O2 -fwrapv -pipe -Wformat -Werror=format-security -gdwarf-4 -fno-debug-types-section -fvar-tracking-assignments -g2 -Wp,-D_FORTIFY_SOURCE=2 -fstack-protector-strong --param=ssp-buffer-size=4 -Werror=trampolines -fomit-frame-pointer -march=i686 -fasynchronous-unwind-tables -mtune=pentium4 -gdwarf-4 -fno-debug-types-section -fvar-tracking-assignments -g2 -O -DSYSCONFDIR=\"/etc\" -I../h -I../h ZSendRLst.c libtool: compile: i686-pld-linux-gcc -c -O2 -fwrapv -pipe -Wformat -Werror=format-security -gdwarf-4 -fno-debug-types-section -fvar-tracking-assignments -g2 -Wp,-D_FORTIFY_SOURCE=2 -fstack-protector-strong --param=ssp-buffer-size=4 -Werror=trampolines -fomit-frame-pointer -march=i686 -fasynchronous-unwind-tables -mtune=pentium4 -gdwarf-4 -fno-debug-types-section -fvar-tracking-assignments -g2 -O -DSYSCONFDIR=\"/etc\" -I../h -I../h ZSendRLst.c -fPIC -DPIC -o .libs/ZSendRLst.o libtool: compile: i686-pld-linux-gcc -c -O2 -fwrapv -pipe -Wformat -Werror=format-security -gdwarf-4 -fno-debug-types-section -fvar-tracking-assignments -g2 -Wp,-D_FORTIFY_SOURCE=2 -fstack-protector-strong --param=ssp-buffer-size=4 -Werror=trampolines -fomit-frame-pointer -march=i686 -fasynchronous-unwind-tables -mtune=pentium4 -gdwarf-4 -fno-debug-types-section -fvar-tracking-assignments -g2 -O -DSYSCONFDIR=\"/etc\" -I../h -I../h ZSendRLst.c -o ZSendRLst.o >/dev/null 2>&1 make[2]: Leaving directory '/tmp/B.o_glf5h0/BUILD/zephyr-3.1.2/lib' make[2]: Entering directory '/tmp/B.o_glf5h0/BUILD/zephyr-3.1.2/lib' /bin/sh ../libtool --mode=compile i686-pld-linux-gcc -c -o ZSetDest.lo -O2 -fwrapv -pipe -Wformat -Werror=format-security -gdwarf-4 -fno-debug-types-section -fvar-tracking-assignments -g2 -Wp,-D_FORTIFY_SOURCE=2 -fstack-protector-strong --param=ssp-buffer-size=4 -Werror=trampolines -fomit-frame-pointer -march=i686 -fasynchronous-unwind-tables -mtune=pentium4 -gdwarf-4 -fno-debug-types-section -fvar-tracking-assignments -g2 -O -DSYSCONFDIR=\"/etc\" -I../h -I../h ZSetDest.c libtool: compile: i686-pld-linux-gcc -c -O2 -fwrapv -pipe -Wformat -Werror=format-security -gdwarf-4 -fno-debug-types-section -fvar-tracking-assignments -g2 -Wp,-D_FORTIFY_SOURCE=2 -fstack-protector-strong --param=ssp-buffer-size=4 -Werror=trampolines -fomit-frame-pointer -march=i686 -fasynchronous-unwind-tables -mtune=pentium4 -gdwarf-4 -fno-debug-types-section -fvar-tracking-assignments -g2 -O -DSYSCONFDIR=\"/etc\" -I../h -I../h ZSetDest.c -fPIC -DPIC -o .libs/ZSetDest.o libtool: compile: i686-pld-linux-gcc -c -O2 -fwrapv -pipe -Wformat -Werror=format-security -gdwarf-4 -fno-debug-types-section -fvar-tracking-assignments -g2 -Wp,-D_FORTIFY_SOURCE=2 -fstack-protector-strong --param=ssp-buffer-size=4 -Werror=trampolines -fomit-frame-pointer -march=i686 -fasynchronous-unwind-tables -mtune=pentium4 -gdwarf-4 -fno-debug-types-section -fvar-tracking-assignments -g2 -O -DSYSCONFDIR=\"/etc\" -I../h -I../h ZSetDest.c -o ZSetDest.o >/dev/null 2>&1 make[2]: Leaving directory '/tmp/B.o_glf5h0/BUILD/zephyr-3.1.2/lib' make[2]: Entering directory '/tmp/B.o_glf5h0/BUILD/zephyr-3.1.2/lib' /bin/sh ../libtool --mode=compile i686-pld-linux-gcc -c -o ZSetSrv.lo -O2 -fwrapv -pipe -Wformat -Werror=format-security -gdwarf-4 -fno-debug-types-section -fvar-tracking-assignments -g2 -Wp,-D_FORTIFY_SOURCE=2 -fstack-protector-strong --param=ssp-buffer-size=4 -Werror=trampolines -fomit-frame-pointer -march=i686 -fasynchronous-unwind-tables -mtune=pentium4 -gdwarf-4 -fno-debug-types-section -fvar-tracking-assignments -g2 -O -DSYSCONFDIR=\"/etc\" -I../h -I../h ZSetSrv.c libtool: compile: i686-pld-linux-gcc -c -O2 -fwrapv -pipe -Wformat -Werror=format-security -gdwarf-4 -fno-debug-types-section -fvar-tracking-assignments -g2 -Wp,-D_FORTIFY_SOURCE=2 -fstack-protector-strong --param=ssp-buffer-size=4 -Werror=trampolines -fomit-frame-pointer -march=i686 -fasynchronous-unwind-tables -mtune=pentium4 -gdwarf-4 -fno-debug-types-section -fvar-tracking-assignments -g2 -O -DSYSCONFDIR=\"/etc\" -I../h -I../h ZSetSrv.c -fPIC -DPIC -o .libs/ZSetSrv.o libtool: compile: i686-pld-linux-gcc -c -O2 -fwrapv -pipe -Wformat -Werror=format-security -gdwarf-4 -fno-debug-types-section -fvar-tracking-assignments -g2 -Wp,-D_FORTIFY_SOURCE=2 -fstack-protector-strong --param=ssp-buffer-size=4 -Werror=trampolines -fomit-frame-pointer -march=i686 -fasynchronous-unwind-tables -mtune=pentium4 -gdwarf-4 -fno-debug-types-section -fvar-tracking-assignments -g2 -O -DSYSCONFDIR=\"/etc\" -I../h -I../h ZSetSrv.c -o ZSetSrv.o >/dev/null 2>&1 make[2]: Leaving directory '/tmp/B.o_glf5h0/BUILD/zephyr-3.1.2/lib' make[2]: Entering directory '/tmp/B.o_glf5h0/BUILD/zephyr-3.1.2/lib' /bin/sh ../libtool --mode=compile i686-pld-linux-gcc -c -o ZSetFD.lo -O2 -fwrapv -pipe -Wformat -Werror=format-security -gdwarf-4 -fno-debug-types-section -fvar-tracking-assignments -g2 -Wp,-D_FORTIFY_SOURCE=2 -fstack-protector-strong --param=ssp-buffer-size=4 -Werror=trampolines -fomit-frame-pointer -march=i686 -fasynchronous-unwind-tables -mtune=pentium4 -gdwarf-4 -fno-debug-types-section -fvar-tracking-assignments -g2 -O -DSYSCONFDIR=\"/etc\" -I../h -I../h ZSetFD.c libtool: compile: i686-pld-linux-gcc -c -O2 -fwrapv -pipe -Wformat -Werror=format-security -gdwarf-4 -fno-debug-types-section -fvar-tracking-assignments -g2 -Wp,-D_FORTIFY_SOURCE=2 -fstack-protector-strong --param=ssp-buffer-size=4 -Werror=trampolines -fomit-frame-pointer -march=i686 -fasynchronous-unwind-tables -mtune=pentium4 -gdwarf-4 -fno-debug-types-section -fvar-tracking-assignments -g2 -O -DSYSCONFDIR=\"/etc\" -I../h -I../h ZSetFD.c -fPIC -DPIC -o .libs/ZSetFD.o libtool: compile: i686-pld-linux-gcc -c -O2 -fwrapv -pipe -Wformat -Werror=format-security -gdwarf-4 -fno-debug-types-section -fvar-tracking-assignments -g2 -Wp,-D_FORTIFY_SOURCE=2 -fstack-protector-strong --param=ssp-buffer-size=4 -Werror=trampolines -fomit-frame-pointer -march=i686 -fasynchronous-unwind-tables -mtune=pentium4 -gdwarf-4 -fno-debug-types-section -fvar-tracking-assignments -g2 -O -DSYSCONFDIR=\"/etc\" -I../h -I../h ZSetFD.c -o ZSetFD.o >/dev/null 2>&1 make[2]: Leaving directory '/tmp/B.o_glf5h0/BUILD/zephyr-3.1.2/lib' make[2]: Entering directory '/tmp/B.o_glf5h0/BUILD/zephyr-3.1.2/lib' /bin/sh ../libtool --mode=compile i686-pld-linux-gcc -c -o ZWait4Not.lo -O2 -fwrapv -pipe -Wformat -Werror=format-security -gdwarf-4 -fno-debug-types-section -fvar-tracking-assignments -g2 -Wp,-D_FORTIFY_SOURCE=2 -fstack-protector-strong --param=ssp-buffer-size=4 -Werror=trampolines -fomit-frame-pointer -march=i686 -fasynchronous-unwind-tables -mtune=pentium4 -gdwarf-4 -fno-debug-types-section -fvar-tracking-assignments -g2 -O -DSYSCONFDIR=\"/etc\" -I../h -I../h ZWait4Not.c libtool: compile: i686-pld-linux-gcc -c -O2 -fwrapv -pipe -Wformat -Werror=format-security -gdwarf-4 -fno-debug-types-section -fvar-tracking-assignments -g2 -Wp,-D_FORTIFY_SOURCE=2 -fstack-protector-strong --param=ssp-buffer-size=4 -Werror=trampolines -fomit-frame-pointer -march=i686 -fasynchronous-unwind-tables -mtune=pentium4 -gdwarf-4 -fno-debug-types-section -fvar-tracking-assignments -g2 -O -DSYSCONFDIR=\"/etc\" -I../h -I../h ZWait4Not.c -fPIC -DPIC -o .libs/ZWait4Not.o libtool: compile: i686-pld-linux-gcc -c -O2 -fwrapv -pipe -Wformat -Werror=format-security -gdwarf-4 -fno-debug-types-section -fvar-tracking-assignments -g2 -Wp,-D_FORTIFY_SOURCE=2 -fstack-protector-strong --param=ssp-buffer-size=4 -Werror=trampolines -fomit-frame-pointer -march=i686 -fasynchronous-unwind-tables -mtune=pentium4 -gdwarf-4 -fno-debug-types-section -fvar-tracking-assignments -g2 -O -DSYSCONFDIR=\"/etc\" -I../h -I../h ZWait4Not.c -o ZWait4Not.o >/dev/null 2>&1 make[2]: Leaving directory '/tmp/B.o_glf5h0/BUILD/zephyr-3.1.2/lib' make[2]: Entering directory '/tmp/B.o_glf5h0/BUILD/zephyr-3.1.2/lib' /bin/sh ../libtool --mode=compile i686-pld-linux-gcc -c -o ZReadZcode.lo -O2 -fwrapv -pipe -Wformat -Werror=format-security -gdwarf-4 -fno-debug-types-section -fvar-tracking-assignments -g2 -Wp,-D_FORTIFY_SOURCE=2 -fstack-protector-strong --param=ssp-buffer-size=4 -Werror=trampolines -fomit-frame-pointer -march=i686 -fasynchronous-unwind-tables -mtune=pentium4 -gdwarf-4 -fno-debug-types-section -fvar-tracking-assignments -g2 -O -DSYSCONFDIR=\"/etc\" -I../h -I../h ZReadZcode.c libtool: compile: i686-pld-linux-gcc -c -O2 -fwrapv -pipe -Wformat -Werror=format-security -gdwarf-4 -fno-debug-types-section -fvar-tracking-assignments -g2 -Wp,-D_FORTIFY_SOURCE=2 -fstack-protector-strong --param=ssp-buffer-size=4 -Werror=trampolines -fomit-frame-pointer -march=i686 -fasynchronous-unwind-tables -mtune=pentium4 -gdwarf-4 -fno-debug-types-section -fvar-tracking-assignments -g2 -O -DSYSCONFDIR=\"/etc\" -I../h -I../h ZReadZcode.c -fPIC -DPIC -o .libs/ZReadZcode.o libtool: compile: i686-pld-linux-gcc -c -O2 -fwrapv -pipe -Wformat -Werror=format-security -gdwarf-4 -fno-debug-types-section -fvar-tracking-assignments -g2 -Wp,-D_FORTIFY_SOURCE=2 -fstack-protector-strong --param=ssp-buffer-size=4 -Werror=trampolines -fomit-frame-pointer -march=i686 -fasynchronous-unwind-tables -mtune=pentium4 -gdwarf-4 -fno-debug-types-section -fvar-tracking-assignments -g2 -O -DSYSCONFDIR=\"/etc\" -I../h -I../h ZReadZcode.c -o ZReadZcode.o >/dev/null 2>&1 make[2]: Leaving directory '/tmp/B.o_glf5h0/BUILD/zephyr-3.1.2/lib' make[2]: Entering directory '/tmp/B.o_glf5h0/BUILD/zephyr-3.1.2/lib' /bin/sh ../libtool --mode=compile i686-pld-linux-gcc -c -o ZSubs.lo -O2 -fwrapv -pipe -Wformat -Werror=format-security -gdwarf-4 -fno-debug-types-section -fvar-tracking-assignments -g2 -Wp,-D_FORTIFY_SOURCE=2 -fstack-protector-strong --param=ssp-buffer-size=4 -Werror=trampolines -fomit-frame-pointer -march=i686 -fasynchronous-unwind-tables -mtune=pentium4 -gdwarf-4 -fno-debug-types-section -fvar-tracking-assignments -g2 -O -DSYSCONFDIR=\"/etc\" -I../h -I../h ZSubs.c libtool: compile: i686-pld-linux-gcc -c -O2 -fwrapv -pipe -Wformat -Werror=format-security -gdwarf-4 -fno-debug-types-section -fvar-tracking-assignments -g2 -Wp,-D_FORTIFY_SOURCE=2 -fstack-protector-strong --param=ssp-buffer-size=4 -Werror=trampolines -fomit-frame-pointer -march=i686 -fasynchronous-unwind-tables -mtune=pentium4 -gdwarf-4 -fno-debug-types-section -fvar-tracking-assignments -g2 -O -DSYSCONFDIR=\"/etc\" -I../h -I../h ZSubs.c -fPIC -DPIC -o .libs/ZSubs.o libtool: compile: i686-pld-linux-gcc -c -O2 -fwrapv -pipe -Wformat -Werror=format-security -gdwarf-4 -fno-debug-types-section -fvar-tracking-assignments -g2 -Wp,-D_FORTIFY_SOURCE=2 -fstack-protector-strong --param=ssp-buffer-size=4 -Werror=trampolines -fomit-frame-pointer -march=i686 -fasynchronous-unwind-tables -mtune=pentium4 -gdwarf-4 -fno-debug-types-section -fvar-tracking-assignments -g2 -O -DSYSCONFDIR=\"/etc\" -I../h -I../h ZSubs.c -o ZSubs.o >/dev/null 2>&1 make[2]: Leaving directory '/tmp/B.o_glf5h0/BUILD/zephyr-3.1.2/lib' make[2]: Entering directory '/tmp/B.o_glf5h0/BUILD/zephyr-3.1.2/lib' /bin/sh ../libtool --mode=compile i686-pld-linux-gcc -c -o ZVariables.lo -O2 -fwrapv -pipe -Wformat -Werror=format-security -gdwarf-4 -fno-debug-types-section -fvar-tracking-assignments -g2 -Wp,-D_FORTIFY_SOURCE=2 -fstack-protector-strong --param=ssp-buffer-size=4 -Werror=trampolines -fomit-frame-pointer -march=i686 -fasynchronous-unwind-tables -mtune=pentium4 -gdwarf-4 -fno-debug-types-section -fvar-tracking-assignments -g2 -O -DSYSCONFDIR=\"/etc\" -I../h -I../h ZVariables.c libtool: compile: i686-pld-linux-gcc -c -O2 -fwrapv -pipe -Wformat -Werror=format-security -gdwarf-4 -fno-debug-types-section -fvar-tracking-assignments -g2 -Wp,-D_FORTIFY_SOURCE=2 -fstack-protector-strong --param=ssp-buffer-size=4 -Werror=trampolines -fomit-frame-pointer -march=i686 -fasynchronous-unwind-tables -mtune=pentium4 -gdwarf-4 -fno-debug-types-section -fvar-tracking-assignments -g2 -O -DSYSCONFDIR=\"/etc\" -I../h -I../h ZVariables.c -fPIC -DPIC -o .libs/ZVariables.o libtool: compile: i686-pld-linux-gcc -c -O2 -fwrapv -pipe -Wformat -Werror=format-security -gdwarf-4 -fno-debug-types-section -fvar-tracking-assignments -g2 -Wp,-D_FORTIFY_SOURCE=2 -fstack-protector-strong --param=ssp-buffer-size=4 -Werror=trampolines -fomit-frame-pointer -march=i686 -fasynchronous-unwind-tables -mtune=pentium4 -gdwarf-4 -fno-debug-types-section -fvar-tracking-assignments -g2 -O -DSYSCONFDIR=\"/etc\" -I../h -I../h ZVariables.c -o ZVariables.o >/dev/null 2>&1 make[2]: Leaving directory '/tmp/B.o_glf5h0/BUILD/zephyr-3.1.2/lib' make[2]: Entering directory '/tmp/B.o_glf5h0/BUILD/zephyr-3.1.2/lib' /bin/sh ../libtool --mode=compile i686-pld-linux-gcc -c -o ZMakeZcode.lo -O2 -fwrapv -pipe -Wformat -Werror=format-security -gdwarf-4 -fno-debug-types-section -fvar-tracking-assignments -g2 -Wp,-D_FORTIFY_SOURCE=2 -fstack-protector-strong --param=ssp-buffer-size=4 -Werror=trampolines -fomit-frame-pointer -march=i686 -fasynchronous-unwind-tables -mtune=pentium4 -gdwarf-4 -fno-debug-types-section -fvar-tracking-assignments -g2 -O -DSYSCONFDIR=\"/etc\" -I../h -I../h ZMakeZcode.c libtool: compile: i686-pld-linux-gcc -c -O2 -fwrapv -pipe -Wformat -Werror=format-security -gdwarf-4 -fno-debug-types-section -fvar-tracking-assignments -g2 -Wp,-D_FORTIFY_SOURCE=2 -fstack-protector-strong --param=ssp-buffer-size=4 -Werror=trampolines -fomit-frame-pointer -march=i686 -fasynchronous-unwind-tables -mtune=pentium4 -gdwarf-4 -fno-debug-types-section -fvar-tracking-assignments -g2 -O -DSYSCONFDIR=\"/etc\" -I../h -I../h ZMakeZcode.c -fPIC -DPIC -o .libs/ZMakeZcode.o libtool: compile: i686-pld-linux-gcc -c -O2 -fwrapv -pipe -Wformat -Werror=format-security -gdwarf-4 -fno-debug-types-section -fvar-tracking-assignments -g2 -Wp,-D_FORTIFY_SOURCE=2 -fstack-protector-strong --param=ssp-buffer-size=4 -Werror=trampolines -fomit-frame-pointer -march=i686 -fasynchronous-unwind-tables -mtune=pentium4 -gdwarf-4 -fno-debug-types-section -fvar-tracking-assignments -g2 -O -DSYSCONFDIR=\"/etc\" -I../h -I../h ZMakeZcode.c -o ZMakeZcode.o >/dev/null 2>&1 make[2]: Leaving directory '/tmp/B.o_glf5h0/BUILD/zephyr-3.1.2/lib' make[2]: Entering directory '/tmp/B.o_glf5h0/BUILD/zephyr-3.1.2/lib' /bin/sh ../libtool --mode=compile i686-pld-linux-gcc -c -o quad_cksum.lo -O2 -fwrapv -pipe -Wformat -Werror=format-security -gdwarf-4 -fno-debug-types-section -fvar-tracking-assignments -g2 -Wp,-D_FORTIFY_SOURCE=2 -fstack-protector-strong --param=ssp-buffer-size=4 -Werror=trampolines -fomit-frame-pointer -march=i686 -fasynchronous-unwind-tables -mtune=pentium4 -gdwarf-4 -fno-debug-types-section -fvar-tracking-assignments -g2 -O -DSYSCONFDIR=\"/etc\" -I../h -I../h quad_cksum.c libtool: compile: i686-pld-linux-gcc -c -O2 -fwrapv -pipe -Wformat -Werror=format-security -gdwarf-4 -fno-debug-types-section -fvar-tracking-assignments -g2 -Wp,-D_FORTIFY_SOURCE=2 -fstack-protector-strong --param=ssp-buffer-size=4 -Werror=trampolines -fomit-frame-pointer -march=i686 -fasynchronous-unwind-tables -mtune=pentium4 -gdwarf-4 -fno-debug-types-section -fvar-tracking-assignments -g2 -O -DSYSCONFDIR=\"/etc\" -I../h -I../h quad_cksum.c -fPIC -DPIC -o .libs/quad_cksum.o libtool: compile: i686-pld-linux-gcc -c -O2 -fwrapv -pipe -Wformat -Werror=format-security -gdwarf-4 -fno-debug-types-section -fvar-tracking-assignments -g2 -Wp,-D_FORTIFY_SOURCE=2 -fstack-protector-strong --param=ssp-buffer-size=4 -Werror=trampolines -fomit-frame-pointer -march=i686 -fasynchronous-unwind-tables -mtune=pentium4 -gdwarf-4 -fno-debug-types-section -fvar-tracking-assignments -g2 -O -DSYSCONFDIR=\"/etc\" -I../h -I../h quad_cksum.c -o quad_cksum.o >/dev/null 2>&1 make[2]: Leaving directory '/tmp/B.o_glf5h0/BUILD/zephyr-3.1.2/lib' make[2]: Entering directory '/tmp/B.o_glf5h0/BUILD/zephyr-3.1.2/lib' /bin/sh ../libtool --mode=compile i686-pld-linux-gcc -c -o ZCkZAut.lo -O2 -fwrapv -pipe -Wformat -Werror=format-security -gdwarf-4 -fno-debug-types-section -fvar-tracking-assignments -g2 -Wp,-D_FORTIFY_SOURCE=2 -fstack-protector-strong --param=ssp-buffer-size=4 -Werror=trampolines -fomit-frame-pointer -march=i686 -fasynchronous-unwind-tables -mtune=pentium4 -gdwarf-4 -fno-debug-types-section -fvar-tracking-assignments -g2 -O -DSYSCONFDIR=\"/etc\" -I../h -I../h ZCkZAut.c libtool: compile: i686-pld-linux-gcc -c -O2 -fwrapv -pipe -Wformat -Werror=format-security -gdwarf-4 -fno-debug-types-section -fvar-tracking-assignments -g2 -Wp,-D_FORTIFY_SOURCE=2 -fstack-protector-strong --param=ssp-buffer-size=4 -Werror=trampolines -fomit-frame-pointer -march=i686 -fasynchronous-unwind-tables -mtune=pentium4 -gdwarf-4 -fno-debug-types-section -fvar-tracking-assignments -g2 -O -DSYSCONFDIR=\"/etc\" -I../h -I../h ZCkZAut.c -fPIC -DPIC -o .libs/ZCkZAut.o libtool: compile: i686-pld-linux-gcc -c -O2 -fwrapv -pipe -Wformat -Werror=format-security -gdwarf-4 -fno-debug-types-section -fvar-tracking-assignments -g2 -Wp,-D_FORTIFY_SOURCE=2 -fstack-protector-strong --param=ssp-buffer-size=4 -Werror=trampolines -fomit-frame-pointer -march=i686 -fasynchronous-unwind-tables -mtune=pentium4 -gdwarf-4 -fno-debug-types-section -fvar-tracking-assignments -g2 -O -DSYSCONFDIR=\"/etc\" -I../h -I../h ZCkZAut.c -o ZCkZAut.o >/dev/null 2>&1 make[2]: Leaving directory '/tmp/B.o_glf5h0/BUILD/zephyr-3.1.2/lib' make[2]: Entering directory '/tmp/B.o_glf5h0/BUILD/zephyr-3.1.2/lib' /bin/sh ../libtool --mode=compile i686-pld-linux-gcc -c -o ZExpnRlm.lo -O2 -fwrapv -pipe -Wformat -Werror=format-security -gdwarf-4 -fno-debug-types-section -fvar-tracking-assignments -g2 -Wp,-D_FORTIFY_SOURCE=2 -fstack-protector-strong --param=ssp-buffer-size=4 -Werror=trampolines -fomit-frame-pointer -march=i686 -fasynchronous-unwind-tables -mtune=pentium4 -gdwarf-4 -fno-debug-types-section -fvar-tracking-assignments -g2 -O -DSYSCONFDIR=\"/etc\" -I../h -I../h ZExpnRlm.c libtool: compile: i686-pld-linux-gcc -c -O2 -fwrapv -pipe -Wformat -Werror=format-security -gdwarf-4 -fno-debug-types-section -fvar-tracking-assignments -g2 -Wp,-D_FORTIFY_SOURCE=2 -fstack-protector-strong --param=ssp-buffer-size=4 -Werror=trampolines -fomit-frame-pointer -march=i686 -fasynchronous-unwind-tables -mtune=pentium4 -gdwarf-4 -fno-debug-types-section -fvar-tracking-assignments -g2 -O -DSYSCONFDIR=\"/etc\" -I../h -I../h ZExpnRlm.c -fPIC -DPIC -o .libs/ZExpnRlm.o libtool: compile: i686-pld-linux-gcc -c -O2 -fwrapv -pipe -Wformat -Werror=format-security -gdwarf-4 -fno-debug-types-section -fvar-tracking-assignments -g2 -Wp,-D_FORTIFY_SOURCE=2 -fstack-protector-strong --param=ssp-buffer-size=4 -Werror=trampolines -fomit-frame-pointer -march=i686 -fasynchronous-unwind-tables -mtune=pentium4 -gdwarf-4 -fno-debug-types-section -fvar-tracking-assignments -g2 -O -DSYSCONFDIR=\"/etc\" -I../h -I../h ZExpnRlm.c -o ZExpnRlm.o >/dev/null 2>&1 make[2]: Leaving directory '/tmp/B.o_glf5h0/BUILD/zephyr-3.1.2/lib' make[2]: Entering directory '/tmp/B.o_glf5h0/BUILD/zephyr-3.1.2/lib' /bin/sh ../libtool --mode=compile i686-pld-linux-gcc -c -o charset.lo -O2 -fwrapv -pipe -Wformat -Werror=format-security -gdwarf-4 -fno-debug-types-section -fvar-tracking-assignments -g2 -Wp,-D_FORTIFY_SOURCE=2 -fstack-protector-strong --param=ssp-buffer-size=4 -Werror=trampolines -fomit-frame-pointer -march=i686 -fasynchronous-unwind-tables -mtune=pentium4 -gdwarf-4 -fno-debug-types-section -fvar-tracking-assignments -g2 -O -DSYSCONFDIR=\"/etc\" -I../h -I../h charset.c libtool: compile: i686-pld-linux-gcc -c -O2 -fwrapv -pipe -Wformat -Werror=format-security -gdwarf-4 -fno-debug-types-section -fvar-tracking-assignments -g2 -Wp,-D_FORTIFY_SOURCE=2 -fstack-protector-strong --param=ssp-buffer-size=4 -Werror=trampolines -fomit-frame-pointer -march=i686 -fasynchronous-unwind-tables -mtune=pentium4 -gdwarf-4 -fno-debug-types-section -fvar-tracking-assignments -g2 -O -DSYSCONFDIR=\"/etc\" -I../h -I../h charset.c -fPIC -DPIC -o .libs/charset.o libtool: compile: i686-pld-linux-gcc -c -O2 -fwrapv -pipe -Wformat -Werror=format-security -gdwarf-4 -fno-debug-types-section -fvar-tracking-assignments -g2 -Wp,-D_FORTIFY_SOURCE=2 -fstack-protector-strong --param=ssp-buffer-size=4 -Werror=trampolines -fomit-frame-pointer -march=i686 -fasynchronous-unwind-tables -mtune=pentium4 -gdwarf-4 -fno-debug-types-section -fvar-tracking-assignments -g2 -O -DSYSCONFDIR=\"/etc\" -I../h -I../h charset.c -o charset.o >/dev/null 2>&1 make[2]: Leaving directory '/tmp/B.o_glf5h0/BUILD/zephyr-3.1.2/lib' make[2]: Entering directory '/tmp/B.o_glf5h0/BUILD/zephyr-3.1.2/lib' /bin/sh ../libtool --mode=compile i686-pld-linux-gcc -c -o ZDumpSession.lo -O2 -fwrapv -pipe -Wformat -Werror=format-security -gdwarf-4 -fno-debug-types-section -fvar-tracking-assignments -g2 -Wp,-D_FORTIFY_SOURCE=2 -fstack-protector-strong --param=ssp-buffer-size=4 -Werror=trampolines -fomit-frame-pointer -march=i686 -fasynchronous-unwind-tables -mtune=pentium4 -gdwarf-4 -fno-debug-types-section -fvar-tracking-assignments -g2 -O -DSYSCONFDIR=\"/etc\" -I../h -I../h ZDumpSession.c libtool: compile: i686-pld-linux-gcc -c -O2 -fwrapv -pipe -Wformat -Werror=format-security -gdwarf-4 -fno-debug-types-section -fvar-tracking-assignments -g2 -Wp,-D_FORTIFY_SOURCE=2 -fstack-protector-strong --param=ssp-buffer-size=4 -Werror=trampolines -fomit-frame-pointer -march=i686 -fasynchronous-unwind-tables -mtune=pentium4 -gdwarf-4 -fno-debug-types-section -fvar-tracking-assignments -g2 -O -DSYSCONFDIR=\"/etc\" -I../h -I../h ZDumpSession.c -fPIC -DPIC -o .libs/ZDumpSession.o libtool: compile: i686-pld-linux-gcc -c -O2 -fwrapv -pipe -Wformat -Werror=format-security -gdwarf-4 -fno-debug-types-section -fvar-tracking-assignments -g2 -Wp,-D_FORTIFY_SOURCE=2 -fstack-protector-strong --param=ssp-buffer-size=4 -Werror=trampolines -fomit-frame-pointer -march=i686 -fasynchronous-unwind-tables -mtune=pentium4 -gdwarf-4 -fno-debug-types-section -fvar-tracking-assignments -g2 -O -DSYSCONFDIR=\"/etc\" -I../h -I../h ZDumpSession.c -o ZDumpSession.o >/dev/null 2>&1 make[2]: Leaving directory '/tmp/B.o_glf5h0/BUILD/zephyr-3.1.2/lib' make[2]: Entering directory '/tmp/B.o_glf5h0/BUILD/zephyr-3.1.2/lib' /bin/sh ../libtool --mode=compile i686-pld-linux-gcc -c -o Zinternal.lo -O2 -fwrapv -pipe -Wformat -Werror=format-security -gdwarf-4 -fno-debug-types-section -fvar-tracking-assignments -g2 -Wp,-D_FORTIFY_SOURCE=2 -fstack-protector-strong --param=ssp-buffer-size=4 -Werror=trampolines -fomit-frame-pointer -march=i686 -fasynchronous-unwind-tables -mtune=pentium4 -gdwarf-4 -fno-debug-types-section -fvar-tracking-assignments -g2 -O -DSYSCONFDIR=\"/etc\" -I../h -I../h Zinternal.c libtool: compile: i686-pld-linux-gcc -c -O2 -fwrapv -pipe -Wformat -Werror=format-security -gdwarf-4 -fno-debug-types-section -fvar-tracking-assignments -g2 -Wp,-D_FORTIFY_SOURCE=2 -fstack-protector-strong --param=ssp-buffer-size=4 -Werror=trampolines -fomit-frame-pointer -march=i686 -fasynchronous-unwind-tables -mtune=pentium4 -gdwarf-4 -fno-debug-types-section -fvar-tracking-assignments -g2 -O -DSYSCONFDIR=\"/etc\" -I../h -I../h Zinternal.c -fPIC -DPIC -o .libs/Zinternal.o libtool: compile: i686-pld-linux-gcc -c -O2 -fwrapv -pipe -Wformat -Werror=format-security -gdwarf-4 -fno-debug-types-section -fvar-tracking-assignments -g2 -Wp,-D_FORTIFY_SOURCE=2 -fstack-protector-strong --param=ssp-buffer-size=4 -Werror=trampolines -fomit-frame-pointer -march=i686 -fasynchronous-unwind-tables -mtune=pentium4 -gdwarf-4 -fno-debug-types-section -fvar-tracking-assignments -g2 -O -DSYSCONFDIR=\"/etc\" -I../h -I../h Zinternal.c -o Zinternal.o >/dev/null 2>&1 make[2]: Leaving directory '/tmp/B.o_glf5h0/BUILD/zephyr-3.1.2/lib' make[2]: Entering directory '/tmp/B.o_glf5h0/BUILD/zephyr-3.1.2/lib' /bin/sh ../libtool --mode=link i686-pld-linux-gcc -rpath /usr/lib -version-info 4:0:0 \ -Wl,--as-needed -Wl,--no-copy-dt-needed-entries -Wl,-z,relro -Wl,-z,combreloc -o libzephyr.la zephyr_err.lo ZAsyncLocate.lo ZCkAuth.lo ZCkIfNot.lo ZClosePort.lo ZCmpUID.lo ZCmpUIDP.lo ZFlsLocs.lo ZFlsSubs.lo ZFmtAuth.lo ZFmtList.lo ZFmtNotice.lo ZFmtRaw.lo ZFmtRawLst.lo ZFmtSmRLst.lo ZFmtSmRaw.lo ZFreeNot.lo ZGetLocs.lo ZGetSender.lo ZGetSubs.lo ZGetWGPort.lo ZhmStat.lo ZIfNotice.lo ZInit.lo ZLocations.lo ZMakeAscii.lo ZMkAuth.lo ZNewLocU.lo ZOpenPort.lo ZParseNot.lo ZPeekIfNot.lo ZPeekNot.lo ZPeekPkt.lo ZPending.lo ZReadAscii.lo ZRecvNot.lo ZRecvPkt.lo ZRetSubs.lo ZSendList.lo ZSendNot.lo ZSendPkt.lo ZSendRaw.lo ZSendRLst.lo ZSetDest.lo ZSetFD.lo ZSetSrv.lo ZSubs.lo ZVariables.lo ZWait4Not.lo Zinternal.lo ZMakeZcode.lo ZReadZcode.lo ZCkZAut.lo quad_cksum.lo charset.lo ZExpnRlm.lo ZDumpSession.lo -lkrb5 -lcom_err libtool: link: i686-pld-linux-gcc -shared -fPIC -DPIC -Wl,--as-needed -Wl,--no-copy-dt-needed-entries -Wl,-z -Wl,relro -Wl,-z -Wl,combreloc -pthread .libs/zephyr_err.o .libs/ZAsyncLocate.o .libs/ZCkAuth.o .libs/ZCkIfNot.o .libs/ZClosePort.o .libs/ZCmpUID.o .libs/ZCmpUIDP.o .libs/ZFlsLocs.o .libs/ZFlsSubs.o .libs/ZFmtAuth.o .libs/ZFmtList.o .libs/ZFmtNotice.o .libs/ZFmtRaw.o .libs/ZFmtRawLst.o .libs/ZFmtSmRLst.o .libs/ZFmtSmRaw.o .libs/ZFreeNot.o .libs/ZGetLocs.o .libs/ZGetSender.o .libs/ZGetSubs.o .libs/ZGetWGPort.o .libs/ZhmStat.o .libs/ZIfNotice.o .libs/ZInit.o .libs/ZLocations.o .libs/ZMakeAscii.o .libs/ZMkAuth.o .libs/ZNewLocU.o .libs/ZOpenPort.o .libs/ZParseNot.o .libs/ZPeekIfNot.o .libs/ZPeekNot.o .libs/ZPeekPkt.o .libs/ZPending.o .libs/ZReadAscii.o .libs/ZRecvNot.o .libs/ZRecvPkt.o .libs/ZRetSubs.o .libs/ZSendList.o .libs/ZSendNot.o .libs/ZSendPkt.o .libs/ZSendRaw.o .libs/ZSendRLst.o .libs/ZSetDest.o .libs/ZSetFD.o .libs/ZSetSrv.o .libs/ZSubs.o .libs/ZVariables.o .libs/ZWait4Not.o .libs/Zinternal.o .libs/ZMakeZcode.o .libs/ZReadZcode.o .libs/ZCkZAut.o .libs/quad_cksum.o .libs/charset.o .libs/ZExpnRlm.o .libs/ZDumpSession.o /usr/lib/libkrb5.so -L/usr/lib /usr/lib/libhx509.so /usr/lib/libwind.so /usr/lib/libsqlite3.so -lm -lz -ldl /usr/lib/libhcrypto.so /usr/lib/libasn1.so /usr/lib/libheimbase.so -lcrypto /usr/lib/libroken.so -lcrypt -lpthread -lcom_err -Wl,-soname -Wl,libzephyr.so.4 -o .libs/libzephyr.so.4.0.0 libtool: link: (cd ".libs" && rm -f "libzephyr.so.4" && ln -s "libzephyr.so.4.0.0" "libzephyr.so.4") libtool: link: (cd ".libs" && rm -f "libzephyr.so" && ln -s "libzephyr.so.4.0.0" "libzephyr.so") libtool: link: ar cru .libs/libzephyr.a zephyr_err.o ZAsyncLocate.o ZCkAuth.o ZCkIfNot.o ZClosePort.o ZCmpUID.o ZCmpUIDP.o ZFlsLocs.o ZFlsSubs.o ZFmtAuth.o ZFmtList.o ZFmtNotice.o ZFmtRaw.o ZFmtRawLst.o ZFmtSmRLst.o ZFmtSmRaw.o ZFreeNot.o ZGetLocs.o ZGetSender.o ZGetSubs.o ZGetWGPort.o ZhmStat.o ZIfNotice.o ZInit.o ZLocations.o ZMakeAscii.o ZMkAuth.o ZNewLocU.o ZOpenPort.o ZParseNot.o ZPeekIfNot.o ZPeekNot.o ZPeekPkt.o ZPending.o ZReadAscii.o ZRecvNot.o ZRecvPkt.o ZRetSubs.o ZSendList.o ZSendNot.o ZSendPkt.o ZSendRaw.o ZSendRLst.o ZSetDest.o ZSetFD.o ZSetSrv.o ZSubs.o ZVariables.o ZWait4Not.o Zinternal.o ZMakeZcode.o ZReadZcode.o ZCkZAut.o quad_cksum.o charset.o ZExpnRlm.o ZDumpSession.o libtool: link: ranlib .libs/libzephyr.a libtool: link: ( cd ".libs" && rm -f "libzephyr.la" && ln -s "../libzephyr.la" "libzephyr.la" ) make[2]: Leaving directory '/tmp/B.o_glf5h0/BUILD/zephyr-3.1.2/lib' for i in zaway zctl zleave zlocate znol zshutdown_notify zstat zwrite; do (cd $i; /usr/bin/make all) || exit 1; done make[3]: Entering directory '/tmp/B.o_glf5h0/BUILD/zephyr-3.1.2/clients/zaway' i686-pld-linux-gcc -c -O2 -fwrapv -pipe -Wformat -Werror=format-security -gdwarf-4 -fno-debug-types-section -fvar-tracking-assignments -g2 -Wp,-D_FORTIFY_SOURCE=2 -fstack-protector-strong --param=ssp-buffer-size=4 -Werror=trampolines -fomit-frame-pointer -march=i686 -fasynchronous-unwind-tables -mtune=pentium4 -gdwarf-4 -fno-debug-types-section -fvar-tracking-assignments -g2 -I../../h -I../../h zaway.c make[3]: Leaving directory '/tmp/B.o_glf5h0/BUILD/zephyr-3.1.2/clients/zaway' make[3]: Entering directory '/tmp/B.o_glf5h0/BUILD/zephyr-3.1.2/clients/zaway' /bin/sh ../../libtool --mode=link i686-pld-linux-gcc -Wl,--as-needed -Wl,--no-copy-dt-needed-entries -Wl,-z,relro -Wl,-z,combreloc -o zaway zaway.o ../../lib/libzephyr.la -lkrb5 -lcom_err libtool: link: i686-pld-linux-gcc -Wl,--as-needed -Wl,--no-copy-dt-needed-entries -Wl,-z -Wl,relro -Wl,-z -Wl,combreloc -o .libs/zaway zaway.o ../../lib/.libs/libzephyr.so /usr/lib/libkrb5.so /usr/lib/libhx509.so /usr/lib/libwind.so /usr/lib/libsqlite3.so -lm -lz -ldl /usr/lib/libhcrypto.so /usr/lib/libasn1.so /usr/lib/libheimbase.so -lcrypto /usr/lib/libroken.so -lcrypt -lpthread -lcom_err -pthread make[3]: Leaving directory '/tmp/B.o_glf5h0/BUILD/zephyr-3.1.2/clients/zaway' make[3]: Entering directory '/tmp/B.o_glf5h0/BUILD/zephyr-3.1.2/clients/zctl' sed -e 's|@datadir[@]|/usr/share|g' -e 's|@sysconfdir[@]|/etc|g' -e 's|@sbindir[@]|/usr/sbin|g' -e 's|@lsbindir[@]|/usr/sbin|g' ./zctl.1.in > zctl.1.tmp mv zctl.1.tmp zctl.1 make[3]: Leaving directory '/tmp/B.o_glf5h0/BUILD/zephyr-3.1.2/clients/zctl' make[3]: Entering directory '/tmp/B.o_glf5h0/BUILD/zephyr-3.1.2/clients/zctl' mk_cmds ./zctl_cmds.ct make[3]: Leaving directory '/tmp/B.o_glf5h0/BUILD/zephyr-3.1.2/clients/zctl' make[3]: Entering directory '/tmp/B.o_glf5h0/BUILD/zephyr-3.1.2/clients/zctl' i686-pld-linux-gcc -c -O2 -fwrapv -pipe -Wformat -Werror=format-security -gdwarf-4 -fno-debug-types-section -fvar-tracking-assignments -g2 -Wp,-D_FORTIFY_SOURCE=2 -fstack-protector-strong --param=ssp-buffer-size=4 -Werror=trampolines -fomit-frame-pointer -march=i686 -fasynchronous-unwind-tables -mtune=pentium4 -gdwarf-4 -fno-debug-types-section -fvar-tracking-assignments -g2 -I../../h -I../../h zctl_cmds.c make[3]: Leaving directory '/tmp/B.o_glf5h0/BUILD/zephyr-3.1.2/clients/zctl' make[3]: Entering directory '/tmp/B.o_glf5h0/BUILD/zephyr-3.1.2/clients/zctl' i686-pld-linux-gcc -c -O2 -fwrapv -pipe -Wformat -Werror=format-security -gdwarf-4 -fno-debug-types-section -fvar-tracking-assignments -g2 -Wp,-D_FORTIFY_SOURCE=2 -fstack-protector-strong --param=ssp-buffer-size=4 -Werror=trampolines -fomit-frame-pointer -march=i686 -fasynchronous-unwind-tables -mtune=pentium4 -gdwarf-4 -fno-debug-types-section -fvar-tracking-assignments -g2 -I../../h -I../../h zctl.c make[3]: Leaving directory '/tmp/B.o_glf5h0/BUILD/zephyr-3.1.2/clients/zctl' make[3]: Entering directory '/tmp/B.o_glf5h0/BUILD/zephyr-3.1.2/clients/zctl' /bin/sh ../../libtool --mode=link i686-pld-linux-gcc -Wl,--as-needed -Wl,--no-copy-dt-needed-entries -Wl,-z,relro -Wl,-z,combreloc -o zctl zctl.o zctl_cmds.o ../../lib/libzephyr.la -lss -lkrb5 -lcom_err libtool: link: i686-pld-linux-gcc -Wl,--as-needed -Wl,--no-copy-dt-needed-entries -Wl,-z -Wl,relro -Wl,-z -Wl,combreloc -o .libs/zctl zctl.o zctl_cmds.o ../../lib/.libs/libzephyr.so -lss /usr/lib/libkrb5.so /usr/lib/libhx509.so /usr/lib/libwind.so /usr/lib/libsqlite3.so -lm -lz -ldl /usr/lib/libhcrypto.so /usr/lib/libasn1.so /usr/lib/libheimbase.so -lcrypto /usr/lib/libroken.so -lcrypt -lpthread -lcom_err -pthread make[3]: Leaving directory '/tmp/B.o_glf5h0/BUILD/zephyr-3.1.2/clients/zctl' make[3]: Entering directory '/tmp/B.o_glf5h0/BUILD/zephyr-3.1.2/clients/zleave' i686-pld-linux-gcc -c -O2 -fwrapv -pipe -Wformat -Werror=format-security -gdwarf-4 -fno-debug-types-section -fvar-tracking-assignments -g2 -Wp,-D_FORTIFY_SOURCE=2 -fstack-protector-strong --param=ssp-buffer-size=4 -Werror=trampolines -fomit-frame-pointer -march=i686 -fasynchronous-unwind-tables -mtune=pentium4 -gdwarf-4 -fno-debug-types-section -fvar-tracking-assignments -g2 -I../../h -I../../h zleave.c make[3]: Leaving directory '/tmp/B.o_glf5h0/BUILD/zephyr-3.1.2/clients/zleave' make[3]: Entering directory '/tmp/B.o_glf5h0/BUILD/zephyr-3.1.2/clients/zleave' /bin/sh ../../libtool --mode=link i686-pld-linux-gcc -Wl,--as-needed -Wl,--no-copy-dt-needed-entries -Wl,-z,relro -Wl,-z,combreloc -o zleave zleave.o ../../lib/libzephyr.la -lkrb5 -lcom_err libtool: link: i686-pld-linux-gcc -Wl,--as-needed -Wl,--no-copy-dt-needed-entries -Wl,-z -Wl,relro -Wl,-z -Wl,combreloc -o .libs/zleave zleave.o ../../lib/.libs/libzephyr.so /usr/lib/libkrb5.so /usr/lib/libhx509.so /usr/lib/libwind.so /usr/lib/libsqlite3.so -lm -lz -ldl /usr/lib/libhcrypto.so /usr/lib/libasn1.so /usr/lib/libheimbase.so -lcrypto /usr/lib/libroken.so -lcrypt -lpthread -lcom_err -pthread make[3]: Leaving directory '/tmp/B.o_glf5h0/BUILD/zephyr-3.1.2/clients/zleave' make[3]: Entering directory '/tmp/B.o_glf5h0/BUILD/zephyr-3.1.2/clients/zlocate' i686-pld-linux-gcc -c -O2 -fwrapv -pipe -Wformat -Werror=format-security -gdwarf-4 -fno-debug-types-section -fvar-tracking-assignments -g2 -Wp,-D_FORTIFY_SOURCE=2 -fstack-protector-strong --param=ssp-buffer-size=4 -Werror=trampolines -fomit-frame-pointer -march=i686 -fasynchronous-unwind-tables -mtune=pentium4 -gdwarf-4 -fno-debug-types-section -fvar-tracking-assignments -g2 -I../../h -I../../h zlocate.c make[3]: Leaving directory '/tmp/B.o_glf5h0/BUILD/zephyr-3.1.2/clients/zlocate' make[3]: Entering directory '/tmp/B.o_glf5h0/BUILD/zephyr-3.1.2/clients/zlocate' /bin/sh ../../libtool --mode=link i686-pld-linux-gcc -Wl,--as-needed -Wl,--no-copy-dt-needed-entries -Wl,-z,relro -Wl,-z,combreloc -o zlocate zlocate.o ../../lib/libzephyr.la -lkrb5 -lcom_err libtool: link: i686-pld-linux-gcc -Wl,--as-needed -Wl,--no-copy-dt-needed-entries -Wl,-z -Wl,relro -Wl,-z -Wl,combreloc -o .libs/zlocate zlocate.o ../../lib/.libs/libzephyr.so /usr/lib/libkrb5.so /usr/lib/libhx509.so /usr/lib/libwind.so /usr/lib/libsqlite3.so -lm -lz -ldl /usr/lib/libhcrypto.so /usr/lib/libasn1.so /usr/lib/libheimbase.so -lcrypto /usr/lib/libroken.so -lcrypt -lpthread -lcom_err -pthread make[3]: Leaving directory '/tmp/B.o_glf5h0/BUILD/zephyr-3.1.2/clients/zlocate' make[3]: Entering directory '/tmp/B.o_glf5h0/BUILD/zephyr-3.1.2/clients/znol' i686-pld-linux-gcc -c -O2 -fwrapv -pipe -Wformat -Werror=format-security -gdwarf-4 -fno-debug-types-section -fvar-tracking-assignments -g2 -Wp,-D_FORTIFY_SOURCE=2 -fstack-protector-strong --param=ssp-buffer-size=4 -Werror=trampolines -fomit-frame-pointer -march=i686 -fasynchronous-unwind-tables -mtune=pentium4 -gdwarf-4 -fno-debug-types-section -fvar-tracking-assignments -g2 -I../../h -I../../h znol.c make[3]: Leaving directory '/tmp/B.o_glf5h0/BUILD/zephyr-3.1.2/clients/znol' make[3]: Entering directory '/tmp/B.o_glf5h0/BUILD/zephyr-3.1.2/clients/znol' /bin/sh ../../libtool --mode=link i686-pld-linux-gcc -Wl,--as-needed -Wl,--no-copy-dt-needed-entries -Wl,-z,relro -Wl,-z,combreloc -o znol znol.o ../../lib/libzephyr.la -lkrb5 -lcom_err libtool: link: i686-pld-linux-gcc -Wl,--as-needed -Wl,--no-copy-dt-needed-entries -Wl,-z -Wl,relro -Wl,-z -Wl,combreloc -o .libs/znol znol.o ../../lib/.libs/libzephyr.so /usr/lib/libkrb5.so /usr/lib/libhx509.so /usr/lib/libwind.so /usr/lib/libsqlite3.so -lm -lz -ldl /usr/lib/libhcrypto.so /usr/lib/libasn1.so /usr/lib/libheimbase.so -lcrypto /usr/lib/libroken.so -lcrypt -lpthread -lcom_err -pthread make[3]: Leaving directory '/tmp/B.o_glf5h0/BUILD/zephyr-3.1.2/clients/znol' make[3]: Entering directory '/tmp/B.o_glf5h0/BUILD/zephyr-3.1.2/clients/zshutdown_notify' i686-pld-linux-gcc -c -O2 -fwrapv -pipe -Wformat -Werror=format-security -gdwarf-4 -fno-debug-types-section -fvar-tracking-assignments -g2 -Wp,-D_FORTIFY_SOURCE=2 -fstack-protector-strong --param=ssp-buffer-size=4 -Werror=trampolines -fomit-frame-pointer -march=i686 -fasynchronous-unwind-tables -mtune=pentium4 -gdwarf-4 -fno-debug-types-section -fvar-tracking-assignments -g2 -I../../h -I../../h zshutdown_notify.c make[3]: Leaving directory '/tmp/B.o_glf5h0/BUILD/zephyr-3.1.2/clients/zshutdown_notify' make[3]: Entering directory '/tmp/B.o_glf5h0/BUILD/zephyr-3.1.2/clients/zshutdown_notify' /bin/sh ../../libtool --mode=link i686-pld-linux-gcc -Wl,--as-needed -Wl,--no-copy-dt-needed-entries -Wl,-z,relro -Wl,-z,combreloc -o zshutdown_notify zshutdown_notify.o ../../lib/libzephyr.la -lkrb5 -lcom_err libtool: link: i686-pld-linux-gcc -Wl,--as-needed -Wl,--no-copy-dt-needed-entries -Wl,-z -Wl,relro -Wl,-z -Wl,combreloc -o .libs/zshutdown_notify zshutdown_notify.o ../../lib/.libs/libzephyr.so /usr/lib/libkrb5.so /usr/lib/libhx509.so /usr/lib/libwind.so /usr/lib/libsqlite3.so -lm -lz -ldl /usr/lib/libhcrypto.so /usr/lib/libasn1.so /usr/lib/libheimbase.so -lcrypto /usr/lib/libroken.so -lcrypt -lpthread -lcom_err -pthread make[3]: Leaving directory '/tmp/B.o_glf5h0/BUILD/zephyr-3.1.2/clients/zshutdown_notify' make[3]: Entering directory '/tmp/B.o_glf5h0/BUILD/zephyr-3.1.2/clients/zstat' i686-pld-linux-gcc -c -O2 -fwrapv -pipe -Wformat -Werror=format-security -gdwarf-4 -fno-debug-types-section -fvar-tracking-assignments -g2 -Wp,-D_FORTIFY_SOURCE=2 -fstack-protector-strong --param=ssp-buffer-size=4 -Werror=trampolines -fomit-frame-pointer -march=i686 -fasynchronous-unwind-tables -mtune=pentium4 -gdwarf-4 -fno-debug-types-section -fvar-tracking-assignments -g2 -I../../h -I../../h zstat.c make[3]: Leaving directory '/tmp/B.o_glf5h0/BUILD/zephyr-3.1.2/clients/zstat' make[3]: Entering directory '/tmp/B.o_glf5h0/BUILD/zephyr-3.1.2/clients/zstat' /bin/sh ../../libtool --mode=link i686-pld-linux-gcc -Wl,--as-needed -Wl,--no-copy-dt-needed-entries -Wl,-z,relro -Wl,-z,combreloc -o zstat zstat.o ../../lib/libzephyr.la -lkrb5 -lcom_err libtool: link: i686-pld-linux-gcc -Wl,--as-needed -Wl,--no-copy-dt-needed-entries -Wl,-z -Wl,relro -Wl,-z -Wl,combreloc -o .libs/zstat zstat.o ../../lib/.libs/libzephyr.so /usr/lib/libkrb5.so /usr/lib/libhx509.so /usr/lib/libwind.so /usr/lib/libsqlite3.so -lm -lz -ldl /usr/lib/libhcrypto.so /usr/lib/libasn1.so /usr/lib/libheimbase.so -lcrypto /usr/lib/libroken.so -lcrypt -lpthread -lcom_err -pthread make[3]: Leaving directory '/tmp/B.o_glf5h0/BUILD/zephyr-3.1.2/clients/zstat' make[3]: Entering directory '/tmp/B.o_glf5h0/BUILD/zephyr-3.1.2/clients/zwrite' i686-pld-linux-gcc -c -O2 -fwrapv -pipe -Wformat -Werror=format-security -gdwarf-4 -fno-debug-types-section -fvar-tracking-assignments -g2 -Wp,-D_FORTIFY_SOURCE=2 -fstack-protector-strong --param=ssp-buffer-size=4 -Werror=trampolines -fomit-frame-pointer -march=i686 -fasynchronous-unwind-tables -mtune=pentium4 -gdwarf-4 -fno-debug-types-section -fvar-tracking-assignments -g2 -I../../h -I../../h zwrite.c make[3]: Leaving directory '/tmp/B.o_glf5h0/BUILD/zephyr-3.1.2/clients/zwrite' make[3]: Entering directory '/tmp/B.o_glf5h0/BUILD/zephyr-3.1.2/clients/zwrite' /bin/sh ../../libtool --mode=link i686-pld-linux-gcc -Wl,--as-needed -Wl,--no-copy-dt-needed-entries -Wl,-z,relro -Wl,-z,combreloc -o zwrite zwrite.o ../../lib/libzephyr.la -lkrb5 -lcom_err libtool: link: i686-pld-linux-gcc -Wl,--as-needed -Wl,--no-copy-dt-needed-entries -Wl,-z -Wl,relro -Wl,-z -Wl,combreloc -o .libs/zwrite zwrite.o ../../lib/.libs/libzephyr.so /usr/lib/libkrb5.so /usr/lib/libhx509.so /usr/lib/libwind.so /usr/lib/libsqlite3.so -lm -lz -ldl /usr/lib/libhcrypto.so /usr/lib/libasn1.so /usr/lib/libheimbase.so -lcrypto /usr/lib/libroken.so -lcrypt -lpthread -lcom_err -pthread make[3]: Leaving directory '/tmp/B.o_glf5h0/BUILD/zephyr-3.1.2/clients/zwrite' make[2]: Entering directory '/tmp/B.o_glf5h0/BUILD/zephyr-3.1.2/server' sed -e 's|@datadir[@]|/usr/share|g' -e 's|@sysconfdir[@]|/etc|g' -e 's|@sbindir[@]|/usr/sbin|g' -e 's|@lsbindir[@]|/usr/sbin|g' ./zephyrd.8.in > zephyrd.8.tmp mv zephyrd.8.tmp zephyrd.8 make[2]: Leaving directory '/tmp/B.o_glf5h0/BUILD/zephyr-3.1.2/server' make[2]: Entering directory '/tmp/B.o_glf5h0/BUILD/zephyr-3.1.2/server' compile_et ./zsrv_err.et make[2]: Leaving directory '/tmp/B.o_glf5h0/BUILD/zephyr-3.1.2/server' make[2]: Entering directory '/tmp/B.o_glf5h0/BUILD/zephyr-3.1.2/server' i686-pld-linux-gcc -c -O2 -fwrapv -pipe -Wformat -Werror=format-security -gdwarf-4 -fno-debug-types-section -fvar-tracking-assignments -g2 -Wp,-D_FORTIFY_SOURCE=2 -fstack-protector-strong --param=ssp-buffer-size=4 -Werror=trampolines -fomit-frame-pointer -march=i686 -fasynchronous-unwind-tables -mtune=pentium4 -gdwarf-4 -fno-debug-types-section -fvar-tracking-assignments -g2 -DSYSCONFDIR=\"/etc\" -I../h -I../h -I. zsrv_err.c make[2]: Leaving directory '/tmp/B.o_glf5h0/BUILD/zephyr-3.1.2/server' make[2]: Entering directory '/tmp/B.o_glf5h0/BUILD/zephyr-3.1.2/server' i686-pld-linux-gcc -c -O2 -fwrapv -pipe -Wformat -Werror=format-security -gdwarf-4 -fno-debug-types-section -fvar-tracking-assignments -g2 -Wp,-D_FORTIFY_SOURCE=2 -fstack-protector-strong --param=ssp-buffer-size=4 -Werror=trampolines -fomit-frame-pointer -march=i686 -fasynchronous-unwind-tables -mtune=pentium4 -gdwarf-4 -fno-debug-types-section -fvar-tracking-assignments -g2 -DSYSCONFDIR=\"/etc\" -I../h -I../h -I. access.c make[2]: Leaving directory '/tmp/B.o_glf5h0/BUILD/zephyr-3.1.2/server' make[2]: Entering directory '/tmp/B.o_glf5h0/BUILD/zephyr-3.1.2/server' i686-pld-linux-gcc -c -O2 -fwrapv -pipe -Wformat -Werror=format-security -gdwarf-4 -fno-debug-types-section -fvar-tracking-assignments -g2 -Wp,-D_FORTIFY_SOURCE=2 -fstack-protector-strong --param=ssp-buffer-size=4 -Werror=trampolines -fomit-frame-pointer -march=i686 -fasynchronous-unwind-tables -mtune=pentium4 -gdwarf-4 -fno-debug-types-section -fvar-tracking-assignments -g2 -DSYSCONFDIR=\"/etc\" -I../h -I../h -I. common.c make[2]: Leaving directory '/tmp/B.o_glf5h0/BUILD/zephyr-3.1.2/server' make[2]: Entering directory '/tmp/B.o_glf5h0/BUILD/zephyr-3.1.2/server' i686-pld-linux-gcc -c -O2 -fwrapv -pipe -Wformat -Werror=format-security -gdwarf-4 -fno-debug-types-section -fvar-tracking-assignments -g2 -Wp,-D_FORTIFY_SOURCE=2 -fstack-protector-strong --param=ssp-buffer-size=4 -Werror=trampolines -fomit-frame-pointer -march=i686 -fasynchronous-unwind-tables -mtune=pentium4 -gdwarf-4 -fno-debug-types-section -fvar-tracking-assignments -g2 -DSYSCONFDIR=\"/etc\" -I../h -I../h -I. client.c make[2]: Leaving directory '/tmp/B.o_glf5h0/BUILD/zephyr-3.1.2/server' make[2]: Entering directory '/tmp/B.o_glf5h0/BUILD/zephyr-3.1.2/server' i686-pld-linux-gcc -c -O2 -fwrapv -pipe -Wformat -Werror=format-security -gdwarf-4 -fno-debug-types-section -fvar-tracking-assignments -g2 -Wp,-D_FORTIFY_SOURCE=2 -fstack-protector-strong --param=ssp-buffer-size=4 -Werror=trampolines -fomit-frame-pointer -march=i686 -fasynchronous-unwind-tables -mtune=pentium4 -gdwarf-4 -fno-debug-types-section -fvar-tracking-assignments -g2 -DSYSCONFDIR=\"/etc\" -I../h -I../h -I. acl_files.c make[2]: Leaving directory '/tmp/B.o_glf5h0/BUILD/zephyr-3.1.2/server' make[2]: Entering directory '/tmp/B.o_glf5h0/BUILD/zephyr-3.1.2/server' i686-pld-linux-gcc -c -O2 -fwrapv -pipe -Wformat -Werror=format-security -gdwarf-4 -fno-debug-types-section -fvar-tracking-assignments -g2 -Wp,-D_FORTIFY_SOURCE=2 -fstack-protector-strong --param=ssp-buffer-size=4 -Werror=trampolines -fomit-frame-pointer -march=i686 -fasynchronous-unwind-tables -mtune=pentium4 -gdwarf-4 -fno-debug-types-section -fvar-tracking-assignments -g2 -DSYSCONFDIR=\"/etc\" -I../h -I../h -I. class.c make[2]: Leaving directory '/tmp/B.o_glf5h0/BUILD/zephyr-3.1.2/server' make[2]: Entering directory '/tmp/B.o_glf5h0/BUILD/zephyr-3.1.2/server' i686-pld-linux-gcc -c -O2 -fwrapv -pipe -Wformat -Werror=format-security -gdwarf-4 -fno-debug-types-section -fvar-tracking-assignments -g2 -Wp,-D_FORTIFY_SOURCE=2 -fstack-protector-strong --param=ssp-buffer-size=4 -Werror=trampolines -fomit-frame-pointer -march=i686 -fasynchronous-unwind-tables -mtune=pentium4 -gdwarf-4 -fno-debug-types-section -fvar-tracking-assignments -g2 -DSYSCONFDIR=\"/etc\" -I../h -I../h -I. global.c make[2]: Leaving directory '/tmp/B.o_glf5h0/BUILD/zephyr-3.1.2/server' make[2]: Entering directory '/tmp/B.o_glf5h0/BUILD/zephyr-3.1.2/server' i686-pld-linux-gcc -c -O2 -fwrapv -pipe -Wformat -Werror=format-security -gdwarf-4 -fno-debug-types-section -fvar-tracking-assignments -g2 -Wp,-D_FORTIFY_SOURCE=2 -fstack-protector-strong --param=ssp-buffer-size=4 -Werror=trampolines -fomit-frame-pointer -march=i686 -fasynchronous-unwind-tables -mtune=pentium4 -gdwarf-4 -fno-debug-types-section -fvar-tracking-assignments -g2 -DSYSCONFDIR=\"/etc\" -I../h -I../h -I. main.c make[2]: Leaving directory '/tmp/B.o_glf5h0/BUILD/zephyr-3.1.2/server' make[2]: Entering directory '/tmp/B.o_glf5h0/BUILD/zephyr-3.1.2/server' i686-pld-linux-gcc -c -O2 -fwrapv -pipe -Wformat -Werror=format-security -gdwarf-4 -fno-debug-types-section -fvar-tracking-assignments -g2 -Wp,-D_FORTIFY_SOURCE=2 -fstack-protector-strong --param=ssp-buffer-size=4 -Werror=trampolines -fomit-frame-pointer -march=i686 -fasynchronous-unwind-tables -mtune=pentium4 -gdwarf-4 -fno-debug-types-section -fvar-tracking-assignments -g2 -DSYSCONFDIR=\"/etc\" -I../h -I../h -I. kstuff.c kstuff.c: In function 'ZCheckSrvAuthentication': kstuff.c:417:9: warning: 'krb5_free_unparsed_name' is deprecated [-Wdeprecated-declarations] 417 | krb5_free_unparsed_name(Z_krb5_ctx, name); | ^~~~~~~~~~~~~~~~~~~~~~~ In file included from /usr/include/krb5.h:967, from ../h/internal.h:15, from zserver.h:17, from kstuff.c:15: /usr/include/krb5-protos.h:3843:1: note: declared here 3843 | krb5_free_unparsed_name ( | ^~~~~~~~~~~~~~~~~~~~~~~ kstuff.c:425:5: warning: 'krb5_free_unparsed_name' is deprecated [-Wdeprecated-declarations] 425 | krb5_free_unparsed_name(Z_krb5_ctx, name); | ^~~~~~~~~~~~~~~~~~~~~~~ In file included from /usr/include/krb5.h:967, from ../h/internal.h:15, from zserver.h:17, from kstuff.c:15: /usr/include/krb5-protos.h:3843:1: note: declared here 3843 | krb5_free_unparsed_name ( | ^~~~~~~~~~~~~~~~~~~~~~~ make[2]: Leaving directory '/tmp/B.o_glf5h0/BUILD/zephyr-3.1.2/server' make[2]: Entering directory '/tmp/B.o_glf5h0/BUILD/zephyr-3.1.2/server' i686-pld-linux-gcc -c -O2 -fwrapv -pipe -Wformat -Werror=format-security -gdwarf-4 -fno-debug-types-section -fvar-tracking-assignments -g2 -Wp,-D_FORTIFY_SOURCE=2 -fstack-protector-strong --param=ssp-buffer-size=4 -Werror=trampolines -fomit-frame-pointer -march=i686 -fasynchronous-unwind-tables -mtune=pentium4 -gdwarf-4 -fno-debug-types-section -fvar-tracking-assignments -g2 -DSYSCONFDIR=\"/etc\" -I../h -I../h -I. timer.c make[2]: Leaving directory '/tmp/B.o_glf5h0/BUILD/zephyr-3.1.2/server' make[2]: Entering directory '/tmp/B.o_glf5h0/BUILD/zephyr-3.1.2/server' i686-pld-linux-gcc -c -O2 -fwrapv -pipe -Wformat -Werror=format-security -gdwarf-4 -fno-debug-types-section -fvar-tracking-assignments -g2 -Wp,-D_FORTIFY_SOURCE=2 -fstack-protector-strong --param=ssp-buffer-size=4 -Werror=trampolines -fomit-frame-pointer -march=i686 -fasynchronous-unwind-tables -mtune=pentium4 -gdwarf-4 -fno-debug-types-section -fvar-tracking-assignments -g2 -DSYSCONFDIR=\"/etc\" -I../h -I../h -I. version.c make[2]: Leaving directory '/tmp/B.o_glf5h0/BUILD/zephyr-3.1.2/server' make[2]: Entering directory '/tmp/B.o_glf5h0/BUILD/zephyr-3.1.2/server' i686-pld-linux-gcc -c -O2 -fwrapv -pipe -Wformat -Werror=format-security -gdwarf-4 -fno-debug-types-section -fvar-tracking-assignments -g2 -Wp,-D_FORTIFY_SOURCE=2 -fstack-protector-strong --param=ssp-buffer-size=4 -Werror=trampolines -fomit-frame-pointer -march=i686 -fasynchronous-unwind-tables -mtune=pentium4 -gdwarf-4 -fno-debug-types-section -fvar-tracking-assignments -g2 -DSYSCONFDIR=\"/etc\" -I../h -I../h -I. zstring.c make[2]: Leaving directory '/tmp/B.o_glf5h0/BUILD/zephyr-3.1.2/server' make[2]: Entering directory '/tmp/B.o_glf5h0/BUILD/zephyr-3.1.2/server' i686-pld-linux-gcc -c -O2 -fwrapv -pipe -Wformat -Werror=format-security -gdwarf-4 -fno-debug-types-section -fvar-tracking-assignments -g2 -Wp,-D_FORTIFY_SOURCE=2 -fstack-protector-strong --param=ssp-buffer-size=4 -Werror=trampolines -fomit-frame-pointer -march=i686 -fasynchronous-unwind-tables -mtune=pentium4 -gdwarf-4 -fno-debug-types-section -fvar-tracking-assignments -g2 -DSYSCONFDIR=\"/etc\" -I../h -I../h -I. bdump.c bdump.c: In function 'bdump_send': bdump.c:400:14: warning: 'krb5_free_data_contents' is deprecated [-Wdeprecated-declarations] 400 | krb5_free_data_contents(Z_krb5_ctx, &k5data); | ^~~~~~~~~~~~~~~~~~~~~~~ In file included from /usr/include/krb5.h:967, from ../h/internal.h:15, from zserver.h:17, from bdump.c:16: /usr/include/krb5-protos.h:3674:1: note: declared here 3674 | krb5_free_data_contents ( | ^~~~~~~~~~~~~~~~~~~~~~~ bdump.c:404:9: warning: 'krb5_free_data_contents' is deprecated [-Wdeprecated-declarations] 404 | krb5_free_data_contents(Z_krb5_ctx, &k5data); | ^~~~~~~~~~~~~~~~~~~~~~~ In file included from /usr/include/krb5.h:967, from ../h/internal.h:15, from zserver.h:17, from bdump.c:16: /usr/include/krb5-protos.h:3674:1: note: declared here 3674 | krb5_free_data_contents ( | ^~~~~~~~~~~~~~~~~~~~~~~ bdump.c: In function 'bdump_get_v12': bdump.c:688:14: warning: 'krb5_free_data_contents' is deprecated [-Wdeprecated-declarations] 688 | krb5_free_data_contents(Z_krb5_ctx, &data); | ^~~~~~~~~~~~~~~~~~~~~~~ In file included from /usr/include/krb5.h:967, from ../h/internal.h:15, from zserver.h:17, from bdump.c:16: /usr/include/krb5-protos.h:3674:1: note: declared here 3674 | krb5_free_data_contents ( | ^~~~~~~~~~~~~~~~~~~~~~~ bdump.c:692:9: warning: 'krb5_free_data_contents' is deprecated [-Wdeprecated-declarations] 692 | krb5_free_data_contents(Z_krb5_ctx, &data); | ^~~~~~~~~~~~~~~~~~~~~~~ In file included from /usr/include/krb5.h:967, from ../h/internal.h:15, from zserver.h:17, from bdump.c:16: /usr/include/krb5-protos.h:3674:1: note: declared here 3674 | krb5_free_data_contents ( | ^~~~~~~~~~~~~~~~~~~~~~~ bdump.c: In function 'transmit_tcp': bdump.c:885:9: warning: 'krb5_free_data_contents' is deprecated [-Wdeprecated-declarations] 885 | krb5_free_data_contents(Z_krb5_ctx, &outmsg); | ^~~~~~~~~~~~~~~~~~~~~~~ In file included from /usr/include/krb5.h:967, from ../h/internal.h:15, from zserver.h:17, from bdump.c:16: /usr/include/krb5-protos.h:3674:1: note: declared here 3674 | krb5_free_data_contents ( | ^~~~~~~~~~~~~~~~~~~~~~~ bdump.c: In function 'get_tgt': bdump.c:1073:9: warning: 'krb5_get_init_creds_opt_init' is deprecated [-Wdeprecated-declarations] 1073 | krb5_get_init_creds_opt_init (&opt); | ^~~~~~~~~~~~~~~~~~~~~~~~~~~~ In file included from /usr/include/krb5.h:967, from ../h/internal.h:15, from zserver.h:17, from bdump.c:16: /usr/include/krb5-protos.h:4456:1: note: declared here 4456 | krb5_get_init_creds_opt_init (krb5_get_init_creds_opt */*opt*/) | ^~~~~~~~~~~~~~~~~~~~~~~~~~~~ bdump.c: In function 'bdump_recv_loop': bdump.c:1240:13: warning: 'krb5_free_data_contents' is deprecated [-Wdeprecated-declarations] 1240 | krb5_free_data_contents(Z_krb5_ctx, &out); | ^~~~~~~~~~~~~~~~~~~~~~~ In file included from /usr/include/krb5.h:967, from ../h/internal.h:15, from zserver.h:17, from bdump.c:16: /usr/include/krb5-protos.h:3674:1: note: declared here 3674 | krb5_free_data_contents ( | ^~~~~~~~~~~~~~~~~~~~~~~ make[2]: Leaving directory '/tmp/B.o_glf5h0/BUILD/zephyr-3.1.2/server' make[2]: Entering directory '/tmp/B.o_glf5h0/BUILD/zephyr-3.1.2/server' i686-pld-linux-gcc -c -O2 -fwrapv -pipe -Wformat -Werror=format-security -gdwarf-4 -fno-debug-types-section -fvar-tracking-assignments -g2 -Wp,-D_FORTIFY_SOURCE=2 -fstack-protector-strong --param=ssp-buffer-size=4 -Werror=trampolines -fomit-frame-pointer -march=i686 -fasynchronous-unwind-tables -mtune=pentium4 -gdwarf-4 -fno-debug-types-section -fvar-tracking-assignments -g2 -DSYSCONFDIR=\"/etc\" -I../h -I../h -I. dispatch.c make[2]: Leaving directory '/tmp/B.o_glf5h0/BUILD/zephyr-3.1.2/server' make[2]: Entering directory '/tmp/B.o_glf5h0/BUILD/zephyr-3.1.2/server' i686-pld-linux-gcc -c -O2 -fwrapv -pipe -Wformat -Werror=format-security -gdwarf-4 -fno-debug-types-section -fvar-tracking-assignments -g2 -Wp,-D_FORTIFY_SOURCE=2 -fstack-protector-strong --param=ssp-buffer-size=4 -Werror=trampolines -fomit-frame-pointer -march=i686 -fasynchronous-unwind-tables -mtune=pentium4 -gdwarf-4 -fno-debug-types-section -fvar-tracking-assignments -g2 -DSYSCONFDIR=\"/etc\" -I../h -I../h -I. uloc.c make[2]: Leaving directory '/tmp/B.o_glf5h0/BUILD/zephyr-3.1.2/server' make[2]: Entering directory '/tmp/B.o_glf5h0/BUILD/zephyr-3.1.2/server' i686-pld-linux-gcc -c -O2 -fwrapv -pipe -Wformat -Werror=format-security -gdwarf-4 -fno-debug-types-section -fvar-tracking-assignments -g2 -Wp,-D_FORTIFY_SOURCE=2 -fstack-protector-strong --param=ssp-buffer-size=4 -Werror=trampolines -fomit-frame-pointer -march=i686 -fasynchronous-unwind-tables -mtune=pentium4 -gdwarf-4 -fno-debug-types-section -fvar-tracking-assignments -g2 -DSYSCONFDIR=\"/etc\" -I../h -I../h -I. subscr.c make[2]: Leaving directory '/tmp/B.o_glf5h0/BUILD/zephyr-3.1.2/server' make[2]: Entering directory '/tmp/B.o_glf5h0/BUILD/zephyr-3.1.2/server' i686-pld-linux-gcc -c -O2 -fwrapv -pipe -Wformat -Werror=format-security -gdwarf-4 -fno-debug-types-section -fvar-tracking-assignments -g2 -Wp,-D_FORTIFY_SOURCE=2 -fstack-protector-strong --param=ssp-buffer-size=4 -Werror=trampolines -fomit-frame-pointer -march=i686 -fasynchronous-unwind-tables -mtune=pentium4 -gdwarf-4 -fno-debug-types-section -fvar-tracking-assignments -g2 -DSYSCONFDIR=\"/etc\" -I../h -I../h -I. server.c make[2]: Leaving directory '/tmp/B.o_glf5h0/BUILD/zephyr-3.1.2/server' make[2]: Entering directory '/tmp/B.o_glf5h0/BUILD/zephyr-3.1.2/server' i686-pld-linux-gcc -c -O2 -fwrapv -pipe -Wformat -Werror=format-security -gdwarf-4 -fno-debug-types-section -fvar-tracking-assignments -g2 -Wp,-D_FORTIFY_SOURCE=2 -fstack-protector-strong --param=ssp-buffer-size=4 -Werror=trampolines -fomit-frame-pointer -march=i686 -fasynchronous-unwind-tables -mtune=pentium4 -gdwarf-4 -fno-debug-types-section -fvar-tracking-assignments -g2 -DSYSCONFDIR=\"/etc\" -I../h -I../h -I. test_server.c test_server.c: In function 'test_acl_files': test_server.c:236:5: warning: ignoring return value of 'write' declared with attribute 'warn_unused_result' [-Wunused-result] 236 | write(fd, "*\n", 2); | ^~~~~~~~~~~~~~~~~~~ test_server.c:245:5: warning: ignoring return value of 'write' declared with attribute 'warn_unused_result' [-Wunused-result] 245 | write(fd, "foo\n", 4); | ^~~~~~~~~~~~~~~~~~~~~ test_server.c:254:5: warning: ignoring return value of 'write' declared with attribute 'warn_unused_result' [-Wunused-result] 254 | write(fd, "*@TIM.EDU\n", 10); | ^~~~~~~~~~~~~~~~~~~~~~~~~~~~ test_server.c:265:5: warning: ignoring return value of 'write' declared with attribute 'warn_unused_result' [-Wunused-result] 265 | write(fd, "*.*@TIM.EDU\n", 12); | ^~~~~~~~~~~~~~~~~~~~~~~~~~~~~~ test_server.c:276:5: warning: ignoring return value of 'write' declared with attribute 'warn_unused_result' [-Wunused-result] 276 | write(fd, "foo@TIM.EDU\n", 12); | ^~~~~~~~~~~~~~~~~~~~~~~~~~~~~~ test_server.c:289:5: warning: ignoring return value of 'write' declared with attribute 'warn_unused_result' [-Wunused-result] 289 | write(fd, "!bar@TIM.EDU\n*@*\n", 17); | ^~~~~~~~~~~~~~~~~~~~~~~~~~~~~~~~~~~~ test_server.c:303:5: warning: ignoring return value of 'write' declared with attribute 'warn_unused_result' [-Wunused-result] 303 | write(fd, "@0.0.0.0\n", 9); | ^~~~~~~~~~~~~~~~~~~~~~~~~~ test_server.c:312:5: warning: ignoring return value of 'ftruncate' declared with attribute 'warn_unused_result' [-Wunused-result] 312 | ftruncate(fd, 0); | ^~~~~~~~~~~~~~~~ test_server.c:313:5: warning: ignoring return value of 'write' declared with attribute 'warn_unused_result' [-Wunused-result] 313 | write(fd, "*@*\n@0.0.0.0\n!@127.0.0.0/8\n", 27); | ^~~~~~~~~~~~~~~~~~~~~~~~~~~~~~~~~~~~~~~~~~~~~~~ test_server.c:322:5: warning: ignoring return value of 'ftruncate' declared with attribute 'warn_unused_result' [-Wunused-result] 322 | ftruncate(fd, 0); | ^~~~~~~~~~~~~~~~ test_server.c:323:5: warning: ignoring return value of 'write' declared with attribute 'warn_unused_result' [-Wunused-result] 323 | write(fd, "*/root@TIM.EDU\n", 15); | ^~~~~~~~~~~~~~~~~~~~~~~~~~~~~~~~~ test_server.c:335:5: warning: ignoring return value of 'ftruncate' declared with attribute 'warn_unused_result' [-Wunused-result] 335 | ftruncate(fd, 0); | ^~~~~~~~~~~~~~~~ test_server.c:336:5: warning: ignoring return value of 'write' declared with attribute 'warn_unused_result' [-Wunused-result] 336 | write(fd, "foo/*@TIM.EDU\n", 14); | ^~~~~~~~~~~~~~~~~~~~~~~~~~~~~~~~ make[2]: Leaving directory '/tmp/B.o_glf5h0/BUILD/zephyr-3.1.2/server' make[2]: Entering directory '/tmp/B.o_glf5h0/BUILD/zephyr-3.1.2/server' i686-pld-linux-gcc -c -O2 -fwrapv -pipe -Wformat -Werror=format-security -gdwarf-4 -fno-debug-types-section -fvar-tracking-assignments -g2 -Wp,-D_FORTIFY_SOURCE=2 -fstack-protector-strong --param=ssp-buffer-size=4 -Werror=trampolines -fomit-frame-pointer -march=i686 -fasynchronous-unwind-tables -mtune=pentium4 -gdwarf-4 -fno-debug-types-section -fvar-tracking-assignments -g2 -DSYSCONFDIR=\"/etc\" -I../h -I../h -I. realm.c make[2]: Leaving directory '/tmp/B.o_glf5h0/BUILD/zephyr-3.1.2/server' make[2]: Entering directory '/tmp/B.o_glf5h0/BUILD/zephyr-3.1.2/server' i686-pld-linux-gcc -c -O2 -fwrapv -pipe -Wformat -Werror=format-security -gdwarf-4 -fno-debug-types-section -fvar-tracking-assignments -g2 -Wp,-D_FORTIFY_SOURCE=2 -fstack-protector-strong --param=ssp-buffer-size=4 -Werror=trampolines -fomit-frame-pointer -march=i686 -fasynchronous-unwind-tables -mtune=pentium4 -gdwarf-4 -fno-debug-types-section -fvar-tracking-assignments -g2 -DSYSCONFDIR=\"/etc\" -I../h -I../h -I. utf8proc.c make[2]: Leaving directory '/tmp/B.o_glf5h0/BUILD/zephyr-3.1.2/server' make[2]: Entering directory '/tmp/B.o_glf5h0/BUILD/zephyr-3.1.2/server' /bin/sh ../libtool --mode=link i686-pld-linux-gcc -Wl,--as-needed -Wl,--no-copy-dt-needed-entries -Wl,-z,relro -Wl,-z,combreloc -o zephyrd main.o zsrv_err.o access.o acl_files.o bdump.o class.o client.o common.o dispatch.o kstuff.o global.o server.o subscr.o timer.o uloc.o zstring.o realm.o version.o utf8proc.o ../lib/libzephyr.la -lkrb5 -lcom_err -lcares libtool: link: i686-pld-linux-gcc -Wl,--as-needed -Wl,--no-copy-dt-needed-entries -Wl,-z -Wl,relro -Wl,-z -Wl,combreloc -o .libs/zephyrd main.o zsrv_err.o access.o acl_files.o bdump.o class.o client.o common.o dispatch.o kstuff.o global.o server.o subscr.o timer.o uloc.o zstring.o realm.o version.o utf8proc.o ../lib/.libs/libzephyr.so /usr/lib/libkrb5.so /usr/lib/libhx509.so /usr/lib/libwind.so /usr/lib/libsqlite3.so -lm -lz -ldl /usr/lib/libhcrypto.so /usr/lib/libasn1.so /usr/lib/libheimbase.so -lcrypto /usr/lib/libroken.so -lcrypt -lpthread -lcom_err -lcares -pthread make[2]: Leaving directory '/tmp/B.o_glf5h0/BUILD/zephyr-3.1.2/server' make[2]: Entering directory '/tmp/B.o_glf5h0/BUILD/zephyr-3.1.2/server' /bin/sh ../libtool --mode=link i686-pld-linux-gcc -Wl,--as-needed -Wl,--no-copy-dt-needed-entries -Wl,-z,relro -Wl,-z,combreloc -o test_server test_server.o zsrv_err.o access.o acl_files.o bdump.o class.o client.o common.o dispatch.o kstuff.o global.o server.o subscr.o timer.o uloc.o zstring.o realm.o version.o utf8proc.o ../lib/libzephyr.la -lkrb5 -lcom_err -lcares libtool: link: i686-pld-linux-gcc -Wl,--as-needed -Wl,--no-copy-dt-needed-entries -Wl,-z -Wl,relro -Wl,-z -Wl,combreloc -o .libs/test_server test_server.o zsrv_err.o access.o acl_files.o bdump.o class.o client.o common.o dispatch.o kstuff.o global.o server.o subscr.o timer.o uloc.o zstring.o realm.o version.o utf8proc.o ../lib/.libs/libzephyr.so /usr/lib/libkrb5.so /usr/lib/libhx509.so /usr/lib/libwind.so /usr/lib/libsqlite3.so -lm -lz -ldl /usr/lib/libhcrypto.so /usr/lib/libasn1.so /usr/lib/libheimbase.so -lcrypto /usr/lib/libroken.so -lcrypt -lpthread -lcom_err -lcares -pthread make[2]: Leaving directory '/tmp/B.o_glf5h0/BUILD/zephyr-3.1.2/server' make[2]: Entering directory '/tmp/B.o_glf5h0/BUILD/zephyr-3.1.2/zhm' sed -e 's|@datadir[@]|/usr/share|g' -e 's|@sysconfdir[@]|/etc|g' -e 's|@sbindir[@]|/usr/sbin|g' -e 's|@lsbindir[@]|/usr/sbin|g' ./zhm.8.in > zhm.8.tmp mv zhm.8.tmp zhm.8 make[2]: Leaving directory '/tmp/B.o_glf5h0/BUILD/zephyr-3.1.2/zhm' make[2]: Entering directory '/tmp/B.o_glf5h0/BUILD/zephyr-3.1.2/zhm' i686-pld-linux-gcc -c -O2 -fwrapv -pipe -Wformat -Werror=format-security -gdwarf-4 -fno-debug-types-section -fvar-tracking-assignments -g2 -Wp,-D_FORTIFY_SOURCE=2 -fstack-protector-strong --param=ssp-buffer-size=4 -Werror=trampolines -fomit-frame-pointer -march=i686 -fasynchronous-unwind-tables -mtune=pentium4 -gdwarf-4 -fno-debug-types-section -fvar-tracking-assignments -g2 -I../h -I../h zhm_client.c make[2]: Leaving directory '/tmp/B.o_glf5h0/BUILD/zephyr-3.1.2/zhm' make[2]: Entering directory '/tmp/B.o_glf5h0/BUILD/zephyr-3.1.2/zhm' i686-pld-linux-gcc -c -O2 -fwrapv -pipe -Wformat -Werror=format-security -gdwarf-4 -fno-debug-types-section -fvar-tracking-assignments -g2 -Wp,-D_FORTIFY_SOURCE=2 -fstack-protector-strong --param=ssp-buffer-size=4 -Werror=trampolines -fomit-frame-pointer -march=i686 -fasynchronous-unwind-tables -mtune=pentium4 -gdwarf-4 -fno-debug-types-section -fvar-tracking-assignments -g2 -I../h -I../h timer.c make[2]: Leaving directory '/tmp/B.o_glf5h0/BUILD/zephyr-3.1.2/zhm' make[2]: Entering directory '/tmp/B.o_glf5h0/BUILD/zephyr-3.1.2/zhm' i686-pld-linux-gcc -c -O2 -fwrapv -pipe -Wformat -Werror=format-security -gdwarf-4 -fno-debug-types-section -fvar-tracking-assignments -g2 -Wp,-D_FORTIFY_SOURCE=2 -fstack-protector-strong --param=ssp-buffer-size=4 -Werror=trampolines -fomit-frame-pointer -march=i686 -fasynchronous-unwind-tables -mtune=pentium4 -gdwarf-4 -fno-debug-types-section -fvar-tracking-assignments -g2 -I../h -I../h queue.c make[2]: Leaving directory '/tmp/B.o_glf5h0/BUILD/zephyr-3.1.2/zhm' make[2]: Entering directory '/tmp/B.o_glf5h0/BUILD/zephyr-3.1.2/zhm' i686-pld-linux-gcc -c -O2 -fwrapv -pipe -Wformat -Werror=format-security -gdwarf-4 -fno-debug-types-section -fvar-tracking-assignments -g2 -Wp,-D_FORTIFY_SOURCE=2 -fstack-protector-strong --param=ssp-buffer-size=4 -Werror=trampolines -fomit-frame-pointer -march=i686 -fasynchronous-unwind-tables -mtune=pentium4 -gdwarf-4 -fno-debug-types-section -fvar-tracking-assignments -g2 -I../h -I../h zhm_server.c make[2]: Leaving directory '/tmp/B.o_glf5h0/BUILD/zephyr-3.1.2/zhm' make[2]: Entering directory '/tmp/B.o_glf5h0/BUILD/zephyr-3.1.2/zhm' i686-pld-linux-gcc -c -O2 -fwrapv -pipe -Wformat -Werror=format-security -gdwarf-4 -fno-debug-types-section -fvar-tracking-assignments -g2 -Wp,-D_FORTIFY_SOURCE=2 -fstack-protector-strong --param=ssp-buffer-size=4 -Werror=trampolines -fomit-frame-pointer -march=i686 -fasynchronous-unwind-tables -mtune=pentium4 -gdwarf-4 -fno-debug-types-section -fvar-tracking-assignments -g2 -I../h -I../h zhm.c make[2]: Leaving directory '/tmp/B.o_glf5h0/BUILD/zephyr-3.1.2/zhm' make[2]: Entering directory '/tmp/B.o_glf5h0/BUILD/zephyr-3.1.2/zhm' /bin/sh ../libtool --mode=link i686-pld-linux-gcc -Wl,--as-needed -Wl,--no-copy-dt-needed-entries -Wl,-z,relro -Wl,-z,combreloc -o zhm timer.o queue.o zhm.o zhm_client.o zhm_server.o ../lib/libzephyr.la -lcom_err libtool: link: i686-pld-linux-gcc -Wl,--as-needed -Wl,--no-copy-dt-needed-entries -Wl,-z -Wl,relro -Wl,-z -Wl,combreloc -o .libs/zhm timer.o queue.o zhm.o zhm_client.o zhm_server.o ../lib/.libs/libzephyr.so /usr/lib/libkrb5.so /usr/lib/libhx509.so /usr/lib/libwind.so /usr/lib/libsqlite3.so -lm -lz -ldl /usr/lib/libhcrypto.so /usr/lib/libasn1.so /usr/lib/libheimbase.so -lcrypto /usr/lib/libroken.so -lcrypt -lpthread -lcom_err -pthread make[2]: Leaving directory '/tmp/B.o_glf5h0/BUILD/zephyr-3.1.2/zhm' make[2]: Entering directory '/tmp/B.o_glf5h0/BUILD/zephyr-3.1.2/zwgc' ./instantiate . stack string make[2]: Leaving directory '/tmp/B.o_glf5h0/BUILD/zephyr-3.1.2/zwgc' make[2]: Entering directory '/tmp/B.o_glf5h0/BUILD/zephyr-3.1.2/zwgc' ./instantiate . dictionary port port.h make[2]: Leaving directory '/tmp/B.o_glf5h0/BUILD/zephyr-3.1.2/zwgc' make[2]: Entering directory '/tmp/B.o_glf5h0/BUILD/zephyr-3.1.2/zwgc' ./instantiate . dictionary unsigned_long unsigned_long.h make[2]: Leaving directory '/tmp/B.o_glf5h0/BUILD/zephyr-3.1.2/zwgc' make[2]: Entering directory '/tmp/B.o_glf5h0/BUILD/zephyr-3.1.2/zwgc' ./instantiate . dictionary pointer pointer.h make[2]: Leaving directory '/tmp/B.o_glf5h0/BUILD/zephyr-3.1.2/zwgc' make[2]: Entering directory '/tmp/B.o_glf5h0/BUILD/zephyr-3.1.2/zwgc' ./instantiate . dictionary int make[2]: Leaving directory '/tmp/B.o_glf5h0/BUILD/zephyr-3.1.2/zwgc' make[2]: Entering directory '/tmp/B.o_glf5h0/BUILD/zephyr-3.1.2/zwgc' ./instantiate . dictionary int make[2]: Leaving directory '/tmp/B.o_glf5h0/BUILD/zephyr-3.1.2/zwgc' make[2]: Entering directory '/tmp/B.o_glf5h0/BUILD/zephyr-3.1.2/zwgc' ./instantiate . dictionary string new_string.h make[2]: Leaving directory '/tmp/B.o_glf5h0/BUILD/zephyr-3.1.2/zwgc' make[2]: Entering directory '/tmp/B.o_glf5h0/BUILD/zephyr-3.1.2/zwgc' ./instantiate . dictionary string new_string.h make[2]: Leaving directory '/tmp/B.o_glf5h0/BUILD/zephyr-3.1.2/zwgc' make[2]: Entering directory '/tmp/B.o_glf5h0/BUILD/zephyr-3.1.2/zwgc' i686-pld-linux-gcc -c -O2 -fwrapv -pipe -Wformat -Werror=format-security -gdwarf-4 -fno-debug-types-section -fvar-tracking-assignments -g2 -Wp,-D_FORTIFY_SOURCE=2 -fstack-protector-strong --param=ssp-buffer-size=4 -Werror=trampolines -fomit-frame-pointer -march=i686 -fasynchronous-unwind-tables -mtune=pentium4 -gdwarf-4 -fno-debug-types-section -fvar-tracking-assignments -g2 -DDATADIR=\"/usr/share\" -I../h -I../h -I. -I. buffer.c make[2]: Leaving directory '/tmp/B.o_glf5h0/BUILD/zephyr-3.1.2/zwgc' make[2]: Entering directory '/tmp/B.o_glf5h0/BUILD/zephyr-3.1.2/zwgc' i686-pld-linux-gcc -c -O2 -fwrapv -pipe -Wformat -Werror=format-security -gdwarf-4 -fno-debug-types-section -fvar-tracking-assignments -g2 -Wp,-D_FORTIFY_SOURCE=2 -fstack-protector-strong --param=ssp-buffer-size=4 -Werror=trampolines -fomit-frame-pointer -march=i686 -fasynchronous-unwind-tables -mtune=pentium4 -gdwarf-4 -fno-debug-types-section -fvar-tracking-assignments -g2 -DDATADIR=\"/usr/share\" -I../h -I../h -I. -I. node.c make[2]: Leaving directory '/tmp/B.o_glf5h0/BUILD/zephyr-3.1.2/zwgc' make[2]: Entering directory '/tmp/B.o_glf5h0/BUILD/zephyr-3.1.2/zwgc' ./instantiate . stack xmode make[2]: Leaving directory '/tmp/B.o_glf5h0/BUILD/zephyr-3.1.2/zwgc' make[2]: Entering directory '/tmp/B.o_glf5h0/BUILD/zephyr-3.1.2/zwgc' i686-pld-linux-gcc -c -O2 -fwrapv -pipe -Wformat -Werror=format-security -gdwarf-4 -fno-debug-types-section -fvar-tracking-assignments -g2 -Wp,-D_FORTIFY_SOURCE=2 -fstack-protector-strong --param=ssp-buffer-size=4 -Werror=trampolines -fomit-frame-pointer -march=i686 -fasynchronous-unwind-tables -mtune=pentium4 -gdwarf-4 -fno-debug-types-section -fvar-tracking-assignments -g2 -DDATADIR=\"/usr/share\" -I../h -I../h -I. -I. zephyr.c make[2]: Leaving directory '/tmp/B.o_glf5h0/BUILD/zephyr-3.1.2/zwgc' make[2]: Entering directory '/tmp/B.o_glf5h0/BUILD/zephyr-3.1.2/zwgc' i686-pld-linux-gcc -c -O2 -fwrapv -pipe -Wformat -Werror=format-security -gdwarf-4 -fno-debug-types-section -fvar-tracking-assignments -g2 -Wp,-D_FORTIFY_SOURCE=2 -fstack-protector-strong --param=ssp-buffer-size=4 -Werror=trampolines -fomit-frame-pointer -march=i686 -fasynchronous-unwind-tables -mtune=pentium4 -gdwarf-4 -fno-debug-types-section -fvar-tracking-assignments -g2 -DDATADIR=\"/usr/share\" -I../h -I../h -I. -I. substitute.c make[2]: Leaving directory '/tmp/B.o_glf5h0/BUILD/zephyr-3.1.2/zwgc' make[2]: Entering directory '/tmp/B.o_glf5h0/BUILD/zephyr-3.1.2/zwgc' i686-pld-linux-gcc -c -O2 -fwrapv -pipe -Wformat -Werror=format-security -gdwarf-4 -fno-debug-types-section -fvar-tracking-assignments -g2 -Wp,-D_FORTIFY_SOURCE=2 -fstack-protector-strong --param=ssp-buffer-size=4 -Werror=trampolines -fomit-frame-pointer -march=i686 -fasynchronous-unwind-tables -mtune=pentium4 -gdwarf-4 -fno-debug-types-section -fvar-tracking-assignments -g2 -DDATADIR=\"/usr/share\" -I../h -I../h -I. -I. exec.c make[2]: Leaving directory '/tmp/B.o_glf5h0/BUILD/zephyr-3.1.2/zwgc' make[2]: Entering directory '/tmp/B.o_glf5h0/BUILD/zephyr-3.1.2/zwgc' i686-pld-linux-gcc -c -O2 -fwrapv -pipe -Wformat -Werror=format-security -gdwarf-4 -fno-debug-types-section -fvar-tracking-assignments -g2 -Wp,-D_FORTIFY_SOURCE=2 -fstack-protector-strong --param=ssp-buffer-size=4 -Werror=trampolines -fomit-frame-pointer -march=i686 -fasynchronous-unwind-tables -mtune=pentium4 -gdwarf-4 -fno-debug-types-section -fvar-tracking-assignments -g2 -DDATADIR=\"/usr/share\" -I../h -I../h -I. -I. main.c make[2]: Leaving directory '/tmp/B.o_glf5h0/BUILD/zephyr-3.1.2/zwgc' make[2]: Entering directory '/tmp/B.o_glf5h0/BUILD/zephyr-3.1.2/zwgc' i686-pld-linux-gcc -c -O2 -fwrapv -pipe -Wformat -Werror=format-security -gdwarf-4 -fno-debug-types-section -fvar-tracking-assignments -g2 -Wp,-D_FORTIFY_SOURCE=2 -fstack-protector-strong --param=ssp-buffer-size=4 -Werror=trampolines -fomit-frame-pointer -march=i686 -fasynchronous-unwind-tables -mtune=pentium4 -gdwarf-4 -fno-debug-types-section -fvar-tracking-assignments -g2 -DDATADIR=\"/usr/share\" -I../h -I../h -I. -I. X_driver.c make[2]: Leaving directory '/tmp/B.o_glf5h0/BUILD/zephyr-3.1.2/zwgc' make[2]: Entering directory '/tmp/B.o_glf5h0/BUILD/zephyr-3.1.2/zwgc' bison -y -d ./parser.y make[2]: Leaving directory '/tmp/B.o_glf5h0/BUILD/zephyr-3.1.2/zwgc' make[2]: Entering directory '/tmp/B.o_glf5h0/BUILD/zephyr-3.1.2/zwgc' bison -y -d ./parser.y make[2]: Leaving directory '/tmp/B.o_glf5h0/BUILD/zephyr-3.1.2/zwgc' make[2]: Entering directory '/tmp/B.o_glf5h0/BUILD/zephyr-3.1.2/zwgc' ./instantiate . stack char make[2]: Leaving directory '/tmp/B.o_glf5h0/BUILD/zephyr-3.1.2/zwgc' make[2]: Entering directory '/tmp/B.o_glf5h0/BUILD/zephyr-3.1.2/zwgc' i686-pld-linux-gcc -c -O2 -fwrapv -pipe -Wformat -Werror=format-security -gdwarf-4 -fno-debug-types-section -fvar-tracking-assignments -g2 -Wp,-D_FORTIFY_SOURCE=2 -fstack-protector-strong --param=ssp-buffer-size=4 -Werror=trampolines -fomit-frame-pointer -march=i686 -fasynchronous-unwind-tables -mtune=pentium4 -gdwarf-4 -fno-debug-types-section -fvar-tracking-assignments -g2 -DDATADIR=\"/usr/share\" -I../h -I../h -I. -I. eval.c make[2]: Leaving directory '/tmp/B.o_glf5h0/BUILD/zephyr-3.1.2/zwgc' make[2]: Entering directory '/tmp/B.o_glf5h0/BUILD/zephyr-3.1.2/zwgc' i686-pld-linux-gcc -c -O2 -fwrapv -pipe -Wformat -Werror=format-security -gdwarf-4 -fno-debug-types-section -fvar-tracking-assignments -g2 -Wp,-D_FORTIFY_SOURCE=2 -fstack-protector-strong --param=ssp-buffer-size=4 -Werror=trampolines -fomit-frame-pointer -march=i686 -fasynchronous-unwind-tables -mtune=pentium4 -gdwarf-4 -fno-debug-types-section -fvar-tracking-assignments -g2 -DDATADIR=\"/usr/share\" -I../h -I../h -I. -I. mux.c make[2]: Leaving directory '/tmp/B.o_glf5h0/BUILD/zephyr-3.1.2/zwgc' make[2]: Entering directory '/tmp/B.o_glf5h0/BUILD/zephyr-3.1.2/zwgc' i686-pld-linux-gcc -c -O2 -fwrapv -pipe -Wformat -Werror=format-security -gdwarf-4 -fno-debug-types-section -fvar-tracking-assignments -g2 -Wp,-D_FORTIFY_SOURCE=2 -fstack-protector-strong --param=ssp-buffer-size=4 -Werror=trampolines -fomit-frame-pointer -march=i686 -fasynchronous-unwind-tables -mtune=pentium4 -gdwarf-4 -fno-debug-types-section -fvar-tracking-assignments -g2 -DDATADIR=\"/usr/share\" -I../h -I../h -I. -I. regexp.c make[2]: Leaving directory '/tmp/B.o_glf5h0/BUILD/zephyr-3.1.2/zwgc' make[2]: Entering directory '/tmp/B.o_glf5h0/BUILD/zephyr-3.1.2/zwgc' i686-pld-linux-gcc -c -O2 -fwrapv -pipe -Wformat -Werror=format-security -gdwarf-4 -fno-debug-types-section -fvar-tracking-assignments -g2 -Wp,-D_FORTIFY_SOURCE=2 -fstack-protector-strong --param=ssp-buffer-size=4 -Werror=trampolines -fomit-frame-pointer -march=i686 -fasynchronous-unwind-tables -mtune=pentium4 -gdwarf-4 -fno-debug-types-section -fvar-tracking-assignments -g2 -DDATADIR=\"/usr/share\" -I../h -I../h -I. -I. notice.c make[2]: Leaving directory '/tmp/B.o_glf5h0/BUILD/zephyr-3.1.2/zwgc' make[2]: Entering directory '/tmp/B.o_glf5h0/BUILD/zephyr-3.1.2/zwgc' i686-pld-linux-gcc -c -O2 -fwrapv -pipe -Wformat -Werror=format-security -gdwarf-4 -fno-debug-types-section -fvar-tracking-assignments -g2 -Wp,-D_FORTIFY_SOURCE=2 -fstack-protector-strong --param=ssp-buffer-size=4 -Werror=trampolines -fomit-frame-pointer -march=i686 -fasynchronous-unwind-tables -mtune=pentium4 -gdwarf-4 -fno-debug-types-section -fvar-tracking-assignments -g2 -DDATADIR=\"/usr/share\" -I../h -I../h -I. -I. port.c make[2]: Leaving directory '/tmp/B.o_glf5h0/BUILD/zephyr-3.1.2/zwgc' make[2]: Entering directory '/tmp/B.o_glf5h0/BUILD/zephyr-3.1.2/zwgc' i686-pld-linux-gcc -c -O2 -fwrapv -pipe -Wformat -Werror=format-security -gdwarf-4 -fno-debug-types-section -fvar-tracking-assignments -g2 -Wp,-D_FORTIFY_SOURCE=2 -fstack-protector-strong --param=ssp-buffer-size=4 -Werror=trampolines -fomit-frame-pointer -march=i686 -fasynchronous-unwind-tables -mtune=pentium4 -gdwarf-4 -fno-debug-types-section -fvar-tracking-assignments -g2 -DDATADIR=\"/usr/share\" -I../h -I../h -I. -I. xcut.c make[2]: Leaving directory '/tmp/B.o_glf5h0/BUILD/zephyr-3.1.2/zwgc' make[2]: Entering directory '/tmp/B.o_glf5h0/BUILD/zephyr-3.1.2/zwgc' i686-pld-linux-gcc -c -O2 -fwrapv -pipe -Wformat -Werror=format-security -gdwarf-4 -fno-debug-types-section -fvar-tracking-assignments -g2 -Wp,-D_FORTIFY_SOURCE=2 -fstack-protector-strong --param=ssp-buffer-size=4 -Werror=trampolines -fomit-frame-pointer -march=i686 -fasynchronous-unwind-tables -mtune=pentium4 -gdwarf-4 -fno-debug-types-section -fvar-tracking-assignments -g2 -DDATADIR=\"/usr/share\" -I../h -I../h -I. -I. subscriptions.c make[2]: Leaving directory '/tmp/B.o_glf5h0/BUILD/zephyr-3.1.2/zwgc' make[2]: Entering directory '/tmp/B.o_glf5h0/BUILD/zephyr-3.1.2/zwgc' i686-pld-linux-gcc -c -O2 -fwrapv -pipe -Wformat -Werror=format-security -gdwarf-4 -fno-debug-types-section -fvar-tracking-assignments -g2 -Wp,-D_FORTIFY_SOURCE=2 -fstack-protector-strong --param=ssp-buffer-size=4 -Werror=trampolines -fomit-frame-pointer -march=i686 -fasynchronous-unwind-tables -mtune=pentium4 -gdwarf-4 -fno-debug-types-section -fvar-tracking-assignments -g2 -DDATADIR=\"/usr/share\" -I../h -I../h -I. -I. character_class.c make[2]: Leaving directory '/tmp/B.o_glf5h0/BUILD/zephyr-3.1.2/zwgc' make[2]: Entering directory '/tmp/B.o_glf5h0/BUILD/zephyr-3.1.2/zwgc' i686-pld-linux-gcc -c -O2 -fwrapv -pipe -Wformat -Werror=format-security -gdwarf-4 -fno-debug-types-section -fvar-tracking-assignments -g2 -Wp,-D_FORTIFY_SOURCE=2 -fstack-protector-strong --param=ssp-buffer-size=4 -Werror=trampolines -fomit-frame-pointer -march=i686 -fasynchronous-unwind-tables -mtune=pentium4 -gdwarf-4 -fno-debug-types-section -fvar-tracking-assignments -g2 -DDATADIR=\"/usr/share\" -I../h -I../h -I. -I. file.c make[2]: Leaving directory '/tmp/B.o_glf5h0/BUILD/zephyr-3.1.2/zwgc' make[2]: Entering directory '/tmp/B.o_glf5h0/BUILD/zephyr-3.1.2/zwgc' i686-pld-linux-gcc -c -O2 -fwrapv -pipe -Wformat -Werror=format-security -gdwarf-4 -fno-debug-types-section -fvar-tracking-assignments -g2 -Wp,-D_FORTIFY_SOURCE=2 -fstack-protector-strong --param=ssp-buffer-size=4 -Werror=trampolines -fomit-frame-pointer -march=i686 -fasynchronous-unwind-tables -mtune=pentium4 -gdwarf-4 -fno-debug-types-section -fvar-tracking-assignments -g2 -DDATADIR=\"/usr/share\" -I../h -I../h -I. -I. error.c make[2]: Leaving directory '/tmp/B.o_glf5h0/BUILD/zephyr-3.1.2/zwgc' make[2]: Entering directory '/tmp/B.o_glf5h0/BUILD/zephyr-3.1.2/zwgc' i686-pld-linux-gcc -c -O2 -fwrapv -pipe -Wformat -Werror=format-security -gdwarf-4 -fno-debug-types-section -fvar-tracking-assignments -g2 -Wp,-D_FORTIFY_SOURCE=2 -fstack-protector-strong --param=ssp-buffer-size=4 -Werror=trampolines -fomit-frame-pointer -march=i686 -fasynchronous-unwind-tables -mtune=pentium4 -gdwarf-4 -fno-debug-types-section -fvar-tracking-assignments -g2 -DDATADIR=\"/usr/share\" -I../h -I../h -I. -I. formatter.c In file included from formatter.c:25: string_dictionary.h:2:1: error: unknown type name 'the' 2 | the Project Athena Zephyr Notification System. | ^~~ string_dictionary.h:2:13: error: expected '=', ',', ';', 'asm' or '__attribute__' before 'Athena' 2 | the Project Athena Zephyr Notification System. | ^~~~~~ string_dictionary.h:2:13: error: unknown type name 'Athena' string_dictionary.h:6:44: error: stray '@' in program 6 | * Created by: Marc Horowitz <marc@athena.mit.edu> | ^ string_dictionary.h:22:3: warning: data definition has no type or storage class 22 | } string_dictionary_binding; | ^~~~~~~~~~~~~~~~~~~~~~~~~ string_dictionary.h:22:3: warning: type defaults to 'int' in declaration of 'string_dictionary_binding' [-Wimplicit-int] string_dictionary.h:26:5: error: expected specifier-qualifier-list before 'string_dictionary_binding' 26 | string_dictionary_binding **slots; | ^~~~~~~~~~~~~~~~~~~~~~~~~ string_dictionary.h:68:69: error: expected declaration specifiers or '...' before 'string_dictionary_binding' 68 | extern void string_dictionary_Enumerate(string_dictionary, void (*)(string_dictionary_binding *)); | ^~~~~~~~~~~~~~~~~~~~~~~~~ string_dictionary.h:78:34: error: expected '=', ',', ';', 'asm' or '__attribute__' before '*' token 78 | extern string_dictionary_binding *string_dictionary_Lookup(string_dictionary, | ^ string_dictionary.h:97:34: error: expected '=', ',', ';', 'asm' or '__attribute__' before '*' token 97 | extern string_dictionary_binding *string_dictionary_Define(string_dictionary, | ^ string_dictionary.h:111:38: error: expected declaration specifiers or '...' before 'string_dictionary_binding' 111 | string_dictionary_binding *); | ^~~~~~~~~~~~~~~~~~~~~~~~~ make[2]: *** [Makefile:91: formatter.o] Error 1 make[2]: Leaving directory '/tmp/B.o_glf5h0/BUILD/zephyr-3.1.2/zwgc' make[2]: *** Waiting for unfinished jobs.... make[2]: Entering directory '/tmp/B.o_glf5h0/BUILD/zephyr-3.1.2/zwgc' i686-pld-linux-gcc -c -O2 -fwrapv -pipe -Wformat -Werror=format-security -gdwarf-4 -fno-debug-types-section -fvar-tracking-assignments -g2 -Wp,-D_FORTIFY_SOURCE=2 -fstack-protector-strong --param=ssp-buffer-size=4 -Werror=trampolines -fomit-frame-pointer -march=i686 -fasynchronous-unwind-tables -mtune=pentium4 -gdwarf-4 -fno-debug-types-section -fvar-tracking-assignments -g2 -DDATADIR=\"/usr/share\" -I../h -I../h -I. -I. variables.c In file included from string_dictionary_aux.h:18, from variables.c:30: string_dictionary.h:2:1: error: unknown type name 'the' 2 | the Project Athena Zephyr Notification System. | ^~~ string_dictionary.h:2:13: error: expected '=', ',', ';', 'asm' or '__attribute__' before 'Athena' 2 | the Project Athena Zephyr Notification System. | ^~~~~~ string_dictionary.h:2:13: error: unknown type name 'Athena' string_dictionary.h:6:44: error: stray '@' in program 6 | * Created by: Marc Horowitz <marc@athena.mit.edu> | ^ string_dictionary.h:22:3: warning: data definition has no type or storage class 22 | } string_dictionary_binding; | ^~~~~~~~~~~~~~~~~~~~~~~~~ string_dictionary.h:22:3: warning: type defaults to 'int' in declaration of 'string_dictionary_binding' [-Wimplicit-int] string_dictionary.h:26:5: error: expected specifier-qualifier-list before 'string_dictionary_binding' 26 | string_dictionary_binding **slots; | ^~~~~~~~~~~~~~~~~~~~~~~~~ string_dictionary.h:68:69: error: expected declaration specifiers or '...' before 'string_dictionary_binding' 68 | extern void string_dictionary_Enumerate(string_dictionary, void (*)(string_dictionary_binding *)); | ^~~~~~~~~~~~~~~~~~~~~~~~~ string_dictionary.h:78:34: error: expected '=', ',', ';', 'asm' or '__attribute__' before '*' token 78 | extern string_dictionary_binding *string_dictionary_Lookup(string_dictionary, | ^ string_dictionary.h:97:34: error: expected '=', ',', ';', 'asm' or '__attribute__' before '*' token 97 | extern string_dictionary_binding *string_dictionary_Define(string_dictionary, | ^ string_dictionary.h:111:38: error: expected declaration specifiers or '...' before 'string_dictionary_binding' 111 | string_dictionary_binding *); | ^~~~~~~~~~~~~~~~~~~~~~~~~ variables.c: In function 'var_set_variable_then_free_value': variables.c:199:32: error: 'binding' undeclared (first use in this function) 199 | string_dictionary_binding *binding; | ^~~~~~~ variables.c:199:32: note: each undeclared identifier is reported only once for each function it appears in variables.c:213:15: warning: implicit declaration of function 'string_dictionary_Define'; did you mean 'string_dictionary_Fetch'? [-Wimplicit-function-declaration] 213 | binding = string_dictionary_Define(non_number_variable_dict, name, | ^~~~~~~~~~~~~~~~~~~~~~~~ | string_dictionary_Fetch make[2]: *** [Makefile:91: variables.o] Error 1 make[2]: Leaving directory '/tmp/B.o_glf5h0/BUILD/zephyr-3.1.2/zwgc' make[2]: Entering directory '/tmp/B.o_glf5h0/BUILD/zephyr-3.1.2/zwgc' i686-pld-linux-gcc -c -O2 -fwrapv -pipe -Wformat -Werror=format-security -gdwarf-4 -fno-debug-types-section -fvar-tracking-assignments -g2 -Wp,-D_FORTIFY_SOURCE=2 -fstack-protector-strong --param=ssp-buffer-size=4 -Werror=trampolines -fomit-frame-pointer -march=i686 -fasynchronous-unwind-tables -mtune=pentium4 -gdwarf-4 -fno-debug-types-section -fvar-tracking-assignments -g2 -DDATADIR=\"/usr/share\" -I../h -I../h -I. -I. tty_filter.c In file included from string_dictionary_aux.h:18, from tty_filter.c:47: string_dictionary.h:2:1: error: unknown type name 'the' 2 | the Project Athena Zephyr Notification System. | ^~~ string_dictionary.h:2:13: error: expected '=', ',', ';', 'asm' or '__attribute__' before 'Athena' 2 | the Project Athena Zephyr Notification System. | ^~~~~~ string_dictionary.h:2:13: error: unknown type name 'Athena' string_dictionary.h:6:44: error: stray '@' in program 6 | * Created by: Marc Horowitz <marc@athena.mit.edu> | ^ string_dictionary.h:22:3: warning: data definition has no type or storage class 22 | } string_dictionary_binding; | ^~~~~~~~~~~~~~~~~~~~~~~~~ string_dictionary.h:22:3: warning: type defaults to 'int' in declaration of 'string_dictionary_binding' [-Wimplicit-int] string_dictionary.h:26:5: error: expected specifier-qualifier-list before 'string_dictionary_binding' 26 | string_dictionary_binding **slots; | ^~~~~~~~~~~~~~~~~~~~~~~~~ string_dictionary.h:68:69: error: expected declaration specifiers or '...' before 'string_dictionary_binding' 68 | extern void string_dictionary_Enumerate(string_dictionary, void (*)(string_dictionary_binding *)); | ^~~~~~~~~~~~~~~~~~~~~~~~~ string_dictionary.h:78:34: error: expected '=', ',', ';', 'asm' or '__attribute__' before '*' token 78 | extern string_dictionary_binding *string_dictionary_Lookup(string_dictionary, | ^ string_dictionary.h:97:34: error: expected '=', ',', ';', 'asm' or '__attribute__' before '*' token 97 | extern string_dictionary_binding *string_dictionary_Define(string_dictionary, | ^ string_dictionary.h:111:38: error: expected declaration specifiers or '...' before 'string_dictionary_binding' 111 | string_dictionary_binding *); | ^~~~~~~~~~~~~~~~~~~~~~~~~ tty_filter.c: In function 'tty_filter_init': tty_filter.c:114:32: error: 'b' undeclared (first use in this function) 114 | string_dictionary_binding *b; | ^ tty_filter.c:114:32: note: each undeclared identifier is reported only once for each function it appears in tty_filter.c:92:22: warning: implicit declaration of function 'string_dictionary_Define'; did you mean 'string_dictionary_Fetch'? [-Wimplicit-function-declaration] 92 | #define TD_SET(k,v) (string_dictionary_Define(termcap_dict, (k), &ex)->value \ | ^~~~~~~~~~~~~~~~~~~~~~~~ tty_filter.c:95:41: note: in expansion of macro 'TD_SET' 95 | *code_buf_pos++ = 0, TD_SET(k, code)) | ^~~~~~ tty_filter.c:152:13: note: in expansion of macro 'EXPAND' 152 | EXPAND("B.bold"); | ^~~~~~ tty_filter.c:92:70: error: invalid type argument of '->' (have 'int') 92 | #define TD_SET(k,v) (string_dictionary_Define(termcap_dict, (k), &ex)->value \ | ^~ tty_filter.c:95:41: note: in expansion of macro 'TD_SET' 95 | *code_buf_pos++ = 0, TD_SET(k, code)) | ^~~~~~ tty_filter.c:152:13: note: in expansion of macro 'EXPAND' 152 | EXPAND("B.bold"); | ^~~~~~ tty_filter.c:92:70: error: invalid type argument of '->' (have 'int') 92 | #define TD_SET(k,v) (string_dictionary_Define(termcap_dict, (k), &ex)->value \ | ^~ tty_filter.c:95:41: note: in expansion of macro 'TD_SET' 95 | *code_buf_pos++ = 0, TD_SET(k, code)) | ^~~~~~ tty_filter.c:154:13: note: in expansion of macro 'EXPAND' 154 | EXPAND("E.bold"); | ^~~~~~ tty_filter.c:92:70: error: invalid type argument of '->' (have 'int') 92 | #define TD_SET(k,v) (string_dictionary_Define(termcap_dict, (k), &ex)->value \ | ^~ tty_filter.c:95:41: note: in expansion of macro 'TD_SET' 95 | *code_buf_pos++ = 0, TD_SET(k, code)) | ^~~~~~ tty_filter.c:158:13: note: in expansion of macro 'EXPAND' 158 | EXPAND("B.rw"); | ^~~~~~ tty_filter.c:92:70: error: invalid type argument of '->' (have 'int') 92 | #define TD_SET(k,v) (string_dictionary_Define(termcap_dict, (k), &ex)->value \ | ^~ tty_filter.c:95:41: note: in expansion of macro 'TD_SET' 95 | *code_buf_pos++ = 0, TD_SET(k, code)) | ^~~~~~ tty_filter.c:160:13: note: in expansion of macro 'EXPAND' 160 | EXPAND("E.rw"); | ^~~~~~ tty_filter.c:92:70: error: invalid type argument of '->' (have 'int') 92 | #define TD_SET(k,v) (string_dictionary_Define(termcap_dict, (k), &ex)->value \ | ^~ tty_filter.c:95:41: note: in expansion of macro 'TD_SET' 95 | *code_buf_pos++ = 0, TD_SET(k, code)) | ^~~~~~ tty_filter.c:164:13: note: in expansion of macro 'EXPAND' 164 | EXPAND("B.bell"); | ^~~~~~ tty_filter.c:92:70: error: invalid type argument of '->' (have 'int') 92 | #define TD_SET(k,v) (string_dictionary_Define(termcap_dict, (k), &ex)->value \ | ^~ tty_filter.c:165:13: note: in expansion of macro 'TD_SET' 165 | TD_SET("E.bell", NULL); | ^~~~~~ tty_filter.c:92:70: error: invalid type argument of '->' (have 'int') 92 | #define TD_SET(k,v) (string_dictionary_Define(termcap_dict, (k), &ex)->value \ | ^~ tty_filter.c:95:41: note: in expansion of macro 'TD_SET' 95 | *code_buf_pos++ = 0, TD_SET(k, code)) | ^~~~~~ tty_filter.c:169:13: note: in expansion of macro 'EXPAND' 169 | EXPAND("B.blink"); | ^~~~~~ tty_filter.c:92:70: error: invalid type argument of '->' (have 'int') 92 | #define TD_SET(k,v) (string_dictionary_Define(termcap_dict, (k), &ex)->value \ | ^~ tty_filter.c:95:41: note: in expansion of macro 'TD_SET' 95 | *code_buf_pos++ = 0, TD_SET(k, code)) | ^~~~~~ tty_filter.c:171:13: note: in expansion of macro 'EXPAND' 171 | EXPAND("E.blink"); | ^~~~~~ tty_filter.c:92:70: error: invalid type argument of '->' (have 'int') 92 | #define TD_SET(k,v) (string_dictionary_Define(termcap_dict, (k), &ex)->value \ | ^~ tty_filter.c:95:41: note: in expansion of macro 'TD_SET' 95 | *code_buf_pos++ = 0, TD_SET(k, code)) | ^~~~~~ tty_filter.c:175:13: note: in expansion of macro 'EXPAND' 175 | EXPAND("B.u"); | ^~~~~~ tty_filter.c:92:70: error: invalid type argument of '->' (have 'int') 92 | #define TD_SET(k,v) (string_dictionary_Define(termcap_dict, (k), &ex)->value \ | ^~ tty_filter.c:95:41: note: in expansion of macro 'TD_SET' 95 | *code_buf_pos++ = 0, TD_SET(k, code)) | ^~~~~~ tty_filter.c:177:13: note: in expansion of macro 'EXPAND' 177 | EXPAND("E.u"); | ^~~~~~ tty_filter.c:92:70: error: invalid type argument of '->' (have 'int') 92 | #define TD_SET(k,v) (string_dictionary_Define(termcap_dict, (k), &ex)->value \ | ^~ tty_filter.c:95:41: note: in expansion of macro 'TD_SET' 95 | *code_buf_pos++ = 0, TD_SET(k, code)) | ^~~~~~ tty_filter.c:181:13: note: in expansion of macro 'EXPAND' 181 | EXPAND("B.so"); | ^~~~~~ tty_filter.c:92:70: error: invalid type argument of '->' (have 'int') 92 | #define TD_SET(k,v) (string_dictionary_Define(termcap_dict, (k), &ex)->value \ | ^~ tty_filter.c:95:41: note: in expansion of macro 'TD_SET' 95 | *code_buf_pos++ = 0, TD_SET(k, code)) | ^~~~~~ tty_filter.c:183:13: note: in expansion of macro 'EXPAND' 183 | EXPAND("E.so"); | ^~~~~~ tty_filter.c:189:17: warning: implicit declaration of function 'string_dictionary_Lookup'; did you mean 'string_dictionary_Fetch'? [-Wimplicit-function-declaration] 189 | if (NULL == string_dictionary_Lookup(termcap_dict, "B.bold")) { | ^~~~~~~~~~~~~~~~~~~~~~~~ | string_dictionary_Fetch tty_filter.c:189:14: warning: comparison between pointer and integer 189 | if (NULL == string_dictionary_Lookup(termcap_dict, "B.bold")) { | ^~ tty_filter.c:92:70: error: invalid type argument of '->' (have 'int') 92 | #define TD_SET(k,v) (string_dictionary_Define(termcap_dict, (k), &ex)->value \ | ^~ tty_filter.c:191:13: note: in expansion of macro 'TD_SET' 191 | TD_SET("B.bold", b->value); | ^~~~~~ tty_filter.c:92:70: error: invalid type argument of '->' (have 'int') 92 | #define TD_SET(k,v) (string_dictionary_Define(termcap_dict, (k), &ex)->value \ | ^~ tty_filter.c:192:13: note: in expansion of macro 'TD_SET' 192 | TD_SET("E.bold", | ^~~~~~ tty_filter.c:193:66: error: invalid type argument of '->' (have 'int') 193 | string_dictionary_Lookup(termcap_dict, "E.so")->value); | ^~ tty_filter.c:93:25: note: in definition of macro 'TD_SET' 93 | = (v)) | ^ tty_filter.c:92:70: error: invalid type argument of '->' (have 'int') 92 | #define TD_SET(k,v) (string_dictionary_Define(termcap_dict, (k), &ex)->value \ | ^~ tty_filter.c:195:13: note: in expansion of macro 'TD_SET' 195 | TD_SET("B.bold", b->value); | ^~~~~~ tty_filter.c:92:70: error: invalid type argument of '->' (have 'int') 92 | #define TD_SET(k,v) (string_dictionary_Define(termcap_dict, (k), &ex)->value \ | ^~ tty_filter.c:196:13: note: in expansion of macro 'TD_SET' 196 | TD_SET("E.bold", | ^~~~~~ tty_filter.c:197:66: error: invalid type argument of '->' (have 'int') 197 | string_dictionary_Lookup(termcap_dict, "E.rv")->value); | ^~ tty_filter.c:93:25: note: in definition of macro 'TD_SET' 93 | = (v)) | ^ tty_filter.c:92:70: error: invalid type argument of '->' (have 'int') 92 | #define TD_SET(k,v) (string_dictionary_Define(termcap_dict, (k), &ex)->value \ | ^~ tty_filter.c:199:13: note: in expansion of macro 'TD_SET' 199 | TD_SET("B.bold", b->value); | ^~~~~~ tty_filter.c:92:70: error: invalid type argument of '->' (have 'int') 92 | #define TD_SET(k,v) (string_dictionary_Define(termcap_dict, (k), &ex)->value \ | ^~ tty_filter.c:200:13: note: in expansion of macro 'TD_SET' 200 | TD_SET("E.bold", | ^~~~~~ tty_filter.c:201:65: error: invalid type argument of '->' (have 'int') 201 | string_dictionary_Lookup(termcap_dict, "E.u")->value); | ^~ tty_filter.c:93:25: note: in definition of macro 'TD_SET' 93 | = (v)) | ^ tty_filter.c:206:14: warning: comparison between pointer and integer 206 | if (NULL == string_dictionary_Lookup(termcap_dict, "B.bell")) { | ^~ tty_filter.c:92:70: error: invalid type argument of '->' (have 'int') 92 | #define TD_SET(k,v) (string_dictionary_Define(termcap_dict, (k), &ex)->value \ | ^~ tty_filter.c:207:9: note: in expansion of macro 'TD_SET' 207 | TD_SET("B.bell", "\007"); | ^~~~~~ tty_filter.c:92:70: error: invalid type argument of '->' (have 'int') 92 | #define TD_SET(k,v) (string_dictionary_Define(termcap_dict, (k), &ex)->value \ | ^~ tty_filter.c:208:9: note: in expansion of macro 'TD_SET' 208 | TD_SET("E.bell", NULL); | ^~~~~~ tty_filter.c: In function 'convert_desc_to_tty_str_info': tty_filter.c:379:40: error: 'b' undeclared (first use in this function) 379 | string_dictionary_binding *b; | ^ make[2]: *** [Makefile:91: tty_filter.o] Error 1 make[2]: Leaving directory '/tmp/B.o_glf5h0/BUILD/zephyr-3.1.2/zwgc' make[2]: Entering directory '/tmp/B.o_glf5h0/BUILD/zephyr-3.1.2/zwgc' i686-pld-linux-gcc -c -O2 -fwrapv -pipe -Wformat -Werror=format-security -gdwarf-4 -fno-debug-types-section -fvar-tracking-assignments -g2 -Wp,-D_FORTIFY_SOURCE=2 -fstack-protector-strong --param=ssp-buffer-size=4 -Werror=trampolines -fomit-frame-pointer -march=i686 -fasynchronous-unwind-tables -mtune=pentium4 -gdwarf-4 -fno-debug-types-section -fvar-tracking-assignments -g2 -DDATADIR=\"/usr/share\" -I../h -I../h -I. -I. X_fonts.c make[2]: Leaving directory '/tmp/B.o_glf5h0/BUILD/zephyr-3.1.2/zwgc' make[2]: Entering directory '/tmp/B.o_glf5h0/BUILD/zephyr-3.1.2/zwgc' i686-pld-linux-gcc -c -O2 -fwrapv -pipe -Wformat -Werror=format-security -gdwarf-4 -fno-debug-types-section -fvar-tracking-assignments -g2 -Wp,-D_FORTIFY_SOURCE=2 -fstack-protector-strong --param=ssp-buffer-size=4 -Werror=trampolines -fomit-frame-pointer -march=i686 -fasynchronous-unwind-tables -mtune=pentium4 -gdwarf-4 -fno-debug-types-section -fvar-tracking-assignments -g2 -DDATADIR=\"/usr/share\" -I../h -I../h -I. -I. X_gram.c make[2]: Leaving directory '/tmp/B.o_glf5h0/BUILD/zephyr-3.1.2/zwgc' make[1]: *** [Makefile:35: all] Error 1 make: *** [Makefile:22: build] Error 2 error: Bad exit status from /tmp/B.o_glf5h0/BUILD/tmp/rpm-tmp.fmUbkI (%build) RPM build errors: Could not canonicalize hostname: nereid Bad exit status from /tmp/B.o_glf5h0/BUILD/tmp/rpm-tmp.fmUbkI (%build) ended at: Sun Nov 21 08:58:16 2021, done in 0:00:25.850588 error: No files produced. + chmod -R u+rwX /tmp/B.o_glf5h0/BUILD + rm -rf /tmp/B.o_glf5h0/tmp /tmp/B.o_glf5h0/BUILD + rm -rf /tmp/B.o_glf5h0 Begin-PLD-Builder-Info Build-Time: user:42.63s sys:11.23s real:27.63s (faults io:48 non-io:2822707) End-PLD-Builder-Info
[Back to list of logs] [View rpm -qa of builder]