FailedOk

th/SRPMS[OK]
th/x32[OK]
th/i686[OK]
th/x86_64[OK]

ac/SRPMS[OK]
ac/i386[OK]
ac/i586[OK]
ac/i686[OK]
ac/alpha[OK]
ac/amd64[OK]
ac/athlon[OK]
ac/ppc[OK]
ac/sparc[OK]
ac/sparc64[OK]

Advanced Search
main()
Powered by PLD Linux
(c) 2002-2021 PLD Team
$Revision: 1.37 $
Powered by Real Computer.
Your IP: 52.23.219.12

zephyr ce901fa8-f17a-4397-882a-6912162f02ad

Status:Failed
Source URL:https://buildlogs.pld-linux.org/pld/th/i686/FAIL/zephyr,ce901fa8-f17a-4397-882a-6912162f02ad.bz2
text/plain URL:View!
full text:View!
rpm -qa of builder:View!
Date:2021/11/21 08:58:17
Runtime:0:00:25.850588

Toc:

  • error 1
  • string_dictionary.h:2:1: error: unknown type name 'the'
  • error 2
  • string_dictionary.h:2:13: error: expected '=', ',', ';', 'asm' or '__attribute__' before 'Athena'
  • error 3
  • string_dictionary.h:2:13: error: unknown type name 'Athena'
  • error 4
  • string_dictionary.h:6:44: error: stray '@' in program
  • error 5
  • string_dictionary.h:26:5: error: expected specifier-qualifier-list before 'string_dictionary_binding'
  • error 6
  • string_dictionary.h:68:69: error: expected declaration specifiers or '...' before 'string_dictionary_binding'
  • error 7
  • string_dictionary.h:78:34: error: expected '=', ',', ';', 'asm' or '__attribute__' before '*' token
  • error 8
  • string_dictionary.h:97:34: error: expected '=', ',', ';', 'asm' or '__attribute__' before '*' token
  • error 9
  • string_dictionary.h:111:38: error: expected declaration specifiers or '...' before 'string_dictionary_binding'
  • error 10
  • make[2]: *** [Makefile:91: formatter.o] Error 1
  • error 11
  • string_dictionary.h:2:1: error: unknown type name 'the'
  • error 12
  • string_dictionary.h:2:13: error: expected '=', ',', ';', 'asm' or '__attribute__' before 'Athena'
  • error 13
  • string_dictionary.h:2:13: error: unknown type name 'Athena'
  • error 14
  • string_dictionary.h:6:44: error: stray '@' in program
  • error 15
  • string_dictionary.h:26:5: error: expected specifier-qualifier-list before 'string_dictionary_binding'
  • error 16
  • string_dictionary.h:68:69: error: expected declaration specifiers or '...' before 'string_dictionary_binding'
  • error 17
  • string_dictionary.h:78:34: error: expected '=', ',', ';', 'asm' or '__attribute__' before '*' token
  • error 18
  • string_dictionary.h:97:34: error: expected '=', ',', ';', 'asm' or '__attribute__' before '*' token
  • error 19
  • string_dictionary.h:111:38: error: expected declaration specifiers or '...' before 'string_dictionary_binding'
  • error 20
  • variables.c:199:32: error: 'binding' undeclared (first use in this function)
  • error 21
  • make[2]: *** [Makefile:91: variables.o] Error 1
  • error 22
  • string_dictionary.h:2:1: error: unknown type name 'the'
  • error 23
  • string_dictionary.h:2:13: error: expected '=', ',', ';', 'asm' or '__attribute__' before 'Athena'
  • error 24
  • string_dictionary.h:2:13: error: unknown type name 'Athena'
  • error 25
  • string_dictionary.h:6:44: error: stray '@' in program
  • error 26
  • string_dictionary.h:26:5: error: expected specifier-qualifier-list before 'string_dictionary_binding'
  • error 27
  • string_dictionary.h:68:69: error: expected declaration specifiers or '...' before 'string_dictionary_binding'
  • error 28
  • string_dictionary.h:78:34: error: expected '=', ',', ';', 'asm' or '__attribute__' before '*' token
  • error 29
  • string_dictionary.h:97:34: error: expected '=', ',', ';', 'asm' or '__attribute__' before '*' token
  • error 30
  • string_dictionary.h:111:38: error: expected declaration specifiers or '...' before 'string_dictionary_binding'
  • error 31
  • tty_filter.c:114:32: error: 'b' undeclared (first use in this function)
  • error 32
  • tty_filter.c:92:70: error: invalid type argument of '->' (have 'int')
  • error 33
  • tty_filter.c:92:70: error: invalid type argument of '->' (have 'int')
  • error 34
  • tty_filter.c:92:70: error: invalid type argument of '->' (have 'int')
  • error 35
  • tty_filter.c:92:70: error: invalid type argument of '->' (have 'int')
  • error 36
  • tty_filter.c:92:70: error: invalid type argument of '->' (have 'int')
  • error 37
  • tty_filter.c:92:70: error: invalid type argument of '->' (have 'int')
  • error 38
  • tty_filter.c:92:70: error: invalid type argument of '->' (have 'int')
  • error 39
  • tty_filter.c:92:70: error: invalid type argument of '->' (have 'int')
  • error 40
  • tty_filter.c:92:70: error: invalid type argument of '->' (have 'int')
  • error 41
  • tty_filter.c:92:70: error: invalid type argument of '->' (have 'int')
  • error 42
  • tty_filter.c:92:70: error: invalid type argument of '->' (have 'int')
  • error 43
  • tty_filter.c:92:70: error: invalid type argument of '->' (have 'int')
  • error 44
  • tty_filter.c:92:70: error: invalid type argument of '->' (have 'int')
  • error 45
  • tty_filter.c:92:70: error: invalid type argument of '->' (have 'int')
  • error 46
  • tty_filter.c:193:66: error: invalid type argument of '->' (have 'int')
  • error 47
  • tty_filter.c:92:70: error: invalid type argument of '->' (have 'int')
  • error 48
  • tty_filter.c:92:70: error: invalid type argument of '->' (have 'int')
  • error 49
  • tty_filter.c:197:66: error: invalid type argument of '->' (have 'int')
  • error 50
  • tty_filter.c:92:70: error: invalid type argument of '->' (have 'int')
  • error 51
  • tty_filter.c:92:70: error: invalid type argument of '->' (have 'int')
  • error 52
  • tty_filter.c:201:65: error: invalid type argument of '->' (have 'int')
  • error 53
  • tty_filter.c:92:70: error: invalid type argument of '->' (have 'int')
  • error 54
  • tty_filter.c:92:70: error: invalid type argument of '->' (have 'int')
  • error 55
  • tty_filter.c:379:40: error: 'b' undeclared (first use in this function)
  • error 56
  • make[2]: *** [Makefile:91: tty_filter.o] Error 1
  • error 57
  • make[1]: *** [Makefile:35: all] Error 1
  • error 58
  • error: Bad exit status from /tmp/B.o_glf5h0/BUILD/tmp/rpm-tmp.fmUbkI (%build)
  • error 59
  • RPM build errors:
  • error 60
  • error: No files produced.

Content:

i686-pld-linux-gcc -c -O2 -fwrapv -pipe -Wformat -Werror=format-security -gdwarf-4 -fno-debug-types-section -fvar-tracking-assignments -g2 -Wp,-D_FORTIFY_SOURCE=2 -fstack-protector-strong --param=ssp-buffer-size=4 -Werror=trampolines -fomit-frame-pointer -march=i686 -fasynchronous-unwind-tables -mtune=pentium4 -gdwarf-4 -fno-debug-types-section -fvar-tracking-assignments -g2  -I../h -I../h  zhm_server.c
make[2]: Leaving directory '/tmp/B.o_glf5h0/BUILD/zephyr-3.1.2/zhm'
make[2]: Entering directory '/tmp/B.o_glf5h0/BUILD/zephyr-3.1.2/zhm'
i686-pld-linux-gcc -c -O2 -fwrapv -pipe -Wformat -Werror=format-security -gdwarf-4 -fno-debug-types-section -fvar-tracking-assignments -g2 -Wp,-D_FORTIFY_SOURCE=2 -fstack-protector-strong --param=ssp-buffer-size=4 -Werror=trampolines -fomit-frame-pointer -march=i686 -fasynchronous-unwind-tables -mtune=pentium4 -gdwarf-4 -fno-debug-types-section -fvar-tracking-assignments -g2  -I../h -I../h  zhm.c
make[2]: Leaving directory '/tmp/B.o_glf5h0/BUILD/zephyr-3.1.2/zhm'
make[2]: Entering directory '/tmp/B.o_glf5h0/BUILD/zephyr-3.1.2/zhm'
/bin/sh ../libtool --mode=link i686-pld-linux-gcc -Wl,--as-needed -Wl,--no-copy-dt-needed-entries -Wl,-z,relro -Wl,-z,combreloc  -o zhm timer.o queue.o zhm.o zhm_client.o zhm_server.o ../lib/libzephyr.la  -lcom_err
libtool: link: i686-pld-linux-gcc -Wl,--as-needed -Wl,--no-copy-dt-needed-entries -Wl,-z -Wl,relro -Wl,-z -Wl,combreloc -o .libs/zhm timer.o queue.o zhm.o zhm_client.o zhm_server.o  ../lib/.libs/libzephyr.so /usr/lib/libkrb5.so /usr/lib/libhx509.so /usr/lib/libwind.so /usr/lib/libsqlite3.so -lm -lz -ldl /usr/lib/libhcrypto.so /usr/lib/libasn1.so /usr/lib/libheimbase.so -lcrypto /usr/lib/libroken.so -lcrypt -lpthread -lcom_err -pthread
make[2]: Leaving directory '/tmp/B.o_glf5h0/BUILD/zephyr-3.1.2/zhm'
make[2]: Entering directory '/tmp/B.o_glf5h0/BUILD/zephyr-3.1.2/zwgc'
./instantiate . stack string
make[2]: Leaving directory '/tmp/B.o_glf5h0/BUILD/zephyr-3.1.2/zwgc'
make[2]: Entering directory '/tmp/B.o_glf5h0/BUILD/zephyr-3.1.2/zwgc'
./instantiate . dictionary port port.h
make[2]: Leaving directory '/tmp/B.o_glf5h0/BUILD/zephyr-3.1.2/zwgc'
make[2]: Entering directory '/tmp/B.o_glf5h0/BUILD/zephyr-3.1.2/zwgc'
./instantiate . dictionary unsigned_long unsigned_long.h
make[2]: Leaving directory '/tmp/B.o_glf5h0/BUILD/zephyr-3.1.2/zwgc'
make[2]: Entering directory '/tmp/B.o_glf5h0/BUILD/zephyr-3.1.2/zwgc'
./instantiate . dictionary pointer pointer.h
make[2]: Leaving directory '/tmp/B.o_glf5h0/BUILD/zephyr-3.1.2/zwgc'
make[2]: Entering directory '/tmp/B.o_glf5h0/BUILD/zephyr-3.1.2/zwgc'
./instantiate . dictionary int
make[2]: Leaving directory '/tmp/B.o_glf5h0/BUILD/zephyr-3.1.2/zwgc'
make[2]: Entering directory '/tmp/B.o_glf5h0/BUILD/zephyr-3.1.2/zwgc'
./instantiate . dictionary int
make[2]: Leaving directory '/tmp/B.o_glf5h0/BUILD/zephyr-3.1.2/zwgc'
make[2]: Entering directory '/tmp/B.o_glf5h0/BUILD/zephyr-3.1.2/zwgc'
./instantiate . dictionary string new_string.h
make[2]: Leaving directory '/tmp/B.o_glf5h0/BUILD/zephyr-3.1.2/zwgc'
make[2]: Entering directory '/tmp/B.o_glf5h0/BUILD/zephyr-3.1.2/zwgc'
./instantiate . dictionary string new_string.h
make[2]: Leaving directory '/tmp/B.o_glf5h0/BUILD/zephyr-3.1.2/zwgc'
make[2]: Entering directory '/tmp/B.o_glf5h0/BUILD/zephyr-3.1.2/zwgc'
i686-pld-linux-gcc -c -O2 -fwrapv -pipe -Wformat -Werror=format-security -gdwarf-4 -fno-debug-types-section -fvar-tracking-assignments -g2 -Wp,-D_FORTIFY_SOURCE=2 -fstack-protector-strong --param=ssp-buffer-size=4 -Werror=trampolines -fomit-frame-pointer -march=i686 -fasynchronous-unwind-tables -mtune=pentium4 -gdwarf-4 -fno-debug-types-section -fvar-tracking-assignments -g2  -DDATADIR=\"/usr/share\" -I../h -I../h -I. -I.   buffer.c
make[2]: Leaving directory '/tmp/B.o_glf5h0/BUILD/zephyr-3.1.2/zwgc'
make[2]: Entering directory '/tmp/B.o_glf5h0/BUILD/zephyr-3.1.2/zwgc'
i686-pld-linux-gcc -c -O2 -fwrapv -pipe -Wformat -Werror=format-security -gdwarf-4 -fno-debug-types-section -fvar-tracking-assignments -g2 -Wp,-D_FORTIFY_SOURCE=2 -fstack-protector-strong --param=ssp-buffer-size=4 -Werror=trampolines -fomit-frame-pointer -march=i686 -fasynchronous-unwind-tables -mtune=pentium4 -gdwarf-4 -fno-debug-types-section -fvar-tracking-assignments -g2  -DDATADIR=\"/usr/share\" -I../h -I../h -I. -I.   node.c
make[2]: Leaving directory '/tmp/B.o_glf5h0/BUILD/zephyr-3.1.2/zwgc'
make[2]: Entering directory '/tmp/B.o_glf5h0/BUILD/zephyr-3.1.2/zwgc'
./instantiate . stack xmode
make[2]: Leaving directory '/tmp/B.o_glf5h0/BUILD/zephyr-3.1.2/zwgc'
make[2]: Entering directory '/tmp/B.o_glf5h0/BUILD/zephyr-3.1.2/zwgc'
i686-pld-linux-gcc -c -O2 -fwrapv -pipe -Wformat -Werror=format-security -gdwarf-4 -fno-debug-types-section -fvar-tracking-assignments -g2 -Wp,-D_FORTIFY_SOURCE=2 -fstack-protector-strong --param=ssp-buffer-size=4 -Werror=trampolines -fomit-frame-pointer -march=i686 -fasynchronous-unwind-tables -mtune=pentium4 -gdwarf-4 -fno-debug-types-section -fvar-tracking-assignments -g2  -DDATADIR=\"/usr/share\" -I../h -I../h -I. -I.   zephyr.c
make[2]: Leaving directory '/tmp/B.o_glf5h0/BUILD/zephyr-3.1.2/zwgc'
make[2]: Entering directory '/tmp/B.o_glf5h0/BUILD/zephyr-3.1.2/zwgc'
i686-pld-linux-gcc -c -O2 -fwrapv -pipe -Wformat -Werror=format-security -gdwarf-4 -fno-debug-types-section -fvar-tracking-assignments -g2 -Wp,-D_FORTIFY_SOURCE=2 -fstack-protector-strong --param=ssp-buffer-size=4 -Werror=trampolines -fomit-frame-pointer -march=i686 -fasynchronous-unwind-tables -mtune=pentium4 -gdwarf-4 -fno-debug-types-section -fvar-tracking-assignments -g2  -DDATADIR=\"/usr/share\" -I../h -I../h -I. -I.   substitute.c
make[2]: Leaving directory '/tmp/B.o_glf5h0/BUILD/zephyr-3.1.2/zwgc'
make[2]: Entering directory '/tmp/B.o_glf5h0/BUILD/zephyr-3.1.2/zwgc'
i686-pld-linux-gcc -c -O2 -fwrapv -pipe -Wformat -Werror=format-security -gdwarf-4 -fno-debug-types-section -fvar-tracking-assignments -g2 -Wp,-D_FORTIFY_SOURCE=2 -fstack-protector-strong --param=ssp-buffer-size=4 -Werror=trampolines -fomit-frame-pointer -march=i686 -fasynchronous-unwind-tables -mtune=pentium4 -gdwarf-4 -fno-debug-types-section -fvar-tracking-assignments -g2  -DDATADIR=\"/usr/share\" -I../h -I../h -I. -I.   exec.c
make[2]: Leaving directory '/tmp/B.o_glf5h0/BUILD/zephyr-3.1.2/zwgc'
make[2]: Entering directory '/tmp/B.o_glf5h0/BUILD/zephyr-3.1.2/zwgc'
i686-pld-linux-gcc -c -O2 -fwrapv -pipe -Wformat -Werror=format-security -gdwarf-4 -fno-debug-types-section -fvar-tracking-assignments -g2 -Wp,-D_FORTIFY_SOURCE=2 -fstack-protector-strong --param=ssp-buffer-size=4 -Werror=trampolines -fomit-frame-pointer -march=i686 -fasynchronous-unwind-tables -mtune=pentium4 -gdwarf-4 -fno-debug-types-section -fvar-tracking-assignments -g2  -DDATADIR=\"/usr/share\" -I../h -I../h -I. -I.   main.c
make[2]: Leaving directory '/tmp/B.o_glf5h0/BUILD/zephyr-3.1.2/zwgc'
make[2]: Entering directory '/tmp/B.o_glf5h0/BUILD/zephyr-3.1.2/zwgc'
i686-pld-linux-gcc -c -O2 -fwrapv -pipe -Wformat -Werror=format-security -gdwarf-4 -fno-debug-types-section -fvar-tracking-assignments -g2 -Wp,-D_FORTIFY_SOURCE=2 -fstack-protector-strong --param=ssp-buffer-size=4 -Werror=trampolines -fomit-frame-pointer -march=i686 -fasynchronous-unwind-tables -mtune=pentium4 -gdwarf-4 -fno-debug-types-section -fvar-tracking-assignments -g2  -DDATADIR=\"/usr/share\" -I../h -I../h -I. -I.   X_driver.c
make[2]: Leaving directory '/tmp/B.o_glf5h0/BUILD/zephyr-3.1.2/zwgc'
make[2]: Entering directory '/tmp/B.o_glf5h0/BUILD/zephyr-3.1.2/zwgc'
bison -y -d ./parser.y
make[2]: Leaving directory '/tmp/B.o_glf5h0/BUILD/zephyr-3.1.2/zwgc'
make[2]: Entering directory '/tmp/B.o_glf5h0/BUILD/zephyr-3.1.2/zwgc'
bison -y -d ./parser.y
make[2]: Leaving directory '/tmp/B.o_glf5h0/BUILD/zephyr-3.1.2/zwgc'
make[2]: Entering directory '/tmp/B.o_glf5h0/BUILD/zephyr-3.1.2/zwgc'
./instantiate . stack char
make[2]: Leaving directory '/tmp/B.o_glf5h0/BUILD/zephyr-3.1.2/zwgc'
make[2]: Entering directory '/tmp/B.o_glf5h0/BUILD/zephyr-3.1.2/zwgc'
i686-pld-linux-gcc -c -O2 -fwrapv -pipe -Wformat -Werror=format-security -gdwarf-4 -fno-debug-types-section -fvar-tracking-assignments -g2 -Wp,-D_FORTIFY_SOURCE=2 -fstack-protector-strong --param=ssp-buffer-size=4 -Werror=trampolines -fomit-frame-pointer -march=i686 -fasynchronous-unwind-tables -mtune=pentium4 -gdwarf-4 -fno-debug-types-section -fvar-tracking-assignments -g2  -DDATADIR=\"/usr/share\" -I../h -I../h -I. -I.   eval.c
make[2]: Leaving directory '/tmp/B.o_glf5h0/BUILD/zephyr-3.1.2/zwgc'
make[2]: Entering directory '/tmp/B.o_glf5h0/BUILD/zephyr-3.1.2/zwgc'
i686-pld-linux-gcc -c -O2 -fwrapv -pipe -Wformat -Werror=format-security -gdwarf-4 -fno-debug-types-section -fvar-tracking-assignments -g2 -Wp,-D_FORTIFY_SOURCE=2 -fstack-protector-strong --param=ssp-buffer-size=4 -Werror=trampolines -fomit-frame-pointer -march=i686 -fasynchronous-unwind-tables -mtune=pentium4 -gdwarf-4 -fno-debug-types-section -fvar-tracking-assignments -g2  -DDATADIR=\"/usr/share\" -I../h -I../h -I. -I.   mux.c
make[2]: Leaving directory '/tmp/B.o_glf5h0/BUILD/zephyr-3.1.2/zwgc'
make[2]: Entering directory '/tmp/B.o_glf5h0/BUILD/zephyr-3.1.2/zwgc'
i686-pld-linux-gcc -c -O2 -fwrapv -pipe -Wformat -Werror=format-security -gdwarf-4 -fno-debug-types-section -fvar-tracking-assignments -g2 -Wp,-D_FORTIFY_SOURCE=2 -fstack-protector-strong --param=ssp-buffer-size=4 -Werror=trampolines -fomit-frame-pointer -march=i686 -fasynchronous-unwind-tables -mtune=pentium4 -gdwarf-4 -fno-debug-types-section -fvar-tracking-assignments -g2  -DDATADIR=\"/usr/share\" -I../h -I../h -I. -I.   regexp.c
make[2]: Leaving directory '/tmp/B.o_glf5h0/BUILD/zephyr-3.1.2/zwgc'
make[2]: Entering directory '/tmp/B.o_glf5h0/BUILD/zephyr-3.1.2/zwgc'
i686-pld-linux-gcc -c -O2 -fwrapv -pipe -Wformat -Werror=format-security -gdwarf-4 -fno-debug-types-section -fvar-tracking-assignments -g2 -Wp,-D_FORTIFY_SOURCE=2 -fstack-protector-strong --param=ssp-buffer-size=4 -Werror=trampolines -fomit-frame-pointer -march=i686 -fasynchronous-unwind-tables -mtune=pentium4 -gdwarf-4 -fno-debug-types-section -fvar-tracking-assignments -g2  -DDATADIR=\"/usr/share\" -I../h -I../h -I. -I.   notice.c
make[2]: Leaving directory '/tmp/B.o_glf5h0/BUILD/zephyr-3.1.2/zwgc'
make[2]: Entering directory '/tmp/B.o_glf5h0/BUILD/zephyr-3.1.2/zwgc'
i686-pld-linux-gcc -c -O2 -fwrapv -pipe -Wformat -Werror=format-security -gdwarf-4 -fno-debug-types-section -fvar-tracking-assignments -g2 -Wp,-D_FORTIFY_SOURCE=2 -fstack-protector-strong --param=ssp-buffer-size=4 -Werror=trampolines -fomit-frame-pointer -march=i686 -fasynchronous-unwind-tables -mtune=pentium4 -gdwarf-4 -fno-debug-types-section -fvar-tracking-assignments -g2  -DDATADIR=\"/usr/share\" -I../h -I../h -I. -I.   port.c
make[2]: Leaving directory '/tmp/B.o_glf5h0/BUILD/zephyr-3.1.2/zwgc'
make[2]: Entering directory '/tmp/B.o_glf5h0/BUILD/zephyr-3.1.2/zwgc'
i686-pld-linux-gcc -c -O2 -fwrapv -pipe -Wformat -Werror=format-security -gdwarf-4 -fno-debug-types-section -fvar-tracking-assignments -g2 -Wp,-D_FORTIFY_SOURCE=2 -fstack-protector-strong --param=ssp-buffer-size=4 -Werror=trampolines -fomit-frame-pointer -march=i686 -fasynchronous-unwind-tables -mtune=pentium4 -gdwarf-4 -fno-debug-types-section -fvar-tracking-assignments -g2  -DDATADIR=\"/usr/share\" -I../h -I../h -I. -I.   xcut.c
make[2]: Leaving directory '/tmp/B.o_glf5h0/BUILD/zephyr-3.1.2/zwgc'
make[2]: Entering directory '/tmp/B.o_glf5h0/BUILD/zephyr-3.1.2/zwgc'
i686-pld-linux-gcc -c -O2 -fwrapv -pipe -Wformat -Werror=format-security -gdwarf-4 -fno-debug-types-section -fvar-tracking-assignments -g2 -Wp,-D_FORTIFY_SOURCE=2 -fstack-protector-strong --param=ssp-buffer-size=4 -Werror=trampolines -fomit-frame-pointer -march=i686 -fasynchronous-unwind-tables -mtune=pentium4 -gdwarf-4 -fno-debug-types-section -fvar-tracking-assignments -g2  -DDATADIR=\"/usr/share\" -I../h -I../h -I. -I.   subscriptions.c
make[2]: Leaving directory '/tmp/B.o_glf5h0/BUILD/zephyr-3.1.2/zwgc'
make[2]: Entering directory '/tmp/B.o_glf5h0/BUILD/zephyr-3.1.2/zwgc'
i686-pld-linux-gcc -c -O2 -fwrapv -pipe -Wformat -Werror=format-security -gdwarf-4 -fno-debug-types-section -fvar-tracking-assignments -g2 -Wp,-D_FORTIFY_SOURCE=2 -fstack-protector-strong --param=ssp-buffer-size=4 -Werror=trampolines -fomit-frame-pointer -march=i686 -fasynchronous-unwind-tables -mtune=pentium4 -gdwarf-4 -fno-debug-types-section -fvar-tracking-assignments -g2  -DDATADIR=\"/usr/share\" -I../h -I../h -I. -I.   character_class.c
make[2]: Leaving directory '/tmp/B.o_glf5h0/BUILD/zephyr-3.1.2/zwgc'
make[2]: Entering directory '/tmp/B.o_glf5h0/BUILD/zephyr-3.1.2/zwgc'
i686-pld-linux-gcc -c -O2 -fwrapv -pipe -Wformat -Werror=format-security -gdwarf-4 -fno-debug-types-section -fvar-tracking-assignments -g2 -Wp,-D_FORTIFY_SOURCE=2 -fstack-protector-strong --param=ssp-buffer-size=4 -Werror=trampolines -fomit-frame-pointer -march=i686 -fasynchronous-unwind-tables -mtune=pentium4 -gdwarf-4 -fno-debug-types-section -fvar-tracking-assignments -g2  -DDATADIR=\"/usr/share\" -I../h -I../h -I. -I.   file.c
make[2]: Leaving directory '/tmp/B.o_glf5h0/BUILD/zephyr-3.1.2/zwgc'
make[2]: Entering directory '/tmp/B.o_glf5h0/BUILD/zephyr-3.1.2/zwgc'
i686-pld-linux-gcc -c -O2 -fwrapv -pipe -Wformat -Werror=format-security -gdwarf-4 -fno-debug-types-section -fvar-tracking-assignments -g2 -Wp,-D_FORTIFY_SOURCE=2 -fstack-protector-strong --param=ssp-buffer-size=4 -Werror=trampolines -fomit-frame-pointer -march=i686 -fasynchronous-unwind-tables -mtune=pentium4 -gdwarf-4 -fno-debug-types-section -fvar-tracking-assignments -g2  -DDATADIR=\"/usr/share\" -I../h -I../h -I. -I.   error.c
make[2]: Leaving directory '/tmp/B.o_glf5h0/BUILD/zephyr-3.1.2/zwgc'
make[2]: Entering directory '/tmp/B.o_glf5h0/BUILD/zephyr-3.1.2/zwgc'
i686-pld-linux-gcc -c -O2 -fwrapv -pipe -Wformat -Werror=format-security -gdwarf-4 -fno-debug-types-section -fvar-tracking-assignments -g2 -Wp,-D_FORTIFY_SOURCE=2 -fstack-protector-strong --param=ssp-buffer-size=4 -Werror=trampolines -fomit-frame-pointer -march=i686 -fasynchronous-unwind-tables -mtune=pentium4 -gdwarf-4 -fno-debug-types-section -fvar-tracking-assignments -g2  -DDATADIR=\"/usr/share\" -I../h -I../h -I. -I.   formatter.c
In file included from formatter.c:25:
string_dictionary.h:2:1: error: unknown type name 'the'
    2 | the Project Athena Zephyr Notification System.
      | ^~~
string_dictionary.h:2:13: error: expected '=', ',', ';', 'asm' or '__attribute__' before 'Athena'
    2 | the Project Athena Zephyr Notification System.
      |             ^~~~~~
string_dictionary.h:2:13: error: unknown type name 'Athena'
string_dictionary.h:6:44: error: stray '@' in program
    6 |  *      Created by:     Marc Horowitz <marc@athena.mit.edu>
      |                                            ^
string_dictionary.h:22:3: warning: data definition has no type or storage class
   22 | } string_dictionary_binding;
      |   ^~~~~~~~~~~~~~~~~~~~~~~~~
string_dictionary.h:22:3: warning: type defaults to 'int' in declaration of 'string_dictionary_binding' [-Wimplicit-int]
string_dictionary.h:26:5: error: expected specifier-qualifier-list before 'string_dictionary_binding'
   26 |     string_dictionary_binding **slots;
      |     ^~~~~~~~~~~~~~~~~~~~~~~~~
string_dictionary.h:68:69: error: expected declaration specifiers or '...' before 'string_dictionary_binding'
   68 | extern void string_dictionary_Enumerate(string_dictionary, void (*)(string_dictionary_binding *));
      |                                                                     ^~~~~~~~~~~~~~~~~~~~~~~~~
string_dictionary.h:78:34: error: expected '=', ',', ';', 'asm' or '__attribute__' before '*' token
   78 | extern string_dictionary_binding *string_dictionary_Lookup(string_dictionary,
      |                                  ^
string_dictionary.h:97:34: error: expected '=', ',', ';', 'asm' or '__attribute__' before '*' token
   97 | extern string_dictionary_binding *string_dictionary_Define(string_dictionary,
      |                                  ^
string_dictionary.h:111:38: error: expected declaration specifiers or '...' before 'string_dictionary_binding'
  111 |                                      string_dictionary_binding *);
      |                                      ^~~~~~~~~~~~~~~~~~~~~~~~~
make[2]: *** [Makefile:91: formatter.o] Error 1
make[2]: Leaving directory '/tmp/B.o_glf5h0/BUILD/zephyr-3.1.2/zwgc'
make[2]: *** Waiting for unfinished jobs....
make[2]: Entering directory '/tmp/B.o_glf5h0/BUILD/zephyr-3.1.2/zwgc'
i686-pld-linux-gcc -c -O2 -fwrapv -pipe -Wformat -Werror=format-security -gdwarf-4 -fno-debug-types-section -fvar-tracking-assignments -g2 -Wp,-D_FORTIFY_SOURCE=2 -fstack-protector-strong --param=ssp-buffer-size=4 -Werror=trampolines -fomit-frame-pointer -march=i686 -fasynchronous-unwind-tables -mtune=pentium4 -gdwarf-4 -fno-debug-types-section -fvar-tracking-assignments -g2  -DDATADIR=\"/usr/share\" -I../h -I../h -I. -I.   variables.c
In file included from string_dictionary_aux.h:18,
                 from variables.c:30:
string_dictionary.h:2:1: error: unknown type name 'the'
    2 | the Project Athena Zephyr Notification System.
      | ^~~
string_dictionary.h:2:13: error: expected '=', ',', ';', 'asm' or '__attribute__' before 'Athena'
    2 | the Project Athena Zephyr Notification System.
      |             ^~~~~~
string_dictionary.h:2:13: error: unknown type name 'Athena'
string_dictionary.h:6:44: error: stray '@' in program
    6 |  *      Created by:     Marc Horowitz <marc@athena.mit.edu>
      |                                            ^
string_dictionary.h:22:3: warning: data definition has no type or storage class
   22 | } string_dictionary_binding;
      |   ^~~~~~~~~~~~~~~~~~~~~~~~~
string_dictionary.h:22:3: warning: type defaults to 'int' in declaration of 'string_dictionary_binding' [-Wimplicit-int]
string_dictionary.h:26:5: error: expected specifier-qualifier-list before 'string_dictionary_binding'
   26 |     string_dictionary_binding **slots;
      |     ^~~~~~~~~~~~~~~~~~~~~~~~~
string_dictionary.h:68:69: error: expected declaration specifiers or '...' before 'string_dictionary_binding'
   68 | extern void string_dictionary_Enumerate(string_dictionary, void (*)(string_dictionary_binding *));
      |                                                                     ^~~~~~~~~~~~~~~~~~~~~~~~~
string_dictionary.h:78:34: error: expected '=', ',', ';', 'asm' or '__attribute__' before '*' token
   78 | extern string_dictionary_binding *string_dictionary_Lookup(string_dictionary,
      |                                  ^
string_dictionary.h:97:34: error: expected '=', ',', ';', 'asm' or '__attribute__' before '*' token
   97 | extern string_dictionary_binding *string_dictionary_Define(string_dictionary,
      |                                  ^
string_dictionary.h:111:38: error: expected declaration specifiers or '...' before 'string_dictionary_binding'
  111 |                                      string_dictionary_binding *);
      |                                      ^~~~~~~~~~~~~~~~~~~~~~~~~
variables.c: In function 'var_set_variable_then_free_value':
variables.c:199:32: error: 'binding' undeclared (first use in this function)
  199 |     string_dictionary_binding *binding;
      |                                ^~~~~~~
variables.c:199:32: note: each undeclared identifier is reported only once for each function it appears in
variables.c:213:15: warning: implicit declaration of function 'string_dictionary_Define'; did you mean 'string_dictionary_Fetch'? [-Wimplicit-function-declaration]
  213 |     binding = string_dictionary_Define(non_number_variable_dict, name,
      |               ^~~~~~~~~~~~~~~~~~~~~~~~
      |               string_dictionary_Fetch
make[2]: *** [Makefile:91: variables.o] Error 1
make[2]: Leaving directory '/tmp/B.o_glf5h0/BUILD/zephyr-3.1.2/zwgc'
make[2]: Entering directory '/tmp/B.o_glf5h0/BUILD/zephyr-3.1.2/zwgc'
i686-pld-linux-gcc -c -O2 -fwrapv -pipe -Wformat -Werror=format-security -gdwarf-4 -fno-debug-types-section -fvar-tracking-assignments -g2 -Wp,-D_FORTIFY_SOURCE=2 -fstack-protector-strong --param=ssp-buffer-size=4 -Werror=trampolines -fomit-frame-pointer -march=i686 -fasynchronous-unwind-tables -mtune=pentium4 -gdwarf-4 -fno-debug-types-section -fvar-tracking-assignments -g2  -DDATADIR=\"/usr/share\" -I../h -I../h -I. -I.   tty_filter.c
In file included from string_dictionary_aux.h:18,
                 from tty_filter.c:47:
string_dictionary.h:2:1: error: unknown type name 'the'
    2 | the Project Athena Zephyr Notification System.
      | ^~~
string_dictionary.h:2:13: error: expected '=', ',', ';', 'asm' or '__attribute__' before 'Athena'
    2 | the Project Athena Zephyr Notification System.
      |             ^~~~~~
string_dictionary.h:2:13: error: unknown type name 'Athena'
string_dictionary.h:6:44: error: stray '@' in program
    6 |  *      Created by:     Marc Horowitz <marc@athena.mit.edu>
      |                                            ^
string_dictionary.h:22:3: warning: data definition has no type or storage class
   22 | } string_dictionary_binding;
      |   ^~~~~~~~~~~~~~~~~~~~~~~~~
string_dictionary.h:22:3: warning: type defaults to 'int' in declaration of 'string_dictionary_binding' [-Wimplicit-int]
string_dictionary.h:26:5: error: expected specifier-qualifier-list before 'string_dictionary_binding'
   26 |     string_dictionary_binding **slots;
      |     ^~~~~~~~~~~~~~~~~~~~~~~~~
string_dictionary.h:68:69: error: expected declaration specifiers or '...' before 'string_dictionary_binding'
   68 | extern void string_dictionary_Enumerate(string_dictionary, void (*)(string_dictionary_binding *));
      |                                                                     ^~~~~~~~~~~~~~~~~~~~~~~~~
string_dictionary.h:78:34: error: expected '=', ',', ';', 'asm' or '__attribute__' before '*' token
   78 | extern string_dictionary_binding *string_dictionary_Lookup(string_dictionary,
      |                                  ^
string_dictionary.h:97:34: error: expected '=', ',', ';', 'asm' or '__attribute__' before '*' token
   97 | extern string_dictionary_binding *string_dictionary_Define(string_dictionary,
      |                                  ^
string_dictionary.h:111:38: error: expected declaration specifiers or '...' before 'string_dictionary_binding'
  111 |                                      string_dictionary_binding *);
      |                                      ^~~~~~~~~~~~~~~~~~~~~~~~~
tty_filter.c: In function 'tty_filter_init':
tty_filter.c:114:32: error: 'b' undeclared (first use in this function)
  114 |     string_dictionary_binding *b;
      |                                ^
tty_filter.c:114:32: note: each undeclared identifier is reported only once for each function it appears in
tty_filter.c:92:22: warning: implicit declaration of function 'string_dictionary_Define'; did you mean 'string_dictionary_Fetch'? [-Wimplicit-function-declaration]
   92 | #define TD_SET(k,v) (string_dictionary_Define(termcap_dict, (k), &ex)->value \
      |                      ^~~~~~~~~~~~~~~~~~~~~~~~
tty_filter.c:95:41: note: in expansion of macro 'TD_SET'
   95 |                    *code_buf_pos++ = 0, TD_SET(k, code))
      |                                         ^~~~~~
tty_filter.c:152:13: note: in expansion of macro 'EXPAND'
  152 |             EXPAND("B.bold");
      |             ^~~~~~
tty_filter.c:92:70: error: invalid type argument of '->' (have 'int')
   92 | #define TD_SET(k,v) (string_dictionary_Define(termcap_dict, (k), &ex)->value \
      |                                                                      ^~
tty_filter.c:95:41: note: in expansion of macro 'TD_SET'
   95 |                    *code_buf_pos++ = 0, TD_SET(k, code))
      |                                         ^~~~~~
tty_filter.c:152:13: note: in expansion of macro 'EXPAND'
  152 |             EXPAND("B.bold");
      |             ^~~~~~
tty_filter.c:92:70: error: invalid type argument of '->' (have 'int')
   92 | #define TD_SET(k,v) (string_dictionary_Define(termcap_dict, (k), &ex)->value \
      |                                                                      ^~
tty_filter.c:95:41: note: in expansion of macro 'TD_SET'
   95 |                    *code_buf_pos++ = 0, TD_SET(k, code))
      |                                         ^~~~~~
tty_filter.c:154:13: note: in expansion of macro 'EXPAND'
  154 |             EXPAND("E.bold");
      |             ^~~~~~
tty_filter.c:92:70: error: invalid type argument of '->' (have 'int')
   92 | #define TD_SET(k,v) (string_dictionary_Define(termcap_dict, (k), &ex)->value \
      |                                                                      ^~
tty_filter.c:95:41: note: in expansion of macro 'TD_SET'
   95 |                    *code_buf_pos++ = 0, TD_SET(k, code))
      |                                         ^~~~~~
tty_filter.c:158:13: note: in expansion of macro 'EXPAND'
  158 |             EXPAND("B.rw");
      |             ^~~~~~
tty_filter.c:92:70: error: invalid type argument of '->' (have 'int')
   92 | #define TD_SET(k,v) (string_dictionary_Define(termcap_dict, (k), &ex)->value \
      |                                                                      ^~
tty_filter.c:95:41: note: in expansion of macro 'TD_SET'
   95 |                    *code_buf_pos++ = 0, TD_SET(k, code))
      |                                         ^~~~~~
tty_filter.c:160:13: note: in expansion of macro 'EXPAND'
  160 |             EXPAND("E.rw");
      |             ^~~~~~
tty_filter.c:92:70: error: invalid type argument of '->' (have 'int')
   92 | #define TD_SET(k,v) (string_dictionary_Define(termcap_dict, (k), &ex)->value \
      |                                                                      ^~
tty_filter.c:95:41: note: in expansion of macro 'TD_SET'
   95 |                    *code_buf_pos++ = 0, TD_SET(k, code))
      |                                         ^~~~~~
tty_filter.c:164:13: note: in expansion of macro 'EXPAND'
  164 |             EXPAND("B.bell");
      |             ^~~~~~
tty_filter.c:92:70: error: invalid type argument of '->' (have 'int')
   92 | #define TD_SET(k,v) (string_dictionary_Define(termcap_dict, (k), &ex)->value \
      |                                                                      ^~
tty_filter.c:165:13: note: in expansion of macro 'TD_SET'
  165 |             TD_SET("E.bell", NULL);
      |             ^~~~~~
tty_filter.c:92:70: error: invalid type argument of '->' (have 'int')
   92 | #define TD_SET(k,v) (string_dictionary_Define(termcap_dict, (k), &ex)->value \
      |                                                                      ^~
tty_filter.c:95:41: note: in expansion of macro 'TD_SET'
   95 |                    *code_buf_pos++ = 0, TD_SET(k, code))
      |                                         ^~~~~~
tty_filter.c:169:13: note: in expansion of macro 'EXPAND'
  169 |             EXPAND("B.blink");
      |             ^~~~~~
tty_filter.c:92:70: error: invalid type argument of '->' (have 'int')
   92 | #define TD_SET(k,v) (string_dictionary_Define(termcap_dict, (k), &ex)->value \
      |                                                                      ^~
tty_filter.c:95:41: note: in expansion of macro 'TD_SET'
   95 |                    *code_buf_pos++ = 0, TD_SET(k, code))
      |                                         ^~~~~~
tty_filter.c:171:13: note: in expansion of macro 'EXPAND'
  171 |             EXPAND("E.blink");
      |             ^~~~~~
tty_filter.c:92:70: error: invalid type argument of '->' (have 'int')
   92 | #define TD_SET(k,v) (string_dictionary_Define(termcap_dict, (k), &ex)->value \
      |                                                                      ^~
tty_filter.c:95:41: note: in expansion of macro 'TD_SET'
   95 |                    *code_buf_pos++ = 0, TD_SET(k, code))
      |                                         ^~~~~~
tty_filter.c:175:13: note: in expansion of macro 'EXPAND'
  175 |             EXPAND("B.u");
      |             ^~~~~~
tty_filter.c:92:70: error: invalid type argument of '->' (have 'int')
   92 | #define TD_SET(k,v) (string_dictionary_Define(termcap_dict, (k), &ex)->value \
      |                                                                      ^~
tty_filter.c:95:41: note: in expansion of macro 'TD_SET'
   95 |                    *code_buf_pos++ = 0, TD_SET(k, code))
      |                                         ^~~~~~
tty_filter.c:177:13: note: in expansion of macro 'EXPAND'
  177 |             EXPAND("E.u");
      |             ^~~~~~
tty_filter.c:92:70: error: invalid type argument of '->' (have 'int')
   92 | #define TD_SET(k,v) (string_dictionary_Define(termcap_dict, (k), &ex)->value \
      |                                                                      ^~
tty_filter.c:95:41: note: in expansion of macro 'TD_SET'
   95 |                    *code_buf_pos++ = 0, TD_SET(k, code))
      |                                         ^~~~~~
tty_filter.c:181:13: note: in expansion of macro 'EXPAND'
  181 |             EXPAND("B.so");
      |             ^~~~~~
tty_filter.c:92:70: error: invalid type argument of '->' (have 'int')
   92 | #define TD_SET(k,v) (string_dictionary_Define(termcap_dict, (k), &ex)->value \
      |                                                                      ^~
tty_filter.c:95:41: note: in expansion of macro 'TD_SET'
   95 |                    *code_buf_pos++ = 0, TD_SET(k, code))
      |                                         ^~~~~~
tty_filter.c:183:13: note: in expansion of macro 'EXPAND'
  183 |             EXPAND("E.so");
      |             ^~~~~~
tty_filter.c:189:17: warning: implicit declaration of function 'string_dictionary_Lookup'; did you mean 'string_dictionary_Fetch'? [-Wimplicit-function-declaration]
  189 |     if (NULL == string_dictionary_Lookup(termcap_dict, "B.bold")) {
      |                 ^~~~~~~~~~~~~~~~~~~~~~~~
      |                 string_dictionary_Fetch
tty_filter.c:189:14: warning: comparison between pointer and integer
  189 |     if (NULL == string_dictionary_Lookup(termcap_dict, "B.bold")) {
      |              ^~
tty_filter.c:92:70: error: invalid type argument of '->' (have 'int')
   92 | #define TD_SET(k,v) (string_dictionary_Define(termcap_dict, (k), &ex)->value \
      |                                                                      ^~
tty_filter.c:191:13: note: in expansion of macro 'TD_SET'
  191 |             TD_SET("B.bold", b->value);
      |             ^~~~~~
tty_filter.c:92:70: error: invalid type argument of '->' (have 'int')
   92 | #define TD_SET(k,v) (string_dictionary_Define(termcap_dict, (k), &ex)->value \
      |                                                                      ^~
tty_filter.c:192:13: note: in expansion of macro 'TD_SET'
  192 |             TD_SET("E.bold",
      |             ^~~~~~
tty_filter.c:193:66: error: invalid type argument of '->' (have 'int')
  193 |                    string_dictionary_Lookup(termcap_dict, "E.so")->value);
      |                                                                  ^~
tty_filter.c:93:25: note: in definition of macro 'TD_SET'
   93 |                      = (v))
      |                         ^
tty_filter.c:92:70: error: invalid type argument of '->' (have 'int')
   92 | #define TD_SET(k,v) (string_dictionary_Define(termcap_dict, (k), &ex)->value \
      |                                                                      ^~
tty_filter.c:195:13: note: in expansion of macro 'TD_SET'
  195 |             TD_SET("B.bold", b->value);
      |             ^~~~~~
tty_filter.c:92:70: error: invalid type argument of '->' (have 'int')
   92 | #define TD_SET(k,v) (string_dictionary_Define(termcap_dict, (k), &ex)->value \
      |                                                                      ^~
tty_filter.c:196:13: note: in expansion of macro 'TD_SET'
  196 |             TD_SET("E.bold",
      |             ^~~~~~
tty_filter.c:197:66: error: invalid type argument of '->' (have 'int')
  197 |                    string_dictionary_Lookup(termcap_dict, "E.rv")->value);
      |                                                                  ^~
tty_filter.c:93:25: note: in definition of macro 'TD_SET'
   93 |                      = (v))
      |                         ^
tty_filter.c:92:70: error: invalid type argument of '->' (have 'int')
   92 | #define TD_SET(k,v) (string_dictionary_Define(termcap_dict, (k), &ex)->value \
      |                                                                      ^~
tty_filter.c:199:13: note: in expansion of macro 'TD_SET'
  199 |             TD_SET("B.bold", b->value);
      |             ^~~~~~
tty_filter.c:92:70: error: invalid type argument of '->' (have 'int')
   92 | #define TD_SET(k,v) (string_dictionary_Define(termcap_dict, (k), &ex)->value \
      |                                                                      ^~
tty_filter.c:200:13: note: in expansion of macro 'TD_SET'
  200 |             TD_SET("E.bold",
      |             ^~~~~~
tty_filter.c:201:65: error: invalid type argument of '->' (have 'int')
  201 |                    string_dictionary_Lookup(termcap_dict, "E.u")->value);
      |                                                                 ^~
tty_filter.c:93:25: note: in definition of macro 'TD_SET'
   93 |                      = (v))
      |                         ^
tty_filter.c:206:14: warning: comparison between pointer and integer
  206 |     if (NULL == string_dictionary_Lookup(termcap_dict, "B.bell")) {
      |              ^~
tty_filter.c:92:70: error: invalid type argument of '->' (have 'int')
   92 | #define TD_SET(k,v) (string_dictionary_Define(termcap_dict, (k), &ex)->value \
      |                                                                      ^~
tty_filter.c:207:9: note: in expansion of macro 'TD_SET'
  207 |         TD_SET("B.bell", "\007");
      |         ^~~~~~
tty_filter.c:92:70: error: invalid type argument of '->' (have 'int')
   92 | #define TD_SET(k,v) (string_dictionary_Define(termcap_dict, (k), &ex)->value \
      |                                                                      ^~
tty_filter.c:208:9: note: in expansion of macro 'TD_SET'
  208 |         TD_SET("E.bell", NULL);
      |         ^~~~~~
tty_filter.c: In function 'convert_desc_to_tty_str_info':
tty_filter.c:379:40: error: 'b' undeclared (first use in this function)
  379 |             string_dictionary_binding *b;
      |                                        ^
make[2]: *** [Makefile:91: tty_filter.o] Error 1
make[2]: Leaving directory '/tmp/B.o_glf5h0/BUILD/zephyr-3.1.2/zwgc'
make[2]: Entering directory '/tmp/B.o_glf5h0/BUILD/zephyr-3.1.2/zwgc'
i686-pld-linux-gcc -c -O2 -fwrapv -pipe -Wformat -Werror=format-security -gdwarf-4 -fno-debug-types-section -fvar-tracking-assignments -g2 -Wp,-D_FORTIFY_SOURCE=2 -fstack-protector-strong --param=ssp-buffer-size=4 -Werror=trampolines -fomit-frame-pointer -march=i686 -fasynchronous-unwind-tables -mtune=pentium4 -gdwarf-4 -fno-debug-types-section -fvar-tracking-assignments -g2  -DDATADIR=\"/usr/share\" -I../h -I../h -I. -I.   X_fonts.c
make[2]: Leaving directory '/tmp/B.o_glf5h0/BUILD/zephyr-3.1.2/zwgc'
make[2]: Entering directory '/tmp/B.o_glf5h0/BUILD/zephyr-3.1.2/zwgc'
i686-pld-linux-gcc -c -O2 -fwrapv -pipe -Wformat -Werror=format-security -gdwarf-4 -fno-debug-types-section -fvar-tracking-assignments -g2 -Wp,-D_FORTIFY_SOURCE=2 -fstack-protector-strong --param=ssp-buffer-size=4 -Werror=trampolines -fomit-frame-pointer -march=i686 -fasynchronous-unwind-tables -mtune=pentium4 -gdwarf-4 -fno-debug-types-section -fvar-tracking-assignments -g2  -DDATADIR=\"/usr/share\" -I../h -I../h -I. -I.   X_gram.c
make[2]: Leaving directory '/tmp/B.o_glf5h0/BUILD/zephyr-3.1.2/zwgc'
make[1]: *** [Makefile:35: all] Error 1
make: *** [Makefile:22: build] Error 2
error: Bad exit status from /tmp/B.o_glf5h0/BUILD/tmp/rpm-tmp.fmUbkI (%build)


RPM build errors:
    Could not canonicalize hostname: nereid
    Bad exit status from /tmp/B.o_glf5h0/BUILD/tmp/rpm-tmp.fmUbkI (%build)
ended at: Sun Nov 21 08:58:16 2021, done in 0:00:25.850588
error: No files produced.
+ chmod -R u+rwX /tmp/B.o_glf5h0/BUILD
+ rm -rf /tmp/B.o_glf5h0/tmp /tmp/B.o_glf5h0/BUILD
+ rm -rf /tmp/B.o_glf5h0
Begin-PLD-Builder-Info
Build-Time: user:42.63s sys:11.23s real:27.63s (faults io:48 non-io:2822707)

End-PLD-Builder-Info
[Back to list of logs] [View rpm -qa of builder]