FailedOk

th/SRPMS[OK]
th/x32[OK]
th/i686[OK]
th/x86_64[OK]

ac/SRPMS[OK]
ac/i386[OK]
ac/i586[OK]
ac/i686[OK]
ac/alpha[OK]
ac/amd64[OK]
ac/athlon[OK]
ac/ppc[OK]
ac/sparc[OK]
ac/sparc64[OK]

Advanced Search
main()
Powered by PLD Linux
(c) 2002-2022 PLD Team
$Revision: 1.37 $
Powered by sqlite3.
Your IP: 3.236.221.156

zsh 76f8ead6-bea3-47ff-9424-f3a0047fd38c

Status:Failed
Source URL:https://buildlogs.pld-linux.org/pld/th/i686/FAIL/zsh,76f8ead6-bea3-47ff-9424-f3a0047fd38c.bz2
text/plain URL:View!
full text:View!
rpm -qa of builder:View!
Date:2022/05/18 14:14:35
Runtime:0:02:45.670466

Toc:

  • error 1
  • make[1]: *** [Makefile:190: check] Error 1
  • error 2
  • error: Bad exit status from /tmp/B.vroqiz9c/BUILD/tmp/rpm-tmp.ZS7NCQ (%build)
  • error 3
  • RPM build errors:
  • error 4
  • error: No files produced.

Content:

      zpty -w subshell "rm $target_pattern"
      zpty -w -n subshell 'n'
      sleep 1
      zpty -rt subshell REPLY && print -r -- ${REPLY%%$'\r\n'}
      zpty -d subshell
      after=`ls -a -- $target_dir`
      [[ $before == $after ]] || return 1
    done
  else
    ZTST_skip="the zsh/zpty module is not available"
  fi
  BEL=$'\a'
Error output:
(zpty):zpty:7: can't open pseudo terminal: no such device
(eval):zpty:9: no such pty command: subshell
(eval):zpty:10: no such pty command: subshell
(eval):zpty:11: no such pty command: subshell
(eval):zpty:12: no such pty command: subshell
(eval):zpty:14: no such pty command: subshell
(eval):zpty:15: no such pty command: subshell
(zpty):zpty:7: can't open pseudo terminal: no such device
(eval):zpty:9: no such pty command: subshell
(eval):zpty:10: no such pty command: subshell
(eval):zpty:11: no such pty command: subshell
(eval):zpty:12: no such pty command: subshell
(eval):zpty:14: no such pty command: subshell
(eval):zpty:15: no such pty command: subshell
Was testing: RM_STAR_SILENT
./E01options.ztst: test failed.
./E02xtrace.ztst: starting.
./E02xtrace.ztst: all tests successful.
./E03posix.ztst: starting.
./E03posix.ztst: all tests successful.
./P01privileged.ztst: starting.
./P01privileged.ztst: skipped (PRIVILEGED tests require super-user privileges (or env var))
./V01zmodload.ztst: starting.
./V01zmodload.ztst: all tests successful.
./V02zregexparse.ztst: starting.
./V02zregexparse.ztst: all tests successful.
./V03mathfunc.ztst: starting.
./V03mathfunc.ztst: all tests successful.
./V04features.ztst: starting.
./V04features.ztst: all tests successful.
./V05styles.ztst: starting.
./V05styles.ztst: all tests successful.
./V06parameter.ztst: starting.
./V06parameter.ztst: all tests successful.
./V07pcre.ztst: starting.
Testing PCRE multibyte with locale en_US.UTF-8
./V07pcre.ztst: all tests successful.
./V09datetime.ztst: starting.
./V09datetime.ztst: all tests successful.
./V10private.ztst: starting.
./V10private.ztst: all tests successful.
./V11db_gdbm.ztst: starting.
./V11db_gdbm.ztst: all tests successful.
./V12zparseopts.ztst: starting.
./V12zparseopts.ztst: all tests successful.
./V13zformat.ztst: starting.
./V13zformat.ztst: all tests successful.
./V14system.ztst: starting.
./V14system.ztst: all tests successful.
./W01history.ztst: starting.
./W01history.ztst: all tests successful.
./W03jobparameters.ztst: starting.
Pattern match failed, line mismatch (4/1):
 <\[1] [0-9]##
 <running:+:*=running
 <running:+:*=running
 <zsh:*SIGHUPed*
 >
Test ./W03jobparameters.ztst failed: output differs from expected as shown above for:
  zpty_start
  zpty_input "MODULE_PATH=${(q)MODULE_PATH}"
  zpty_input 'sleep 3 &'
  zpty_input 'print $jobstates'
  zpty_input '(print $jobstates)'
  zpty_input 'jobs -s'
  zpty_stop
Error output:
(zpty):zpty:3: can't open pseudo terminal: no such device
zpty_input:zpty:1: no such pty command: zsh
zpty_input:zpty:1: no such pty command: zsh
zpty_input:zpty:1: no such pty command: zsh
zpty_input:zpty:1: no such pty command: zsh
zpty_input:zpty:1: no such pty command: zsh
zpty_stop:zpty:2: no such pty command: zsh
zpty_stop:zpty:4: no such pty command: zsh
Was testing: $jobstate for running job in main shell and subshell
./W03jobparameters.ztst: test failed.
./Z01is-at-least.ztst: starting.
./Z01is-at-least.ztst: all tests successful.
./Z02zmathfunc.ztst: starting.
./Z02zmathfunc.ztst: all tests successful.
./Z03run-help.ztst: starting.
./Z03run-help.ztst: all tests successful.
**************************************
52 successful test scripts, 2 failures, 1 skipped
**************************************
make[1]: *** [Makefile:190: check] Error 1
make[1]: Leaving directory '/tmp/B.vroqiz9c/BUILD/zsh-5.9/Test'
make: *** [Makefile:263: test] Error 2
error: Bad exit status from /tmp/B.vroqiz9c/BUILD/tmp/rpm-tmp.ZS7NCQ (%build)


RPM build errors:
    line 51: It's not recommended to have unversioned Obsoletes: Obsoletes:	zsh-doc-dvi
    line 52: It's not recommended to have unversioned Obsoletes: Obsoletes:	zsh-doc-html
    line 53: It's not recommended to have unversioned Obsoletes: Obsoletes:	zsh-doc-ps
    Could not canonicalize hostname: nereid
    Bad exit status from /tmp/B.vroqiz9c/BUILD/tmp/rpm-tmp.ZS7NCQ (%build)
ended at: Wed May 18 14:14:34 2022, done in 0:02:45.670466
error: No files produced.
+ chmod -R u+rwX /tmp/B.vroqiz9c/BUILD
+ rm -rf /tmp/B.vroqiz9c/tmp /tmp/B.vroqiz9c/BUILD
+ rm -rf /tmp/B.vroqiz9c
Begin-PLD-Builder-Info
Build-Time: user:116.94s sys:26.28s real:168.29s (faults io:43 non-io:5512140)

End-PLD-Builder-Info
[Back to list of logs] [View rpm -qa of builder]