FailedOk

th/SRPMS[OK]
th/x32[OK]
th/i686[OK]
th/x86_64[OK]

ac/SRPMS[OK]
ac/i386[OK]
ac/i586[OK]
ac/i686[OK]
ac/alpha[OK]
ac/amd64[OK]
ac/athlon[OK]
ac/ppc[OK]
ac/sparc[OK]
ac/sparc64[OK]

Advanced Search
main()
Powered by PLD Linux
(c) 2002-2021 PLD Team
$Revision: 1.37 $
Powered by Real Programmer.
Your IP: 18.204.2.231

SweetHome3D 689bbaa0-5dca-4a15-b5ee-5a893130d8af

Status:Failed
Source URL:https://buildlogs.pld-linux.org/pld/th/i686/FAIL/SweetHome3D,689bbaa0-5dca-4a15-b5ee-5a893130d8af.bz2
text/plain URL:View!
rpm -qa of builder:View!
Date:2021/09/06 13:03:52
Runtime:0:00:01.516475

Toc:

  • prep
  • Executing(%prep): /bin/sh -e /tmp/B.n234rscm/BUILD/tmp/rpm-tmp.v5JIqu
  • build
  • Executing(%build): /bin/sh -e /tmp/B.n234rscm/BUILD/tmp/rpm-tmp.cO0ltY
  • error 1
  • /usr/bin/build-classpath: error: Could not find jaxp_parser_impl Java extension for this JVM
  • error 2
  • /usr/bin/build-classpath: error: Some specified jars were not found
  • error 3
  • [javac] error: Source option 1.3 is no longer supported. Use 6 or later.
  • error 4
  • [javac] error: Target option 1.1 is no longer supported. Use 1.6 or later.
  • error 5
  • error: Bad exit status from /tmp/B.n234rscm/BUILD/tmp/rpm-tmp.cO0ltY (%build)
  • error 6
  • RPM build errors:
  • error 7
  • error: No files produced.

Content:

request from: baggins
checking if we should skip the build
started at: Mon Sep  6 13:03:47 2021
killing old processes on a builder
sending signal 9 to pid -1
cleaning up /tmp
fetching https://srcbuilder.pld-linux.org/th//srpms/689bbaa0-5dca-4a15-b5ee-5a893130d8af/SweetHome3D-6.4.2-2.src.rpm
fetched 26924981 bytes, 15125.5 K/s
installing srpm: SweetHome3D-6.4.2-2.src.rpm
+ install -d /tmp/B.n234rscm/BUILD /tmp/B.n234rscm/RPMS
+ LC_ALL=en_US.UTF-8
+ rpm -qp --changelog SweetHome3D-6.4.2-2.src.rpm
* Mon Sep 06 2021 PLD Linux Team <feedback@pld-linux.org>
- For complete changelog see: http://git.pld-linux.org/?p=packages/SweetHome3D.git;a=log;h=master
* Mon Sep 06 2021 Jan Rękorajski <baggins@pld-linux.org> f328444
- Release 2 (by relup.sh) * Mon Aug 31 2020 Jakub Bogusz <qboosh@pld-linux.org> da9d182
- updated to 6.4.2 * Wed Aug 08 2012 Jan Rękorajski <baggins@pld-linux.org> 340d40d
- Except false-positives from deps Release 3 * Wed Jun 29 2011 Arkadiusz Miśkiewicz <arekm@maven.pl> b5a95e3
- rel 2; BR just jdk instead of java-sun * Wed Jun 29 2011 Tomasz Pala <gotar@pld-linux.org> c71962e
- no java-sun for pre-i586 * Wed Jun 29 2011 Tomasz Pala <gotar@pld-linux.org> 2b696d1
- upgraded to 3.2, switched to build bytecode and resource jars from sources, - fixed javaws.jar path for the program to work, some lib issues still to resolve * Mon Feb 07 2011 sparky <sparky@pld-linux.org> d69ac25
- unified preamble in %changelog * Thu Dec 16 2010 Zsolt Udvari <uzsolt@pld-linux.org> 23c9170
- initial - TODO: does not run + rpm -Uhv --nodeps --define '_topdir /tmp/B.n234rscm' --define '_specdir %{_topdir}' --define '_sourcedir %{_specdir}' --define '_rpmdir %{_topdir}/RPMS' --define '_builddir %{_topdir}/BUILD' SweetHome3D-6.4.2-2.src.rpm Updating / installing... SweetHome3D-6.4.2-2 ######################################## + rm -f SweetHome3D-6.4.2-2.src.rpm + install -m 700 -d /tmp/B.n234rscm/BUILD/tmp + TMPDIR=/tmp/B.n234rscm/BUILD/tmp + exec nice -n 0 rpmbuild -bp --short-circuit --nodeps --define '_topdir /tmp/B.n234rscm' --define '_specdir %{_topdir}' --define '_sourcedir %{_specdir}' --define '_rpmdir %{_topdir}/RPMS' --define '_builddir %{_topdir}/BUILD' --target i686-pld-linux --define 'prep exit 0' /tmp/B.n234rscm/SweetHome3D.spec warning: Could not canonicalize hostname: nereid Building target platforms: i686-pld-linux Building for target i686-pld-linux checking BuildConflict-ing packages rpm: warning: Could not canonicalize hostname: nereid rpm: Building target platforms: i686-pld-linux rpm: Building for target i686-pld-linux no BuildConflicts found checking BR rpm: warning: Could not canonicalize hostname: nereid rpm: Building target platforms: i686-pld-linux rpm: Building for target i686-pld-linux no BR needed building RPM using: set -ex; : build-id: 689bbaa0-5dca-4a15-b5ee-5a893130d8af; TMPDIR=/tmp/B.n234rscm/BUILD/tmp exec nice -n 0 rpmbuild -bb --define '_smp_mflags -j9' --define '_make_opts -Otarget' --define '_pld_builder 1' --define '_topdir /tmp/B.n234rscm' --define '_specdir %{_topdir}' --define '_sourcedir %{_specdir}' --define '_rpmdir %{_topdir}/RPMS' --define '_builddir %{_topdir}/BUILD' --target i686-pld-linux /tmp/B.n234rscm/SweetHome3D.spec + : build-id: 689bbaa0-5dca-4a15-b5ee-5a893130d8af + TMPDIR=/tmp/B.n234rscm/BUILD/tmp + exec nice -n 0 rpmbuild -bb --define '_smp_mflags -j9' --define '_make_opts -Otarget' --define '_pld_builder 1' --define '_topdir /tmp/B.n234rscm' --define '_specdir %{_topdir}' --define '_sourcedir %{_specdir}' --define '_rpmdir %{_topdir}/RPMS' --define '_builddir %{_topdir}/BUILD' --target i686-pld-linux /tmp/B.n234rscm/SweetHome3D.spec warning: Could not canonicalize hostname: nereid Building target platforms: i686-pld-linux Building for target i686-pld-linux Executing(%prep): /bin/sh -e /tmp/B.n234rscm/BUILD/tmp/rpm-tmp.v5JIqu + umask 022 + cd /tmp/B.n234rscm/BUILD + cd /tmp/B.n234rscm/BUILD + rm -rf SweetHome3D-6.4.2-src + /usr/bin/unzip -qq /tmp/B.n234rscm/SweetHome3D-6.4.2-src.zip + STATUS=0 + '[' 0 -ne 0 ']' + cd SweetHome3D-6.4.2-src + /bin/chmod -Rf a+rX,u+w,g-w,o-w . + /bin/sed -e 's#exec "$PROGRAM_DIR"/jre8/bin/java#env java#; 3,8 c\PROGRAM_DIR=/usr/share/java/SweetHome3D' -e 's#jogl-java3d.jar#&:"$PROGRAM_DIR"/lib/java3d-1.6/jogl-all.jar#' -e 's#:"$PROGRAM_DIR"/jre8/lib/javaws.jar#:/usr/lib/jvm/java/jre/lib/javaws.jar#' -i install/linux/SweetHome3D + RPM_EC=0 + jobs -p + exit 0 Executing(%build): /bin/sh -e /tmp/B.n234rscm/BUILD/tmp/rpm-tmp.cO0ltY TMP=/home/users/builder/tmp HOME=/home/users/builder PATH=/home/users/builder/GNUstep/Tools:/bin:/usr/bin:/usr/local/bin:/home/users/builder/bin TMPDIR=/tmp/B.n234rscm/BUILD/tmp + umask 022 + cd /tmp/B.n234rscm/BUILD + cd SweetHome3D-6.4.2-src + JAVA_HOME=/usr/lib/jvm/java CLASSPATH=/home/users/builder/GNUstep/Library/Libraries/Java:/usr/local/lib/GNUstep/Libraries/Java:/usr/lib/GNUstep/Libraries/Java ant application furniture textures help /usr/bin/build-classpath: error: Could not find jaxp_parser_impl Java extension for this JVM /usr/bin/build-classpath: error: Some specified jars were not found Buildfile: /tmp/B.n234rscm/BUILD/SweetHome3D-6.4.2-src/build.xml build: [mkdir] Created dir: /tmp/B.n234rscm/BUILD/SweetHome3D-6.4.2-src/build/classes [javac] /tmp/B.n234rscm/BUILD/SweetHome3D-6.4.2-src/build.xml:47: warning: 'includeantruntime' was not set, defaulting to build.sysclasspath=last; set to false for repeatable builds [javac] Compiling 2 source files to /tmp/B.n234rscm/BUILD/SweetHome3D-6.4.2-src/build/classes [javac] warning: [options] bootstrap class path not set in conjunction with -source 1.3 [javac] error: Source option 1.3 is no longer supported. Use 6 or later. [javac] error: Target option 1.1 is no longer supported. Use 1.6 or later. BUILD FAILED /tmp/B.n234rscm/BUILD/SweetHome3D-6.4.2-src/build.xml:47: Compile failed; see the compiler error output for details. Total time: 0 seconds error: Bad exit status from /tmp/B.n234rscm/BUILD/tmp/rpm-tmp.cO0ltY (%build) RPM build errors: Could not canonicalize hostname: nereid Bad exit status from /tmp/B.n234rscm/BUILD/tmp/rpm-tmp.cO0ltY (%build) ended at: Mon Sep 6 13:03:52 2021, done in 0:00:01.516475 error: No files produced. + chmod -R u+rwX /tmp/B.n234rscm/BUILD + rm -rf /tmp/B.n234rscm/tmp /tmp/B.n234rscm/BUILD + rm -rf /tmp/B.n234rscm Begin-PLD-Builder-Info Build-Time: user:3.31s sys:1.03s real:5.30s (faults io:8 non-io:132836) End-PLD-Builder-Info
[Back to list of logs] [View rpm -qa of builder]