FailedOk

th/SRPMS[OK]
th/x32[OK]
th/i686[OK]
th/x86_64[OK]

ac/SRPMS[OK]
ac/i386[OK]
ac/i586[OK]
ac/i686[OK]
ac/alpha[OK]
ac/amd64[OK]
ac/athlon[OK]
ac/ppc[OK]
ac/sparc[OK]
ac/sparc64[OK]

Advanced Search
main()
Powered by PLD Linux
(c) 2002-2022 PLD Team
$Revision: 1.37 $
Powered by ELF.
Your IP: 3.238.72.122

python-pyicu 6ec31888-aad5-48f1-bd6f-2efa9cf86ff5

Status:Failed
Source URL:https://buildlogs.pld-linux.org/pld/th/i686/FAIL/python-pyicu,6ec31888-aad5-48f1-bd6f-2efa9cf86ff5.bz2
text/plain URL:View!
rpm -qa of builder:View!
Date:2022/01/14 20:10:01
Runtime:0:01:09.840372

Toc:

  • prep
  • Executing(%prep): /bin/sh -e /tmp/B.lj8ly57d/BUILD/tmp/rpm-tmp.GgW1qW
  • build
  • Executing(%build): /bin/sh -e /tmp/B.lj8ly57d/BUILD/tmp/rpm-tmp.FkJmJW
  • error 1
  • FAIL: testGetBestPattern (test_DateTimeParserGenerator.TestDateTimePatternGenerator)
  • error 2
  • AssertionError: u'17:30' != u'\u4e0b\u53485:30'
  • error 3
  • FAIL: testTransition (test_TimeZone.TestTimeZone)
  • error 4
  • AssertionError: datetime.datetime(2022, 11, 13, 2, 0, tzinfo=<ICUtzinfo: Pacific/Fiji>) != datetime.datetime(2021, 11, 14, 2, 0, tzinfo=<ICUtzinfo: Pacific/Fiji>)
  • error 5
  • error: Bad exit status from /tmp/B.lj8ly57d/BUILD/tmp/rpm-tmp.FkJmJW (%build)
  • error 6
  • RPM build errors:
  • error 7
  • error: No files produced.

Content:

request from: atler
checking if we should skip the build
started at: Fri Jan 14 20:08:49 2022
killing old processes on a builder
sending signal 9 to pid -1
cleaning up /tmp
fetching https://srcbuilder.pld-linux.org/th//srpms/6ec31888-aad5-48f1-bd6f-2efa9cf86ff5/python-pyicu-2.7.4-1.src.rpm
fetched 309940 bytes, 717.8 K/s
installing srpm: python-pyicu-2.7.4-1.src.rpm
+ install -d /tmp/B.lj8ly57d/BUILD /tmp/B.lj8ly57d/RPMS
+ LC_ALL=en_US.UTF-8
+ rpm -qp --changelog python-pyicu-2.7.4-1.src.rpm
* Fri Jan 14 2022 PLD Linux Team <feedback@pld-linux.org>
- For complete changelog see: http://git.pld-linux.org/?p=packages/python-pyicu.git;a=log;h=master
* Mon Aug 16 2021 Jan Palus <atler@pld-linux.org> 2979367
- up to 2.7.4 * Sat Feb 27 2021 Jan Rękorajski <baggins@pld-linux.org> 1908c3f
- release 5 (by relup.sh) * Wed Jul 01 2020 Jan Palus <atler@pld-linux.org> 81ee821
- icu 67 rebuild - release 4 (by relup.sh) * Mon Oct 28 2019 Jakub Bogusz <qboosh@pld-linux.org> 1835609
- tests BR: python-six * Mon Oct 28 2019 Jan Rękorajski <baggins@pld-linux.org> 1795eab
- rebuild with python 3.8 - release 3 (by relup.sh) * Sun Oct 06 2019 Jan Rękorajski <baggins@pld-linux.org> 3a43a6c
- rebuild with icu 65.1 - release 2 (by relup.sh) * Mon Apr 15 2019 Adam Gołębiowski <adamg@pld-linux.org> 4b18033
- updated to 2.3 * Mon Jul 02 2018 Arkadiusz Miśkiewicz <arekm@maven.pl> de240f0
- release 2 (by relup.sh) * Thu Apr 27 2017 Jakub Bogusz <qboosh@pld-linux.org> a93faa7
- force C++11 (in case it's not compiler default, e.g. gcc 4 or 5) - fix tests without pyicu installed * Wed Apr 26 2017 Jan Rękorajski <baggins@pld-linux.org> 8f268e2
- up to 1.9.6 * Sun Mar 12 2017 Jakub Bogusz <qboosh@pld-linux.org> 6e490d5
- run tests * Sun Mar 12 2017 Jan Rękorajski <baggins@pld-linux.org> 7789644
- up to 1.9.5 * Fri Mar 10 2017 Jan Rękorajski <baggins@pld-linux.org> ef426b7
- rebuild with icu 58.2 - release 11 (by relup.sh) * Thu Dec 29 2016 Arkadiusz Miśkiewicz <arekm@maven.pl> 5a8c8a8
- python 3.6 - release 10 (by relup.sh) * Mon May 16 2016 Elan Ruusamäe <glen@delfi.ee> 90633b8
- icu-57.1 rebuild - release 9 (by relup.sh) * Fri Dec 11 2015 Jan Rękorajski <baggins@pld-linux.org> bc6615b
- use new build/install macros - rel 8 * Sun Nov 29 2015 Jacek Konieczny <jajcus@jajcus.net> e4456c6
- BR: rpmbuild(macros) >= 1.710 * Sat Nov 28 2015 Jacek Konieczny <jajcus@jajcus.net> 89bf097
- release 7 (by relup.sh) * Sat Nov 28 2015 Jacek Konieczny <jajcus@jajcus.net> 9b01fac
- automatic change: use py_build/py_install macros * Wed Nov 18 2015 Jan Rękorajski <baggins@pld-linux.org> d52e839
- release 6 (by relup.sh) + rpm -Uhv --nodeps --define '_topdir /tmp/B.lj8ly57d' --define '_specdir %{_topdir}' --define '_sourcedir %{_specdir}' --define '_rpmdir %{_topdir}/RPMS' --define '_builddir %{_topdir}/BUILD' python-pyicu-2.7.4-1.src.rpm Updating / installing... python-pyicu-2.7.4-1 ######################################## + rm -f python-pyicu-2.7.4-1.src.rpm + install -m 700 -d /tmp/B.lj8ly57d/BUILD/tmp + TMPDIR=/tmp/B.lj8ly57d/BUILD/tmp + exec nice -n 0 rpmbuild -bp --short-circuit --nodeps --define '_topdir /tmp/B.lj8ly57d' --define '_specdir %{_topdir}' --define '_sourcedir %{_specdir}' --define '_rpmdir %{_topdir}/RPMS' --define '_builddir %{_topdir}/BUILD' --target i686-pld-linux --define 'prep exit 0' /tmp/B.lj8ly57d/python-pyicu.spec warning: Could not canonicalize hostname: nereid Building target platforms: i686-pld-linux Building for target i686-pld-linux checking BuildConflict-ing packages rpm: warning: Could not canonicalize hostname: nereid rpm: Building target platforms: i686-pld-linux rpm: Building for target i686-pld-linux no BuildConflicts found checking BR rpm: warning: Could not canonicalize hostname: nereid rpm: Building target platforms: i686-pld-linux rpm: Building for target i686-pld-linux no BR needed building RPM using: set -ex; : build-id: 6ec31888-aad5-48f1-bd6f-2efa9cf86ff5; TMPDIR=/tmp/B.lj8ly57d/BUILD/tmp exec nice -n 0 rpmbuild -bb --define '_smp_mflags -j9' --define '_make_opts -Otarget' --define '_pld_builder 1' --define '_topdir /tmp/B.lj8ly57d' --define '_specdir %{_topdir}' --define '_sourcedir %{_specdir}' --define '_rpmdir %{_topdir}/RPMS' --define '_builddir %{_topdir}/BUILD' --target i686-pld-linux /tmp/B.lj8ly57d/python-pyicu.spec + : build-id: 6ec31888-aad5-48f1-bd6f-2efa9cf86ff5 + TMPDIR=/tmp/B.lj8ly57d/BUILD/tmp + exec nice -n 0 rpmbuild -bb --define '_smp_mflags -j9' --define '_make_opts -Otarget' --define '_pld_builder 1' --define '_topdir /tmp/B.lj8ly57d' --define '_specdir %{_topdir}' --define '_sourcedir %{_specdir}' --define '_rpmdir %{_topdir}/RPMS' --define '_builddir %{_topdir}/BUILD' --target i686-pld-linux /tmp/B.lj8ly57d/python-pyicu.spec warning: Could not canonicalize hostname: nereid Building target platforms: i686-pld-linux Building for target i686-pld-linux Executing(%prep): /bin/sh -e /tmp/B.lj8ly57d/BUILD/tmp/rpm-tmp.GgW1qW + umask 022 + cd /tmp/B.lj8ly57d/BUILD + cd /tmp/B.lj8ly57d/BUILD + rm -rf PyICU-2.7.4 + /bin/gzip -dc /tmp/B.lj8ly57d/PyICU-2.7.4.tar.gz + /bin/tar -xof - + STATUS=0 + '[' 0 -ne 0 ']' + cd PyICU-2.7.4 + /bin/chmod -Rf a+rX,u+w,g-w,o-w . + echo 'Patch #0 (0001-disable-failing-test.patch):' Patch #0 (0001-disable-failing-test.patch): + </tmp/B.lj8ly57d/0001-disable-failing-test.patch + /usr/bin/patch -s -p1 '--fuzz=0' + RPM_EC=0 + jobs -p + exit 0 Executing(%build): /bin/sh -e /tmp/B.lj8ly57d/BUILD/tmp/rpm-tmp.FkJmJW TMP=/home/users/builder/tmp HOME=/home/users/builder PATH=/home/users/builder/GNUstep/Tools:/bin:/usr/bin:/usr/local/bin:/home/users/builder/bin TMPDIR=/tmp/B.lj8ly57d/BUILD/tmp + umask 022 + cd /tmp/B.lj8ly57d/BUILD + cd PyICU-2.7.4 + CFLAGS='-O2 -fwrapv -pipe -Wformat -Werror=format-security -gdwarf-4 -fno-debug-types-section -fvar-tracking-assignments -g2 -Wp,-D_FORTIFY_SOURCE=2 -fstack-protector-strong --param=ssp-buffer-size=4 -Werror=trampolines -fomit-frame-pointer -march=i686 -fasynchronous-unwind-tables -mtune=pentium4 -gdwarf-4 -fno-debug-types-section -fvar-tracking-assignments -g2 -std=c++11' + LDFLAGS='-Wl,--as-needed -Wl,--no-copy-dt-needed-entries -Wl,-z,relro -Wl,-z,combreloc ' + export LDFLAGS + CFLAGS='-O2 -fwrapv -pipe -Wformat -Werror=format-security -gdwarf-4 -fno-debug-types-section -fvar-tracking-assignments -g2 -Wp,-D_FORTIFY_SOURCE=2 -fstack-protector-strong --param=ssp-buffer-size=4 -Werror=trampolines -fomit-frame-pointer -march=i686 -fasynchronous-unwind-tables -mtune=pentium4 -gdwarf-4 -fno-debug-types-section -fvar-tracking-assignments -g2 -std=c++11' + export CFLAGS + CXXFLAGS=' -O2 -fwrapv -pipe -Wformat -Werror=format-security -gdwarf-4 -fno-debug-types-section -fvar-tracking-assignments -g2 -Wp,-D_FORTIFY_SOURCE=2 -fstack-protector-strong --param=ssp-buffer-size=4 -Werror=trampolines -fomit-frame-pointer -march=i686 -fasynchronous-unwind-tables -mtune=pentium4 -gdwarf-4 -fno-debug-types-section -fvar-tracking-assignments -g2 ' + export CXXFLAGS + CC=i686-pld-linux-gcc + export CC + CXX=i686-pld-linux-g++ + export CXX + /usr/bin/python2 setup.py build '--build-base=build-2' (running 'icu-config --version') Building PyICU 2.7.4 for ICU 70.1 (max ICU major version supported: 69) (running 'icu-config --cxxflags --cppflags') Adding CFLAGS="-std=c++11 -I/usr/include" from /usr/bin/icu-config (running 'icu-config --ldflags') Adding LFLAGS="-L/usr/lib -licui18n -licuuc -licudata" from /usr/bin/icu-config running build running build_py creating build-2 creating build-2/lib.linux-i686-2.7 copying PyICU.py -> build-2/lib.linux-i686-2.7 creating build-2/lib.linux-i686-2.7/icu copying icu/__init__.py -> build-2/lib.linux-i686-2.7/icu running build_ext building '_icu' extension creating build-2/temp.linux-i686-2.7 i686-pld-linux-gcc -fno-strict-aliasing -O2 -fwrapv -pipe -Wformat -Werror=format-security -gdwarf-4 -fno-debug-types-section -fvar-tracking-assignments -g2 -Wp,-D_FORTIFY_SOURCE=2 -fstack-protector-strong --param=ssp-buffer-size=4 -Werror=trampolines -fomit-frame-pointer -march=i686 -fasynchronous-unwind-tables -mtune=pentium4 -gdwarf-4 -fno-debug-types-section -fvar-tracking-assignments -g2 -DNDEBUG -O2 -fwrapv -pipe -Wformat -Werror=format-security -gdwarf-4 -fno-debug-types-section -fvar-tracking-assignments -g2 -Wp,-D_FORTIFY_SOURCE=2 -fstack-protector-strong --param=ssp-buffer-size=4 -Werror=trampolines -fomit-frame-pointer -march=i686 -fasynchronous-unwind-tables -mtune=pentium4 -gdwarf-4 -fno-debug-types-section -fvar-tracking-assignments -g2 -O2 -fwrapv -pipe -Wformat -Werror=format-security -gdwarf-4 -fno-debug-types-section -fvar-tracking-assignments -g2 -Wp,-D_FORTIFY_SOURCE=2 -fstack-protector-strong --param=ssp-buffer-size=4 -Werror=trampolines -fomit-frame-pointer -march=i686 -fasynchronous-unwind-tables -mtune=pentium4 -gdwarf-4 -fno-debug-types-section -fvar-tracking-assignments -g2 -std=c++11 -fPIC -I/usr/include/python2.7 -c _icu.cpp -o build-2/temp.linux-i686-2.7/_icu.o -std=c++11 -I/usr/include -DPYICU_VER="2.7.4" -DPYICU_ICU_MAX_VER="69" i686-pld-linux-gcc -fno-strict-aliasing -O2 -fwrapv -pipe -Wformat -Werror=format-security -gdwarf-4 -fno-debug-types-section -fvar-tracking-assignments -g2 -Wp,-D_FORTIFY_SOURCE=2 -fstack-protector-strong --param=ssp-buffer-size=4 -Werror=trampolines -fomit-frame-pointer -march=i686 -fasynchronous-unwind-tables -mtune=pentium4 -gdwarf-4 -fno-debug-types-section -fvar-tracking-assignments -g2 -DNDEBUG -O2 -fwrapv -pipe -Wformat -Werror=format-security -gdwarf-4 -fno-debug-types-section -fvar-tracking-assignments -g2 -Wp,-D_FORTIFY_SOURCE=2 -fstack-protector-strong --param=ssp-buffer-size=4 -Werror=trampolines -fomit-frame-pointer -march=i686 -fasynchronous-unwind-tables -mtune=pentium4 -gdwarf-4 -fno-debug-types-section -fvar-tracking-assignments -g2 -O2 -fwrapv -pipe -Wformat -Werror=format-security -gdwarf-4 -fno-debug-types-section -fvar-tracking-assignments -g2 -Wp,-D_FORTIFY_SOURCE=2 -fstack-protector-strong --param=ssp-buffer-size=4 -Werror=trampolines -fomit-frame-pointer -march=i686 -fasynchronous-unwind-tables -mtune=pentium4 -gdwarf-4 -fno-debug-types-section -fvar-tracking-assignments -g2 -std=c++11 -fPIC -I/usr/include/python2.7 -c bases.cpp -o build-2/temp.linux-i686-2.7/bases.o -std=c++11 -I/usr/include -DPYICU_VER="2.7.4" -DPYICU_ICU_MAX_VER="69" i686-pld-linux-gcc -fno-strict-aliasing -O2 -fwrapv -pipe -Wformat -Werror=format-security -gdwarf-4 -fno-debug-types-section -fvar-tracking-assignments -g2 -Wp,-D_FORTIFY_SOURCE=2 -fstack-protector-strong --param=ssp-buffer-size=4 -Werror=trampolines -fomit-frame-pointer -march=i686 -fasynchronous-unwind-tables -mtune=pentium4 -gdwarf-4 -fno-debug-types-section -fvar-tracking-assignments -g2 -DNDEBUG -O2 -fwrapv -pipe -Wformat -Werror=format-security -gdwarf-4 -fno-debug-types-section -fvar-tracking-assignments -g2 -Wp,-D_FORTIFY_SOURCE=2 -fstack-protector-strong --param=ssp-buffer-size=4 -Werror=trampolines -fomit-frame-pointer -march=i686 -fasynchronous-unwind-tables -mtune=pentium4 -gdwarf-4 -fno-debug-types-section -fvar-tracking-assignments -g2 -O2 -fwrapv -pipe -Wformat -Werror=format-security -gdwarf-4 -fno-debug-types-section -fvar-tracking-assignments -g2 -Wp,-D_FORTIFY_SOURCE=2 -fstack-protector-strong --param=ssp-buffer-size=4 -Werror=trampolines -fomit-frame-pointer -march=i686 -fasynchronous-unwind-tables -mtune=pentium4 -gdwarf-4 -fno-debug-types-section -fvar-tracking-assignments -g2 -std=c++11 -fPIC -I/usr/include/python2.7 -c bidi.cpp -o build-2/temp.linux-i686-2.7/bidi.o -std=c++11 -I/usr/include -DPYICU_VER="2.7.4" -DPYICU_ICU_MAX_VER="69" In file included from /usr/include/python2.7/pyconfig.h:9, from /usr/include/python2.7/Python.h:8, from common.h:44, from bidi.cpp:26: /usr/lib/python2.7/config/pyconfig.h:1223: warning: "_POSIX_C_SOURCE" redefined 1223 | #define _POSIX_C_SOURCE 200112L | In file included from /usr/include/c++/11.2.0/i686-pld-linux/bits/os_defines.h:39, from /usr/include/c++/11.2.0/i686-pld-linux/bits/c++config.h:586, from /usr/include/c++/11.2.0/cstdlib:41, from /usr/include/c++/11.2.0/stdlib.h:36, from bidi.cpp:24: /usr/include/features.h:290: note: this is the location of the previous definition 290 | # define _POSIX_C_SOURCE 200809L | In file included from /usr/include/python2.7/pyconfig.h:9, from /usr/include/python2.7/Python.h:8, from common.h:44, from bidi.cpp:26: /usr/lib/python2.7/config/pyconfig.h:1245: warning: "_XOPEN_SOURCE" redefined 1245 | #define _XOPEN_SOURCE 600 | In file included from /usr/include/c++/11.2.0/i686-pld-linux/bits/os_defines.h:39, from /usr/include/c++/11.2.0/i686-pld-linux/bits/c++config.h:586, from /usr/include/c++/11.2.0/cstdlib:41, from /usr/include/c++/11.2.0/stdlib.h:36, from bidi.cpp:24: /usr/include/features.h:214: note: this is the location of the previous definition 214 | # define _XOPEN_SOURCE 700 | i686-pld-linux-gcc -fno-strict-aliasing -O2 -fwrapv -pipe -Wformat -Werror=format-security -gdwarf-4 -fno-debug-types-section -fvar-tracking-assignments -g2 -Wp,-D_FORTIFY_SOURCE=2 -fstack-protector-strong --param=ssp-buffer-size=4 -Werror=trampolines -fomit-frame-pointer -march=i686 -fasynchronous-unwind-tables -mtune=pentium4 -gdwarf-4 -fno-debug-types-section -fvar-tracking-assignments -g2 -DNDEBUG -O2 -fwrapv -pipe -Wformat -Werror=format-security -gdwarf-4 -fno-debug-types-section -fvar-tracking-assignments -g2 -Wp,-D_FORTIFY_SOURCE=2 -fstack-protector-strong --param=ssp-buffer-size=4 -Werror=trampolines -fomit-frame-pointer -march=i686 -fasynchronous-unwind-tables -mtune=pentium4 -gdwarf-4 -fno-debug-types-section -fvar-tracking-assignments -g2 -O2 -fwrapv -pipe -Wformat -Werror=format-security -gdwarf-4 -fno-debug-types-section -fvar-tracking-assignments -g2 -Wp,-D_FORTIFY_SOURCE=2 -fstack-protector-strong --param=ssp-buffer-size=4 -Werror=trampolines -fomit-frame-pointer -march=i686 -fasynchronous-unwind-tables -mtune=pentium4 -gdwarf-4 -fno-debug-types-section -fvar-tracking-assignments -g2 -std=c++11 -fPIC -I/usr/include/python2.7 -c calendar.cpp -o build-2/temp.linux-i686-2.7/calendar.o -std=c++11 -I/usr/include -DPYICU_VER="2.7.4" -DPYICU_ICU_MAX_VER="69" i686-pld-linux-gcc -fno-strict-aliasing -O2 -fwrapv -pipe -Wformat -Werror=format-security -gdwarf-4 -fno-debug-types-section -fvar-tracking-assignments -g2 -Wp,-D_FORTIFY_SOURCE=2 -fstack-protector-strong --param=ssp-buffer-size=4 -Werror=trampolines -fomit-frame-pointer -march=i686 -fasynchronous-unwind-tables -mtune=pentium4 -gdwarf-4 -fno-debug-types-section -fvar-tracking-assignments -g2 -DNDEBUG -O2 -fwrapv -pipe -Wformat -Werror=format-security -gdwarf-4 -fno-debug-types-section -fvar-tracking-assignments -g2 -Wp,-D_FORTIFY_SOURCE=2 -fstack-protector-strong --param=ssp-buffer-size=4 -Werror=trampolines -fomit-frame-pointer -march=i686 -fasynchronous-unwind-tables -mtune=pentium4 -gdwarf-4 -fno-debug-types-section -fvar-tracking-assignments -g2 -O2 -fwrapv -pipe -Wformat -Werror=format-security -gdwarf-4 -fno-debug-types-section -fvar-tracking-assignments -g2 -Wp,-D_FORTIFY_SOURCE=2 -fstack-protector-strong --param=ssp-buffer-size=4 -Werror=trampolines -fomit-frame-pointer -march=i686 -fasynchronous-unwind-tables -mtune=pentium4 -gdwarf-4 -fno-debug-types-section -fvar-tracking-assignments -g2 -std=c++11 -fPIC -I/usr/include/python2.7 -c casemap.cpp -o build-2/temp.linux-i686-2.7/casemap.o -std=c++11 -I/usr/include -DPYICU_VER="2.7.4" -DPYICU_ICU_MAX_VER="69" i686-pld-linux-gcc -fno-strict-aliasing -O2 -fwrapv -pipe -Wformat -Werror=format-security -gdwarf-4 -fno-debug-types-section -fvar-tracking-assignments -g2 -Wp,-D_FORTIFY_SOURCE=2 -fstack-protector-strong --param=ssp-buffer-size=4 -Werror=trampolines -fomit-frame-pointer -march=i686 -fasynchronous-unwind-tables -mtune=pentium4 -gdwarf-4 -fno-debug-types-section -fvar-tracking-assignments -g2 -DNDEBUG -O2 -fwrapv -pipe -Wformat -Werror=format-security -gdwarf-4 -fno-debug-types-section -fvar-tracking-assignments -g2 -Wp,-D_FORTIFY_SOURCE=2 -fstack-protector-strong --param=ssp-buffer-size=4 -Werror=trampolines -fomit-frame-pointer -march=i686 -fasynchronous-unwind-tables -mtune=pentium4 -gdwarf-4 -fno-debug-types-section -fvar-tracking-assignments -g2 -O2 -fwrapv -pipe -Wformat -Werror=format-security -gdwarf-4 -fno-debug-types-section -fvar-tracking-assignments -g2 -Wp,-D_FORTIFY_SOURCE=2 -fstack-protector-strong --param=ssp-buffer-size=4 -Werror=trampolines -fomit-frame-pointer -march=i686 -fasynchronous-unwind-tables -mtune=pentium4 -gdwarf-4 -fno-debug-types-section -fvar-tracking-assignments -g2 -std=c++11 -fPIC -I/usr/include/python2.7 -c char.cpp -o build-2/temp.linux-i686-2.7/char.o -std=c++11 -I/usr/include -DPYICU_VER="2.7.4" -DPYICU_ICU_MAX_VER="69" In file included from /usr/include/python2.7/pyconfig.h:9, from /usr/include/python2.7/Python.h:8, from common.h:44, from char.cpp:27: /usr/lib/python2.7/config/pyconfig.h:1223: warning: "_POSIX_C_SOURCE" redefined 1223 | #define _POSIX_C_SOURCE 200112L | In file included from /usr/include/c++/11.2.0/i686-pld-linux/bits/os_defines.h:39, from /usr/include/c++/11.2.0/i686-pld-linux/bits/c++config.h:586, from /usr/include/c++/11.2.0/cstdlib:41, from /usr/include/c++/11.2.0/stdlib.h:36, from char.cpp:24: /usr/include/features.h:290: note: this is the location of the previous definition 290 | # define _POSIX_C_SOURCE 200809L | In file included from /usr/include/python2.7/pyconfig.h:9, from /usr/include/python2.7/Python.h:8, from common.h:44, from char.cpp:27: /usr/lib/python2.7/config/pyconfig.h:1245: warning: "_XOPEN_SOURCE" redefined 1245 | #define _XOPEN_SOURCE 600 | In file included from /usr/include/c++/11.2.0/i686-pld-linux/bits/os_defines.h:39, from /usr/include/c++/11.2.0/i686-pld-linux/bits/c++config.h:586, from /usr/include/c++/11.2.0/cstdlib:41, from /usr/include/c++/11.2.0/stdlib.h:36, from char.cpp:24: /usr/include/features.h:214: note: this is the location of the previous definition 214 | # define _XOPEN_SOURCE 700 | i686-pld-linux-gcc -fno-strict-aliasing -O2 -fwrapv -pipe -Wformat -Werror=format-security -gdwarf-4 -fno-debug-types-section -fvar-tracking-assignments -g2 -Wp,-D_FORTIFY_SOURCE=2 -fstack-protector-strong --param=ssp-buffer-size=4 -Werror=trampolines -fomit-frame-pointer -march=i686 -fasynchronous-unwind-tables -mtune=pentium4 -gdwarf-4 -fno-debug-types-section -fvar-tracking-assignments -g2 -DNDEBUG -O2 -fwrapv -pipe -Wformat -Werror=format-security -gdwarf-4 -fno-debug-types-section -fvar-tracking-assignments -g2 -Wp,-D_FORTIFY_SOURCE=2 -fstack-protector-strong --param=ssp-buffer-size=4 -Werror=trampolines -fomit-frame-pointer -march=i686 -fasynchronous-unwind-tables -mtune=pentium4 -gdwarf-4 -fno-debug-types-section -fvar-tracking-assignments -g2 -O2 -fwrapv -pipe -Wformat -Werror=format-security -gdwarf-4 -fno-debug-types-section -fvar-tracking-assignments -g2 -Wp,-D_FORTIFY_SOURCE=2 -fstack-protector-strong --param=ssp-buffer-size=4 -Werror=trampolines -fomit-frame-pointer -march=i686 -fasynchronous-unwind-tables -mtune=pentium4 -gdwarf-4 -fno-debug-types-section -fvar-tracking-assignments -g2 -std=c++11 -fPIC -I/usr/include/python2.7 -c charset.cpp -o build-2/temp.linux-i686-2.7/charset.o -std=c++11 -I/usr/include -DPYICU_VER="2.7.4" -DPYICU_ICU_MAX_VER="69" i686-pld-linux-gcc -fno-strict-aliasing -O2 -fwrapv -pipe -Wformat -Werror=format-security -gdwarf-4 -fno-debug-types-section -fvar-tracking-assignments -g2 -Wp,-D_FORTIFY_SOURCE=2 -fstack-protector-strong --param=ssp-buffer-size=4 -Werror=trampolines -fomit-frame-pointer -march=i686 -fasynchronous-unwind-tables -mtune=pentium4 -gdwarf-4 -fno-debug-types-section -fvar-tracking-assignments -g2 -DNDEBUG -O2 -fwrapv -pipe -Wformat -Werror=format-security -gdwarf-4 -fno-debug-types-section -fvar-tracking-assignments -g2 -Wp,-D_FORTIFY_SOURCE=2 -fstack-protector-strong --param=ssp-buffer-size=4 -Werror=trampolines -fomit-frame-pointer -march=i686 -fasynchronous-unwind-tables -mtune=pentium4 -gdwarf-4 -fno-debug-types-section -fvar-tracking-assignments -g2 -O2 -fwrapv -pipe -Wformat -Werror=format-security -gdwarf-4 -fno-debug-types-section -fvar-tracking-assignments -g2 -Wp,-D_FORTIFY_SOURCE=2 -fstack-protector-strong --param=ssp-buffer-size=4 -Werror=trampolines -fomit-frame-pointer -march=i686 -fasynchronous-unwind-tables -mtune=pentium4 -gdwarf-4 -fno-debug-types-section -fvar-tracking-assignments -g2 -std=c++11 -fPIC -I/usr/include/python2.7 -c collator.cpp -o build-2/temp.linux-i686-2.7/collator.o -std=c++11 -I/usr/include -DPYICU_VER="2.7.4" -DPYICU_ICU_MAX_VER="69" i686-pld-linux-gcc -fno-strict-aliasing -O2 -fwrapv -pipe -Wformat -Werror=format-security -gdwarf-4 -fno-debug-types-section -fvar-tracking-assignments -g2 -Wp,-D_FORTIFY_SOURCE=2 -fstack-protector-strong --param=ssp-buffer-size=4 -Werror=trampolines -fomit-frame-pointer -march=i686 -fasynchronous-unwind-tables -mtune=pentium4 -gdwarf-4 -fno-debug-types-section -fvar-tracking-assignments -g2 -DNDEBUG -O2 -fwrapv -pipe -Wformat -Werror=format-security -gdwarf-4 -fno-debug-types-section -fvar-tracking-assignments -g2 -Wp,-D_FORTIFY_SOURCE=2 -fstack-protector-strong --param=ssp-buffer-size=4 -Werror=trampolines -fomit-frame-pointer -march=i686 -fasynchronous-unwind-tables -mtune=pentium4 -gdwarf-4 -fno-debug-types-section -fvar-tracking-assignments -g2 -O2 -fwrapv -pipe -Wformat -Werror=format-security -gdwarf-4 -fno-debug-types-section -fvar-tracking-assignments -g2 -Wp,-D_FORTIFY_SOURCE=2 -fstack-protector-strong --param=ssp-buffer-size=4 -Werror=trampolines -fomit-frame-pointer -march=i686 -fasynchronous-unwind-tables -mtune=pentium4 -gdwarf-4 -fno-debug-types-section -fvar-tracking-assignments -g2 -std=c++11 -fPIC -I/usr/include/python2.7 -c common.cpp -o build-2/temp.linux-i686-2.7/common.o -std=c++11 -I/usr/include -DPYICU_VER="2.7.4" -DPYICU_ICU_MAX_VER="69" i686-pld-linux-gcc -fno-strict-aliasing -O2 -fwrapv -pipe -Wformat -Werror=format-security -gdwarf-4 -fno-debug-types-section -fvar-tracking-assignments -g2 -Wp,-D_FORTIFY_SOURCE=2 -fstack-protector-strong --param=ssp-buffer-size=4 -Werror=trampolines -fomit-frame-pointer -march=i686 -fasynchronous-unwind-tables -mtune=pentium4 -gdwarf-4 -fno-debug-types-section -fvar-tracking-assignments -g2 -DNDEBUG -O2 -fwrapv -pipe -Wformat -Werror=format-security -gdwarf-4 -fno-debug-types-section -fvar-tracking-assignments -g2 -Wp,-D_FORTIFY_SOURCE=2 -fstack-protector-strong --param=ssp-buffer-size=4 -Werror=trampolines -fomit-frame-pointer -march=i686 -fasynchronous-unwind-tables -mtune=pentium4 -gdwarf-4 -fno-debug-types-section -fvar-tracking-assignments -g2 -O2 -fwrapv -pipe -Wformat -Werror=format-security -gdwarf-4 -fno-debug-types-section -fvar-tracking-assignments -g2 -Wp,-D_FORTIFY_SOURCE=2 -fstack-protector-strong --param=ssp-buffer-size=4 -Werror=trampolines -fomit-frame-pointer -march=i686 -fasynchronous-unwind-tables -mtune=pentium4 -gdwarf-4 -fno-debug-types-section -fvar-tracking-assignments -g2 -std=c++11 -fPIC -I/usr/include/python2.7 -c dateformat.cpp -o build-2/temp.linux-i686-2.7/dateformat.o -std=c++11 -I/usr/include -DPYICU_VER="2.7.4" -DPYICU_ICU_MAX_VER="69" i686-pld-linux-gcc -fno-strict-aliasing -O2 -fwrapv -pipe -Wformat -Werror=format-security -gdwarf-4 -fno-debug-types-section -fvar-tracking-assignments -g2 -Wp,-D_FORTIFY_SOURCE=2 -fstack-protector-strong --param=ssp-buffer-size=4 -Werror=trampolines -fomit-frame-pointer -march=i686 -fasynchronous-unwind-tables -mtune=pentium4 -gdwarf-4 -fno-debug-types-section -fvar-tracking-assignments -g2 -DNDEBUG -O2 -fwrapv -pipe -Wformat -Werror=format-security -gdwarf-4 -fno-debug-types-section -fvar-tracking-assignments -g2 -Wp,-D_FORTIFY_SOURCE=2 -fstack-protector-strong --param=ssp-buffer-size=4 -Werror=trampolines -fomit-frame-pointer -march=i686 -fasynchronous-unwind-tables -mtune=pentium4 -gdwarf-4 -fno-debug-types-section -fvar-tracking-assignments -g2 -O2 -fwrapv -pipe -Wformat -Werror=format-security -gdwarf-4 -fno-debug-types-section -fvar-tracking-assignments -g2 -Wp,-D_FORTIFY_SOURCE=2 -fstack-protector-strong --param=ssp-buffer-size=4 -Werror=trampolines -fomit-frame-pointer -march=i686 -fasynchronous-unwind-tables -mtune=pentium4 -gdwarf-4 -fno-debug-types-section -fvar-tracking-assignments -g2 -std=c++11 -fPIC -I/usr/include/python2.7 -c errors.cpp -o build-2/temp.linux-i686-2.7/errors.o -std=c++11 -I/usr/include -DPYICU_VER="2.7.4" -DPYICU_ICU_MAX_VER="69" i686-pld-linux-gcc -fno-strict-aliasing -O2 -fwrapv -pipe -Wformat -Werror=format-security -gdwarf-4 -fno-debug-types-section -fvar-tracking-assignments -g2 -Wp,-D_FORTIFY_SOURCE=2 -fstack-protector-strong --param=ssp-buffer-size=4 -Werror=trampolines -fomit-frame-pointer -march=i686 -fasynchronous-unwind-tables -mtune=pentium4 -gdwarf-4 -fno-debug-types-section -fvar-tracking-assignments -g2 -DNDEBUG -O2 -fwrapv -pipe -Wformat -Werror=format-security -gdwarf-4 -fno-debug-types-section -fvar-tracking-assignments -g2 -Wp,-D_FORTIFY_SOURCE=2 -fstack-protector-strong --param=ssp-buffer-size=4 -Werror=trampolines -fomit-frame-pointer -march=i686 -fasynchronous-unwind-tables -mtune=pentium4 -gdwarf-4 -fno-debug-types-section -fvar-tracking-assignments -g2 -O2 -fwrapv -pipe -Wformat -Werror=format-security -gdwarf-4 -fno-debug-types-section -fvar-tracking-assignments -g2 -Wp,-D_FORTIFY_SOURCE=2 -fstack-protector-strong --param=ssp-buffer-size=4 -Werror=trampolines -fomit-frame-pointer -march=i686 -fasynchronous-unwind-tables -mtune=pentium4 -gdwarf-4 -fno-debug-types-section -fvar-tracking-assignments -g2 -std=c++11 -fPIC -I/usr/include/python2.7 -c format.cpp -o build-2/temp.linux-i686-2.7/format.o -std=c++11 -I/usr/include -DPYICU_VER="2.7.4" -DPYICU_ICU_MAX_VER="69" i686-pld-linux-gcc -fno-strict-aliasing -O2 -fwrapv -pipe -Wformat -Werror=format-security -gdwarf-4 -fno-debug-types-section -fvar-tracking-assignments -g2 -Wp,-D_FORTIFY_SOURCE=2 -fstack-protector-strong --param=ssp-buffer-size=4 -Werror=trampolines -fomit-frame-pointer -march=i686 -fasynchronous-unwind-tables -mtune=pentium4 -gdwarf-4 -fno-debug-types-section -fvar-tracking-assignments -g2 -DNDEBUG -O2 -fwrapv -pipe -Wformat -Werror=format-security -gdwarf-4 -fno-debug-types-section -fvar-tracking-assignments -g2 -Wp,-D_FORTIFY_SOURCE=2 -fstack-protector-strong --param=ssp-buffer-size=4 -Werror=trampolines -fomit-frame-pointer -march=i686 -fasynchronous-unwind-tables -mtune=pentium4 -gdwarf-4 -fno-debug-types-section -fvar-tracking-assignments -g2 -O2 -fwrapv -pipe -Wformat -Werror=format-security -gdwarf-4 -fno-debug-types-section -fvar-tracking-assignments -g2 -Wp,-D_FORTIFY_SOURCE=2 -fstack-protector-strong --param=ssp-buffer-size=4 -Werror=trampolines -fomit-frame-pointer -march=i686 -fasynchronous-unwind-tables -mtune=pentium4 -gdwarf-4 -fno-debug-types-section -fvar-tracking-assignments -g2 -std=c++11 -fPIC -I/usr/include/python2.7 -c gender.cpp -o build-2/temp.linux-i686-2.7/gender.o -std=c++11 -I/usr/include -DPYICU_VER="2.7.4" -DPYICU_ICU_MAX_VER="69" i686-pld-linux-gcc -fno-strict-aliasing -O2 -fwrapv -pipe -Wformat -Werror=format-security -gdwarf-4 -fno-debug-types-section -fvar-tracking-assignments -g2 -Wp,-D_FORTIFY_SOURCE=2 -fstack-protector-strong --param=ssp-buffer-size=4 -Werror=trampolines -fomit-frame-pointer -march=i686 -fasynchronous-unwind-tables -mtune=pentium4 -gdwarf-4 -fno-debug-types-section -fvar-tracking-assignments -g2 -DNDEBUG -O2 -fwrapv -pipe -Wformat -Werror=format-security -gdwarf-4 -fno-debug-types-section -fvar-tracking-assignments -g2 -Wp,-D_FORTIFY_SOURCE=2 -fstack-protector-strong --param=ssp-buffer-size=4 -Werror=trampolines -fomit-frame-pointer -march=i686 -fasynchronous-unwind-tables -mtune=pentium4 -gdwarf-4 -fno-debug-types-section -fvar-tracking-assignments -g2 -O2 -fwrapv -pipe -Wformat -Werror=format-security -gdwarf-4 -fno-debug-types-section -fvar-tracking-assignments -g2 -Wp,-D_FORTIFY_SOURCE=2 -fstack-protector-strong --param=ssp-buffer-size=4 -Werror=trampolines -fomit-frame-pointer -march=i686 -fasynchronous-unwind-tables -mtune=pentium4 -gdwarf-4 -fno-debug-types-section -fvar-tracking-assignments -g2 -std=c++11 -fPIC -I/usr/include/python2.7 -c idna.cpp -o build-2/temp.linux-i686-2.7/idna.o -std=c++11 -I/usr/include -DPYICU_VER="2.7.4" -DPYICU_ICU_MAX_VER="69" In file included from /usr/include/python2.7/pyconfig.h:9, from /usr/include/python2.7/Python.h:8, from common.h:44, from idna.cpp:27: /usr/lib/python2.7/config/pyconfig.h:1223: warning: "_POSIX_C_SOURCE" redefined 1223 | #define _POSIX_C_SOURCE 200112L | In file included from /usr/include/c++/11.2.0/i686-pld-linux/bits/os_defines.h:39, from /usr/include/c++/11.2.0/i686-pld-linux/bits/c++config.h:586, from /usr/include/c++/11.2.0/cstdlib:41, from /usr/include/c++/11.2.0/stdlib.h:36, from idna.cpp:24: /usr/include/features.h:290: note: this is the location of the previous definition 290 | # define _POSIX_C_SOURCE 200809L | In file included from /usr/include/python2.7/pyconfig.h:9, from /usr/include/python2.7/Python.h:8, from common.h:44, from idna.cpp:27: /usr/lib/python2.7/config/pyconfig.h:1245: warning: "_XOPEN_SOURCE" redefined 1245 | #define _XOPEN_SOURCE 600 | In file included from /usr/include/c++/11.2.0/i686-pld-linux/bits/os_defines.h:39, from /usr/include/c++/11.2.0/i686-pld-linux/bits/c++config.h:586, from /usr/include/c++/11.2.0/cstdlib:41, from /usr/include/c++/11.2.0/stdlib.h:36, from idna.cpp:24: /usr/include/features.h:214: note: this is the location of the previous definition 214 | # define _XOPEN_SOURCE 700 | i686-pld-linux-gcc -fno-strict-aliasing -O2 -fwrapv -pipe -Wformat -Werror=format-security -gdwarf-4 -fno-debug-types-section -fvar-tracking-assignments -g2 -Wp,-D_FORTIFY_SOURCE=2 -fstack-protector-strong --param=ssp-buffer-size=4 -Werror=trampolines -fomit-frame-pointer -march=i686 -fasynchronous-unwind-tables -mtune=pentium4 -gdwarf-4 -fno-debug-types-section -fvar-tracking-assignments -g2 -DNDEBUG -O2 -fwrapv -pipe -Wformat -Werror=format-security -gdwarf-4 -fno-debug-types-section -fvar-tracking-assignments -g2 -Wp,-D_FORTIFY_SOURCE=2 -fstack-protector-strong --param=ssp-buffer-size=4 -Werror=trampolines -fomit-frame-pointer -march=i686 -fasynchronous-unwind-tables -mtune=pentium4 -gdwarf-4 -fno-debug-types-section -fvar-tracking-assignments -g2 -O2 -fwrapv -pipe -Wformat -Werror=format-security -gdwarf-4 -fno-debug-types-section -fvar-tracking-assignments -g2 -Wp,-D_FORTIFY_SOURCE=2 -fstack-protector-strong --param=ssp-buffer-size=4 -Werror=trampolines -fomit-frame-pointer -march=i686 -fasynchronous-unwind-tables -mtune=pentium4 -gdwarf-4 -fno-debug-types-section -fvar-tracking-assignments -g2 -std=c++11 -fPIC -I/usr/include/python2.7 -c iterators.cpp -o build-2/temp.linux-i686-2.7/iterators.o -std=c++11 -I/usr/include -DPYICU_VER="2.7.4" -DPYICU_ICU_MAX_VER="69" i686-pld-linux-gcc -fno-strict-aliasing -O2 -fwrapv -pipe -Wformat -Werror=format-security -gdwarf-4 -fno-debug-types-section -fvar-tracking-assignments -g2 -Wp,-D_FORTIFY_SOURCE=2 -fstack-protector-strong --param=ssp-buffer-size=4 -Werror=trampolines -fomit-frame-pointer -march=i686 -fasynchronous-unwind-tables -mtune=pentium4 -gdwarf-4 -fno-debug-types-section -fvar-tracking-assignments -g2 -DNDEBUG -O2 -fwrapv -pipe -Wformat -Werror=format-security -gdwarf-4 -fno-debug-types-section -fvar-tracking-assignments -g2 -Wp,-D_FORTIFY_SOURCE=2 -fstack-protector-strong --param=ssp-buffer-size=4 -Werror=trampolines -fomit-frame-pointer -march=i686 -fasynchronous-unwind-tables -mtune=pentium4 -gdwarf-4 -fno-debug-types-section -fvar-tracking-assignments -g2 -O2 -fwrapv -pipe -Wformat -Werror=format-security -gdwarf-4 -fno-debug-types-section -fvar-tracking-assignments -g2 -Wp,-D_FORTIFY_SOURCE=2 -fstack-protector-strong --param=ssp-buffer-size=4 -Werror=trampolines -fomit-frame-pointer -march=i686 -fasynchronous-unwind-tables -mtune=pentium4 -gdwarf-4 -fno-debug-types-section -fvar-tracking-assignments -g2 -std=c++11 -fPIC -I/usr/include/python2.7 -c layoutengine.cpp -o build-2/temp.linux-i686-2.7/layoutengine.o -std=c++11 -I/usr/include -DPYICU_VER="2.7.4" -DPYICU_ICU_MAX_VER="69" i686-pld-linux-gcc -fno-strict-aliasing -O2 -fwrapv -pipe -Wformat -Werror=format-security -gdwarf-4 -fno-debug-types-section -fvar-tracking-assignments -g2 -Wp,-D_FORTIFY_SOURCE=2 -fstack-protector-strong --param=ssp-buffer-size=4 -Werror=trampolines -fomit-frame-pointer -march=i686 -fasynchronous-unwind-tables -mtune=pentium4 -gdwarf-4 -fno-debug-types-section -fvar-tracking-assignments -g2 -DNDEBUG -O2 -fwrapv -pipe -Wformat -Werror=format-security -gdwarf-4 -fno-debug-types-section -fvar-tracking-assignments -g2 -Wp,-D_FORTIFY_SOURCE=2 -fstack-protector-strong --param=ssp-buffer-size=4 -Werror=trampolines -fomit-frame-pointer -march=i686 -fasynchronous-unwind-tables -mtune=pentium4 -gdwarf-4 -fno-debug-types-section -fvar-tracking-assignments -g2 -O2 -fwrapv -pipe -Wformat -Werror=format-security -gdwarf-4 -fno-debug-types-section -fvar-tracking-assignments -g2 -Wp,-D_FORTIFY_SOURCE=2 -fstack-protector-strong --param=ssp-buffer-size=4 -Werror=trampolines -fomit-frame-pointer -march=i686 -fasynchronous-unwind-tables -mtune=pentium4 -gdwarf-4 -fno-debug-types-section -fvar-tracking-assignments -g2 -std=c++11 -fPIC -I/usr/include/python2.7 -c locale.cpp -o build-2/temp.linux-i686-2.7/locale.o -std=c++11 -I/usr/include -DPYICU_VER="2.7.4" -DPYICU_ICU_MAX_VER="69" In file included from /usr/include/python2.7/pyconfig.h:9, from /usr/include/python2.7/Python.h:8, from common.h:44, from locale.cpp:35: /usr/lib/python2.7/config/pyconfig.h:1223: warning: "_POSIX_C_SOURCE" redefined 1223 | #define _POSIX_C_SOURCE 200112L | In file included from /usr/include/c++/11.2.0/i686-pld-linux/bits/os_defines.h:39, from /usr/include/c++/11.2.0/i686-pld-linux/bits/c++config.h:586, from /usr/include/c++/11.2.0/cstdlib:41, from /usr/include/c++/11.2.0/stdlib.h:36, from locale.cpp:24: /usr/include/features.h:290: note: this is the location of the previous definition 290 | # define _POSIX_C_SOURCE 200809L | In file included from /usr/include/python2.7/pyconfig.h:9, from /usr/include/python2.7/Python.h:8, from common.h:44, from locale.cpp:35: /usr/lib/python2.7/config/pyconfig.h:1245: warning: "_XOPEN_SOURCE" redefined 1245 | #define _XOPEN_SOURCE 600 | In file included from /usr/include/c++/11.2.0/i686-pld-linux/bits/os_defines.h:39, from /usr/include/c++/11.2.0/i686-pld-linux/bits/c++config.h:586, from /usr/include/c++/11.2.0/cstdlib:41, from /usr/include/c++/11.2.0/stdlib.h:36, from locale.cpp:24: /usr/include/features.h:214: note: this is the location of the previous definition 214 | # define _XOPEN_SOURCE 700 | i686-pld-linux-gcc -fno-strict-aliasing -O2 -fwrapv -pipe -Wformat -Werror=format-security -gdwarf-4 -fno-debug-types-section -fvar-tracking-assignments -g2 -Wp,-D_FORTIFY_SOURCE=2 -fstack-protector-strong --param=ssp-buffer-size=4 -Werror=trampolines -fomit-frame-pointer -march=i686 -fasynchronous-unwind-tables -mtune=pentium4 -gdwarf-4 -fno-debug-types-section -fvar-tracking-assignments -g2 -DNDEBUG -O2 -fwrapv -pipe -Wformat -Werror=format-security -gdwarf-4 -fno-debug-types-section -fvar-tracking-assignments -g2 -Wp,-D_FORTIFY_SOURCE=2 -fstack-protector-strong --param=ssp-buffer-size=4 -Werror=trampolines -fomit-frame-pointer -march=i686 -fasynchronous-unwind-tables -mtune=pentium4 -gdwarf-4 -fno-debug-types-section -fvar-tracking-assignments -g2 -O2 -fwrapv -pipe -Wformat -Werror=format-security -gdwarf-4 -fno-debug-types-section -fvar-tracking-assignments -g2 -Wp,-D_FORTIFY_SOURCE=2 -fstack-protector-strong --param=ssp-buffer-size=4 -Werror=trampolines -fomit-frame-pointer -march=i686 -fasynchronous-unwind-tables -mtune=pentium4 -gdwarf-4 -fno-debug-types-section -fvar-tracking-assignments -g2 -std=c++11 -fPIC -I/usr/include/python2.7 -c measureunit.cpp -o build-2/temp.linux-i686-2.7/measureunit.o -std=c++11 -I/usr/include -DPYICU_VER="2.7.4" -DPYICU_ICU_MAX_VER="69" i686-pld-linux-gcc -fno-strict-aliasing -O2 -fwrapv -pipe -Wformat -Werror=format-security -gdwarf-4 -fno-debug-types-section -fvar-tracking-assignments -g2 -Wp,-D_FORTIFY_SOURCE=2 -fstack-protector-strong --param=ssp-buffer-size=4 -Werror=trampolines -fomit-frame-pointer -march=i686 -fasynchronous-unwind-tables -mtune=pentium4 -gdwarf-4 -fno-debug-types-section -fvar-tracking-assignments -g2 -DNDEBUG -O2 -fwrapv -pipe -Wformat -Werror=format-security -gdwarf-4 -fno-debug-types-section -fvar-tracking-assignments -g2 -Wp,-D_FORTIFY_SOURCE=2 -fstack-protector-strong --param=ssp-buffer-size=4 -Werror=trampolines -fomit-frame-pointer -march=i686 -fasynchronous-unwind-tables -mtune=pentium4 -gdwarf-4 -fno-debug-types-section -fvar-tracking-assignments -g2 -O2 -fwrapv -pipe -Wformat -Werror=format-security -gdwarf-4 -fno-debug-types-section -fvar-tracking-assignments -g2 -Wp,-D_FORTIFY_SOURCE=2 -fstack-protector-strong --param=ssp-buffer-size=4 -Werror=trampolines -fomit-frame-pointer -march=i686 -fasynchronous-unwind-tables -mtune=pentium4 -gdwarf-4 -fno-debug-types-section -fvar-tracking-assignments -g2 -std=c++11 -fPIC -I/usr/include/python2.7 -c messagepattern.cpp -o build-2/temp.linux-i686-2.7/messagepattern.o -std=c++11 -I/usr/include -DPYICU_VER="2.7.4" -DPYICU_ICU_MAX_VER="69" i686-pld-linux-gcc -fno-strict-aliasing -O2 -fwrapv -pipe -Wformat -Werror=format-security -gdwarf-4 -fno-debug-types-section -fvar-tracking-assignments -g2 -Wp,-D_FORTIFY_SOURCE=2 -fstack-protector-strong --param=ssp-buffer-size=4 -Werror=trampolines -fomit-frame-pointer -march=i686 -fasynchronous-unwind-tables -mtune=pentium4 -gdwarf-4 -fno-debug-types-section -fvar-tracking-assignments -g2 -DNDEBUG -O2 -fwrapv -pipe -Wformat -Werror=format-security -gdwarf-4 -fno-debug-types-section -fvar-tracking-assignments -g2 -Wp,-D_FORTIFY_SOURCE=2 -fstack-protector-strong --param=ssp-buffer-size=4 -Werror=trampolines -fomit-frame-pointer -march=i686 -fasynchronous-unwind-tables -mtune=pentium4 -gdwarf-4 -fno-debug-types-section -fvar-tracking-assignments -g2 -O2 -fwrapv -pipe -Wformat -Werror=format-security -gdwarf-4 -fno-debug-types-section -fvar-tracking-assignments -g2 -Wp,-D_FORTIFY_SOURCE=2 -fstack-protector-strong --param=ssp-buffer-size=4 -Werror=trampolines -fomit-frame-pointer -march=i686 -fasynchronous-unwind-tables -mtune=pentium4 -gdwarf-4 -fno-debug-types-section -fvar-tracking-assignments -g2 -std=c++11 -fPIC -I/usr/include/python2.7 -c normalizer.cpp -o build-2/temp.linux-i686-2.7/normalizer.o -std=c++11 -I/usr/include -DPYICU_VER="2.7.4" -DPYICU_ICU_MAX_VER="69" i686-pld-linux-gcc -fno-strict-aliasing -O2 -fwrapv -pipe -Wformat -Werror=format-security -gdwarf-4 -fno-debug-types-section -fvar-tracking-assignments -g2 -Wp,-D_FORTIFY_SOURCE=2 -fstack-protector-strong --param=ssp-buffer-size=4 -Werror=trampolines -fomit-frame-pointer -march=i686 -fasynchronous-unwind-tables -mtune=pentium4 -gdwarf-4 -fno-debug-types-section -fvar-tracking-assignments -g2 -DNDEBUG -O2 -fwrapv -pipe -Wformat -Werror=format-security -gdwarf-4 -fno-debug-types-section -fvar-tracking-assignments -g2 -Wp,-D_FORTIFY_SOURCE=2 -fstack-protector-strong --param=ssp-buffer-size=4 -Werror=trampolines -fomit-frame-pointer -march=i686 -fasynchronous-unwind-tables -mtune=pentium4 -gdwarf-4 -fno-debug-types-section -fvar-tracking-assignments -g2 -O2 -fwrapv -pipe -Wformat -Werror=format-security -gdwarf-4 -fno-debug-types-section -fvar-tracking-assignments -g2 -Wp,-D_FORTIFY_SOURCE=2 -fstack-protector-strong --param=ssp-buffer-size=4 -Werror=trampolines -fomit-frame-pointer -march=i686 -fasynchronous-unwind-tables -mtune=pentium4 -gdwarf-4 -fno-debug-types-section -fvar-tracking-assignments -g2 -std=c++11 -fPIC -I/usr/include/python2.7 -c numberformat.cpp -o build-2/temp.linux-i686-2.7/numberformat.o -std=c++11 -I/usr/include -DPYICU_VER="2.7.4" -DPYICU_ICU_MAX_VER="69" i686-pld-linux-gcc -fno-strict-aliasing -O2 -fwrapv -pipe -Wformat -Werror=format-security -gdwarf-4 -fno-debug-types-section -fvar-tracking-assignments -g2 -Wp,-D_FORTIFY_SOURCE=2 -fstack-protector-strong --param=ssp-buffer-size=4 -Werror=trampolines -fomit-frame-pointer -march=i686 -fasynchronous-unwind-tables -mtune=pentium4 -gdwarf-4 -fno-debug-types-section -fvar-tracking-assignments -g2 -DNDEBUG -O2 -fwrapv -pipe -Wformat -Werror=format-security -gdwarf-4 -fno-debug-types-section -fvar-tracking-assignments -g2 -Wp,-D_FORTIFY_SOURCE=2 -fstack-protector-strong --param=ssp-buffer-size=4 -Werror=trampolines -fomit-frame-pointer -march=i686 -fasynchronous-unwind-tables -mtune=pentium4 -gdwarf-4 -fno-debug-types-section -fvar-tracking-assignments -g2 -O2 -fwrapv -pipe -Wformat -Werror=format-security -gdwarf-4 -fno-debug-types-section -fvar-tracking-assignments -g2 -Wp,-D_FORTIFY_SOURCE=2 -fstack-protector-strong --param=ssp-buffer-size=4 -Werror=trampolines -fomit-frame-pointer -march=i686 -fasynchronous-unwind-tables -mtune=pentium4 -gdwarf-4 -fno-debug-types-section -fvar-tracking-assignments -g2 -std=c++11 -fPIC -I/usr/include/python2.7 -c regex.cpp -o build-2/temp.linux-i686-2.7/regex.o -std=c++11 -I/usr/include -DPYICU_VER="2.7.4" -DPYICU_ICU_MAX_VER="69" i686-pld-linux-gcc -fno-strict-aliasing -O2 -fwrapv -pipe -Wformat -Werror=format-security -gdwarf-4 -fno-debug-types-section -fvar-tracking-assignments -g2 -Wp,-D_FORTIFY_SOURCE=2 -fstack-protector-strong --param=ssp-buffer-size=4 -Werror=trampolines -fomit-frame-pointer -march=i686 -fasynchronous-unwind-tables -mtune=pentium4 -gdwarf-4 -fno-debug-types-section -fvar-tracking-assignments -g2 -DNDEBUG -O2 -fwrapv -pipe -Wformat -Werror=format-security -gdwarf-4 -fno-debug-types-section -fvar-tracking-assignments -g2 -Wp,-D_FORTIFY_SOURCE=2 -fstack-protector-strong --param=ssp-buffer-size=4 -Werror=trampolines -fomit-frame-pointer -march=i686 -fasynchronous-unwind-tables -mtune=pentium4 -gdwarf-4 -fno-debug-types-section -fvar-tracking-assignments -g2 -O2 -fwrapv -pipe -Wformat -Werror=format-security -gdwarf-4 -fno-debug-types-section -fvar-tracking-assignments -g2 -Wp,-D_FORTIFY_SOURCE=2 -fstack-protector-strong --param=ssp-buffer-size=4 -Werror=trampolines -fomit-frame-pointer -march=i686 -fasynchronous-unwind-tables -mtune=pentium4 -gdwarf-4 -fno-debug-types-section -fvar-tracking-assignments -g2 -std=c++11 -fPIC -I/usr/include/python2.7 -c script.cpp -o build-2/temp.linux-i686-2.7/script.o -std=c++11 -I/usr/include -DPYICU_VER="2.7.4" -DPYICU_ICU_MAX_VER="69" In file included from /usr/include/python2.7/pyconfig.h:9, from /usr/include/python2.7/Python.h:8, from common.h:44, from script.cpp:27: /usr/lib/python2.7/config/pyconfig.h:1223: warning: "_POSIX_C_SOURCE" redefined 1223 | #define _POSIX_C_SOURCE 200112L | In file included from /usr/include/c++/11.2.0/i686-pld-linux/bits/os_defines.h:39, from /usr/include/c++/11.2.0/i686-pld-linux/bits/c++config.h:586, from /usr/include/c++/11.2.0/cstdlib:41, from /usr/include/c++/11.2.0/stdlib.h:36, from script.cpp:24: /usr/include/features.h:290: note: this is the location of the previous definition 290 | # define _POSIX_C_SOURCE 200809L | In file included from /usr/include/python2.7/pyconfig.h:9, from /usr/include/python2.7/Python.h:8, from common.h:44, from script.cpp:27: /usr/lib/python2.7/config/pyconfig.h:1245: warning: "_XOPEN_SOURCE" redefined 1245 | #define _XOPEN_SOURCE 600 | In file included from /usr/include/c++/11.2.0/i686-pld-linux/bits/os_defines.h:39, from /usr/include/c++/11.2.0/i686-pld-linux/bits/c++config.h:586, from /usr/include/c++/11.2.0/cstdlib:41, from /usr/include/c++/11.2.0/stdlib.h:36, from script.cpp:24: /usr/include/features.h:214: note: this is the location of the previous definition 214 | # define _XOPEN_SOURCE 700 | i686-pld-linux-gcc -fno-strict-aliasing -O2 -fwrapv -pipe -Wformat -Werror=format-security -gdwarf-4 -fno-debug-types-section -fvar-tracking-assignments -g2 -Wp,-D_FORTIFY_SOURCE=2 -fstack-protector-strong --param=ssp-buffer-size=4 -Werror=trampolines -fomit-frame-pointer -march=i686 -fasynchronous-unwind-tables -mtune=pentium4 -gdwarf-4 -fno-debug-types-section -fvar-tracking-assignments -g2 -DNDEBUG -O2 -fwrapv -pipe -Wformat -Werror=format-security -gdwarf-4 -fno-debug-types-section -fvar-tracking-assignments -g2 -Wp,-D_FORTIFY_SOURCE=2 -fstack-protector-strong --param=ssp-buffer-size=4 -Werror=trampolines -fomit-frame-pointer -march=i686 -fasynchronous-unwind-tables -mtune=pentium4 -gdwarf-4 -fno-debug-types-section -fvar-tracking-assignments -g2 -O2 -fwrapv -pipe -Wformat -Werror=format-security -gdwarf-4 -fno-debug-types-section -fvar-tracking-assignments -g2 -Wp,-D_FORTIFY_SOURCE=2 -fstack-protector-strong --param=ssp-buffer-size=4 -Werror=trampolines -fomit-frame-pointer -march=i686 -fasynchronous-unwind-tables -mtune=pentium4 -gdwarf-4 -fno-debug-types-section -fvar-tracking-assignments -g2 -std=c++11 -fPIC -I/usr/include/python2.7 -c search.cpp -o build-2/temp.linux-i686-2.7/search.o -std=c++11 -I/usr/include -DPYICU_VER="2.7.4" -DPYICU_ICU_MAX_VER="69" i686-pld-linux-gcc -fno-strict-aliasing -O2 -fwrapv -pipe -Wformat -Werror=format-security -gdwarf-4 -fno-debug-types-section -fvar-tracking-assignments -g2 -Wp,-D_FORTIFY_SOURCE=2 -fstack-protector-strong --param=ssp-buffer-size=4 -Werror=trampolines -fomit-frame-pointer -march=i686 -fasynchronous-unwind-tables -mtune=pentium4 -gdwarf-4 -fno-debug-types-section -fvar-tracking-assignments -g2 -DNDEBUG -O2 -fwrapv -pipe -Wformat -Werror=format-security -gdwarf-4 -fno-debug-types-section -fvar-tracking-assignments -g2 -Wp,-D_FORTIFY_SOURCE=2 -fstack-protector-strong --param=ssp-buffer-size=4 -Werror=trampolines -fomit-frame-pointer -march=i686 -fasynchronous-unwind-tables -mtune=pentium4 -gdwarf-4 -fno-debug-types-section -fvar-tracking-assignments -g2 -O2 -fwrapv -pipe -Wformat -Werror=format-security -gdwarf-4 -fno-debug-types-section -fvar-tracking-assignments -g2 -Wp,-D_FORTIFY_SOURCE=2 -fstack-protector-strong --param=ssp-buffer-size=4 -Werror=trampolines -fomit-frame-pointer -march=i686 -fasynchronous-unwind-tables -mtune=pentium4 -gdwarf-4 -fno-debug-types-section -fvar-tracking-assignments -g2 -std=c++11 -fPIC -I/usr/include/python2.7 -c shape.cpp -o build-2/temp.linux-i686-2.7/shape.o -std=c++11 -I/usr/include -DPYICU_VER="2.7.4" -DPYICU_ICU_MAX_VER="69" In file included from /usr/include/python2.7/pyconfig.h:9, from /usr/include/python2.7/Python.h:8, from common.h:44, from shape.cpp:27: /usr/lib/python2.7/config/pyconfig.h:1223: warning: "_POSIX_C_SOURCE" redefined 1223 | #define _POSIX_C_SOURCE 200112L | In file included from /usr/include/c++/11.2.0/i686-pld-linux/bits/os_defines.h:39, from /usr/include/c++/11.2.0/i686-pld-linux/bits/c++config.h:586, from /usr/include/c++/11.2.0/cstdlib:41, from /usr/include/c++/11.2.0/stdlib.h:36, from shape.cpp:24: /usr/include/features.h:290: note: this is the location of the previous definition 290 | # define _POSIX_C_SOURCE 200809L | In file included from /usr/include/python2.7/pyconfig.h:9, from /usr/include/python2.7/Python.h:8, from common.h:44, from shape.cpp:27: /usr/lib/python2.7/config/pyconfig.h:1245: warning: "_XOPEN_SOURCE" redefined 1245 | #define _XOPEN_SOURCE 600 | In file included from /usr/include/c++/11.2.0/i686-pld-linux/bits/os_defines.h:39, from /usr/include/c++/11.2.0/i686-pld-linux/bits/c++config.h:586, from /usr/include/c++/11.2.0/cstdlib:41, from /usr/include/c++/11.2.0/stdlib.h:36, from shape.cpp:24: /usr/include/features.h:214: note: this is the location of the previous definition 214 | # define _XOPEN_SOURCE 700 | i686-pld-linux-gcc -fno-strict-aliasing -O2 -fwrapv -pipe -Wformat -Werror=format-security -gdwarf-4 -fno-debug-types-section -fvar-tracking-assignments -g2 -Wp,-D_FORTIFY_SOURCE=2 -fstack-protector-strong --param=ssp-buffer-size=4 -Werror=trampolines -fomit-frame-pointer -march=i686 -fasynchronous-unwind-tables -mtune=pentium4 -gdwarf-4 -fno-debug-types-section -fvar-tracking-assignments -g2 -DNDEBUG -O2 -fwrapv -pipe -Wformat -Werror=format-security -gdwarf-4 -fno-debug-types-section -fvar-tracking-assignments -g2 -Wp,-D_FORTIFY_SOURCE=2 -fstack-protector-strong --param=ssp-buffer-size=4 -Werror=trampolines -fomit-frame-pointer -march=i686 -fasynchronous-unwind-tables -mtune=pentium4 -gdwarf-4 -fno-debug-types-section -fvar-tracking-assignments -g2 -O2 -fwrapv -pipe -Wformat -Werror=format-security -gdwarf-4 -fno-debug-types-section -fvar-tracking-assignments -g2 -Wp,-D_FORTIFY_SOURCE=2 -fstack-protector-strong --param=ssp-buffer-size=4 -Werror=trampolines -fomit-frame-pointer -march=i686 -fasynchronous-unwind-tables -mtune=pentium4 -gdwarf-4 -fno-debug-types-section -fvar-tracking-assignments -g2 -std=c++11 -fPIC -I/usr/include/python2.7 -c spoof.cpp -o build-2/temp.linux-i686-2.7/spoof.o -std=c++11 -I/usr/include -DPYICU_VER="2.7.4" -DPYICU_ICU_MAX_VER="69" i686-pld-linux-gcc -fno-strict-aliasing -O2 -fwrapv -pipe -Wformat -Werror=format-security -gdwarf-4 -fno-debug-types-section -fvar-tracking-assignments -g2 -Wp,-D_FORTIFY_SOURCE=2 -fstack-protector-strong --param=ssp-buffer-size=4 -Werror=trampolines -fomit-frame-pointer -march=i686 -fasynchronous-unwind-tables -mtune=pentium4 -gdwarf-4 -fno-debug-types-section -fvar-tracking-assignments -g2 -DNDEBUG -O2 -fwrapv -pipe -Wformat -Werror=format-security -gdwarf-4 -fno-debug-types-section -fvar-tracking-assignments -g2 -Wp,-D_FORTIFY_SOURCE=2 -fstack-protector-strong --param=ssp-buffer-size=4 -Werror=trampolines -fomit-frame-pointer -march=i686 -fasynchronous-unwind-tables -mtune=pentium4 -gdwarf-4 -fno-debug-types-section -fvar-tracking-assignments -g2 -O2 -fwrapv -pipe -Wformat -Werror=format-security -gdwarf-4 -fno-debug-types-section -fvar-tracking-assignments -g2 -Wp,-D_FORTIFY_SOURCE=2 -fstack-protector-strong --param=ssp-buffer-size=4 -Werror=trampolines -fomit-frame-pointer -march=i686 -fasynchronous-unwind-tables -mtune=pentium4 -gdwarf-4 -fno-debug-types-section -fvar-tracking-assignments -g2 -std=c++11 -fPIC -I/usr/include/python2.7 -c timezone.cpp -o build-2/temp.linux-i686-2.7/timezone.o -std=c++11 -I/usr/include -DPYICU_VER="2.7.4" -DPYICU_ICU_MAX_VER="69" i686-pld-linux-gcc -fno-strict-aliasing -O2 -fwrapv -pipe -Wformat -Werror=format-security -gdwarf-4 -fno-debug-types-section -fvar-tracking-assignments -g2 -Wp,-D_FORTIFY_SOURCE=2 -fstack-protector-strong --param=ssp-buffer-size=4 -Werror=trampolines -fomit-frame-pointer -march=i686 -fasynchronous-unwind-tables -mtune=pentium4 -gdwarf-4 -fno-debug-types-section -fvar-tracking-assignments -g2 -DNDEBUG -O2 -fwrapv -pipe -Wformat -Werror=format-security -gdwarf-4 -fno-debug-types-section -fvar-tracking-assignments -g2 -Wp,-D_FORTIFY_SOURCE=2 -fstack-protector-strong --param=ssp-buffer-size=4 -Werror=trampolines -fomit-frame-pointer -march=i686 -fasynchronous-unwind-tables -mtune=pentium4 -gdwarf-4 -fno-debug-types-section -fvar-tracking-assignments -g2 -O2 -fwrapv -pipe -Wformat -Werror=format-security -gdwarf-4 -fno-debug-types-section -fvar-tracking-assignments -g2 -Wp,-D_FORTIFY_SOURCE=2 -fstack-protector-strong --param=ssp-buffer-size=4 -Werror=trampolines -fomit-frame-pointer -march=i686 -fasynchronous-unwind-tables -mtune=pentium4 -gdwarf-4 -fno-debug-types-section -fvar-tracking-assignments -g2 -std=c++11 -fPIC -I/usr/include/python2.7 -c transliterator.cpp -o build-2/temp.linux-i686-2.7/transliterator.o -std=c++11 -I/usr/include -DPYICU_VER="2.7.4" -DPYICU_ICU_MAX_VER="69" i686-pld-linux-gcc -fno-strict-aliasing -O2 -fwrapv -pipe -Wformat -Werror=format-security -gdwarf-4 -fno-debug-types-section -fvar-tracking-assignments -g2 -Wp,-D_FORTIFY_SOURCE=2 -fstack-protector-strong --param=ssp-buffer-size=4 -Werror=trampolines -fomit-frame-pointer -march=i686 -fasynchronous-unwind-tables -mtune=pentium4 -gdwarf-4 -fno-debug-types-section -fvar-tracking-assignments -g2 -DNDEBUG -O2 -fwrapv -pipe -Wformat -Werror=format-security -gdwarf-4 -fno-debug-types-section -fvar-tracking-assignments -g2 -Wp,-D_FORTIFY_SOURCE=2 -fstack-protector-strong --param=ssp-buffer-size=4 -Werror=trampolines -fomit-frame-pointer -march=i686 -fasynchronous-unwind-tables -mtune=pentium4 -gdwarf-4 -fno-debug-types-section -fvar-tracking-assignments -g2 -O2 -fwrapv -pipe -Wformat -Werror=format-security -gdwarf-4 -fno-debug-types-section -fvar-tracking-assignments -g2 -Wp,-D_FORTIFY_SOURCE=2 -fstack-protector-strong --param=ssp-buffer-size=4 -Werror=trampolines -fomit-frame-pointer -march=i686 -fasynchronous-unwind-tables -mtune=pentium4 -gdwarf-4 -fno-debug-types-section -fvar-tracking-assignments -g2 -std=c++11 -fPIC -I/usr/include/python2.7 -c tries.cpp -o build-2/temp.linux-i686-2.7/tries.o -std=c++11 -I/usr/include -DPYICU_VER="2.7.4" -DPYICU_ICU_MAX_VER="69" i686-pld-linux-gcc -fno-strict-aliasing -O2 -fwrapv -pipe -Wformat -Werror=format-security -gdwarf-4 -fno-debug-types-section -fvar-tracking-assignments -g2 -Wp,-D_FORTIFY_SOURCE=2 -fstack-protector-strong --param=ssp-buffer-size=4 -Werror=trampolines -fomit-frame-pointer -march=i686 -fasynchronous-unwind-tables -mtune=pentium4 -gdwarf-4 -fno-debug-types-section -fvar-tracking-assignments -g2 -DNDEBUG -O2 -fwrapv -pipe -Wformat -Werror=format-security -gdwarf-4 -fno-debug-types-section -fvar-tracking-assignments -g2 -Wp,-D_FORTIFY_SOURCE=2 -fstack-protector-strong --param=ssp-buffer-size=4 -Werror=trampolines -fomit-frame-pointer -march=i686 -fasynchronous-unwind-tables -mtune=pentium4 -gdwarf-4 -fno-debug-types-section -fvar-tracking-assignments -g2 -O2 -fwrapv -pipe -Wformat -Werror=format-security -gdwarf-4 -fno-debug-types-section -fvar-tracking-assignments -g2 -Wp,-D_FORTIFY_SOURCE=2 -fstack-protector-strong --param=ssp-buffer-size=4 -Werror=trampolines -fomit-frame-pointer -march=i686 -fasynchronous-unwind-tables -mtune=pentium4 -gdwarf-4 -fno-debug-types-section -fvar-tracking-assignments -g2 -std=c++11 -fPIC -I/usr/include/python2.7 -c tzinfo.cpp -o build-2/temp.linux-i686-2.7/tzinfo.o -std=c++11 -I/usr/include -DPYICU_VER="2.7.4" -DPYICU_ICU_MAX_VER="69" i686-pld-linux-gcc -fno-strict-aliasing -O2 -fwrapv -pipe -Wformat -Werror=format-security -gdwarf-4 -fno-debug-types-section -fvar-tracking-assignments -g2 -Wp,-D_FORTIFY_SOURCE=2 -fstack-protector-strong --param=ssp-buffer-size=4 -Werror=trampolines -fomit-frame-pointer -march=i686 -fasynchronous-unwind-tables -mtune=pentium4 -gdwarf-4 -fno-debug-types-section -fvar-tracking-assignments -g2 -DNDEBUG -O2 -fwrapv -pipe -Wformat -Werror=format-security -gdwarf-4 -fno-debug-types-section -fvar-tracking-assignments -g2 -Wp,-D_FORTIFY_SOURCE=2 -fstack-protector-strong --param=ssp-buffer-size=4 -Werror=trampolines -fomit-frame-pointer -march=i686 -fasynchronous-unwind-tables -mtune=pentium4 -gdwarf-4 -fno-debug-types-section -fvar-tracking-assignments -g2 -O2 -fwrapv -pipe -Wformat -Werror=format-security -gdwarf-4 -fno-debug-types-section -fvar-tracking-assignments -g2 -Wp,-D_FORTIFY_SOURCE=2 -fstack-protector-strong --param=ssp-buffer-size=4 -Werror=trampolines -fomit-frame-pointer -march=i686 -fasynchronous-unwind-tables -mtune=pentium4 -gdwarf-4 -fno-debug-types-section -fvar-tracking-assignments -g2 -std=c++11 -fPIC -I/usr/include/python2.7 -c unicodeset.cpp -o build-2/temp.linux-i686-2.7/unicodeset.o -std=c++11 -I/usr/include -DPYICU_VER="2.7.4" -DPYICU_ICU_MAX_VER="69" i686-pld-linux-g++ -shared -Wl,--as-needed -Wl,--no-copy-dt-needed-entries -Wl,-z,relro -Wl,-z,combreloc -Wl,--as-needed -Wl,--no-copy-dt-needed-entries -Wl,-z,relro -Wl,-z,combreloc -O2 -fwrapv -pipe -Wformat -Werror=format-security -gdwarf-4 -fno-debug-types-section -fvar-tracking-assignments -g2 -Wp,-D_FORTIFY_SOURCE=2 -fstack-protector-strong --param=ssp-buffer-size=4 -Werror=trampolines -fomit-frame-pointer -march=i686 -fasynchronous-unwind-tables -mtune=pentium4 -gdwarf-4 -fno-debug-types-section -fvar-tracking-assignments -g2 -std=c++11 build-2/temp.linux-i686-2.7/_icu.o build-2/temp.linux-i686-2.7/bases.o build-2/temp.linux-i686-2.7/bidi.o build-2/temp.linux-i686-2.7/calendar.o build-2/temp.linux-i686-2.7/casemap.o build-2/temp.linux-i686-2.7/char.o build-2/temp.linux-i686-2.7/charset.o build-2/temp.linux-i686-2.7/collator.o build-2/temp.linux-i686-2.7/common.o build-2/temp.linux-i686-2.7/dateformat.o build-2/temp.linux-i686-2.7/errors.o build-2/temp.linux-i686-2.7/format.o build-2/temp.linux-i686-2.7/gender.o build-2/temp.linux-i686-2.7/idna.o build-2/temp.linux-i686-2.7/iterators.o build-2/temp.linux-i686-2.7/layoutengine.o build-2/temp.linux-i686-2.7/locale.o build-2/temp.linux-i686-2.7/measureunit.o build-2/temp.linux-i686-2.7/messagepattern.o build-2/temp.linux-i686-2.7/normalizer.o build-2/temp.linux-i686-2.7/numberformat.o build-2/temp.linux-i686-2.7/regex.o build-2/temp.linux-i686-2.7/script.o build-2/temp.linux-i686-2.7/search.o build-2/temp.linux-i686-2.7/shape.o build-2/temp.linux-i686-2.7/spoof.o build-2/temp.linux-i686-2.7/timezone.o build-2/temp.linux-i686-2.7/transliterator.o build-2/temp.linux-i686-2.7/tries.o build-2/temp.linux-i686-2.7/tzinfo.o build-2/temp.linux-i686-2.7/unicodeset.o -L/usr/lib -lpython2.7 -o build-2/lib.linux-i686-2.7/_icu.so -L/usr/lib -licui18n -licuuc -licudata + pwd + echo build-2/lib.linux-i686-2.7 + PYTHONPATH=/tmp/B.lj8ly57d/BUILD/PyICU-2.7.4/build-2/lib.linux-i686-2.7 /usr/bin/python2 -m unittest discover -s test LayoutEngine not available in ICU 70.1..................F............................................F......... ====================================================================== FAIL: testGetBestPattern (test_DateTimeParserGenerator.TestDateTimePatternGenerator) Test a few different languages and common patterns. ---------------------------------------------------------------------- Traceback (most recent call last): File "/tmp/B.lj8ly57d/BUILD/PyICU-2.7.4/test/test_DateTimeParserGenerator.py", line 86, in testGetBestPattern self.assertEqual(sdf.format(self.date), locale_data[index]) AssertionError: u'17:30' != u'\u4e0b\u53485:30' - 17:30 + \u4e0b\u53485:30 ====================================================================== FAIL: testTransition (test_TimeZone.TestTimeZone) ---------------------------------------------------------------------- Traceback (most recent call last): File "/tmp/B.lj8ly57d/BUILD/PyICU-2.7.4/test/test_TimeZone.py", line 78, in testTransition datetime.datetime(2021, 11, 14, 2, 0, tzinfo=pytz)) AssertionError: datetime.datetime(2022, 11, 13, 2, 0, tzinfo=<ICUtzinfo: Pacific/Fiji>) != datetime.datetime(2021, 11, 14, 2, 0, tzinfo=<ICUtzinfo: Pacific/Fiji>) ---------------------------------------------------------------------- Ran 73 tests in 0.676s FAILED (failures=2) error: Bad exit status from /tmp/B.lj8ly57d/BUILD/tmp/rpm-tmp.FkJmJW (%build) RPM build errors: Could not canonicalize hostname: nereid Bad exit status from /tmp/B.lj8ly57d/BUILD/tmp/rpm-tmp.FkJmJW (%build) ended at: Fri Jan 14 20:10:01 2022, done in 0:01:09.840372 error: No files produced. + chmod -R u+rwX /tmp/B.lj8ly57d/BUILD + rm -rf /tmp/B.lj8ly57d/tmp /tmp/B.lj8ly57d/BUILD + rm -rf /tmp/B.lj8ly57d Begin-PLD-Builder-Info Build-Time: user:68.02s sys:4.96s real:72.16s (faults io:2 non-io:1159618) End-PLD-Builder-Info
[Back to list of logs] [View rpm -qa of builder]