FailedOk

th/SRPMS[OK]
th/x32[OK]
th/i686[OK]
th/x86_64[OK]

ac/SRPMS[OK]
ac/i386[OK]
ac/i586[OK]
ac/i686[OK]
ac/alpha[OK]
ac/amd64[OK]
ac/athlon[OK]
ac/ppc[OK]
ac/sparc[OK]
ac/sparc64[OK]

Advanced Search
main()
Powered by PLD Linux
(c) 2002-2023 PLD Team
$Revision: 1.37 $
Powered by The Bad Thing.
Your IP: 35.172.230.154

3DLDF 0cb06240-0ae3-4732-9346-6aab22fa53e5

Status:Failed
Source URL:https://buildlogs.pld-linux.org/pld/th/x32/FAIL/3DLDF,0cb06240-0ae3-4732-9346-6aab22fa53e5.bz2
text/plain URL:View!
rpm -qa of builder:View!
Date:2015/12/25 22:55:09
Runtime:0:00:12.783158

Toc:

  • prep
  • Executing(%prep): /bin/sh -e /tmp/B.c2a50e47-e333-4207-9941-d8bbac0e22cf/BUILD/tmp/rpm-tmp.80733
  • build
  • Executing(%build): /bin/sh -e /tmp/B.c2a50e47-e333-4207-9941-d8bbac0e22cf/BUILD/tmp/rpm-tmp.27792
  • error 1
  • ./pspglb.web:5082:48: error: redeclaration of 'template<class C> int Scan_Parse::show_func(C*, std::__cxx11::string, void*)' may not have default arguments [-fpermissive]
  • error 2
  • ./io.web:4940:56: error: redeclaration of 'template<class C> void* Scan_Parse::get_point_func(real, C*, void*)' may not have default arguments [-fpermissive]
  • error 3
  • ./io.web:4945:50: error: redeclaration of 'template<class C> void* Scan_Parse::get_center_func(C*, void*)' may not have default arguments [-fpermissive]
  • error 4
  • ./io.web:4950:75: error: redeclaration of 'template<class C> void* Scan_Parse::get_focus_func(C*, short unsigned int, void*)' may not have default arguments [-fpermissive]
  • error 5
  • ./io.web:4955:76: error: redeclaration of 'template<class C> void* Scan_Parse::get_vertex_func(C*, short unsigned int, void*)' may not have default arguments [-fpermissive]
  • error 6
  • ./io.web:5013:29: error: redeclaration of 'template<class C> std::__cxx11::string* Scan_Parse::sub_binary_number_string_func(C, bool, Scanner_Node)' may not have default arguments [-fpermissive]
  • error 7
  • ./io.web:5038:11: error: redeclaration of 'template<class C> int Scan_Parse::shape_decl_func(Scanner_Node, int, C*)' may not have default arguments [-fpermissive]
  • error 8
  • ./io.web:5167:57: error: redeclaration of 'template<class C> void* Scan_Parse::normal_func(C*, Scanner_Node)' may not have default arguments [-fpermissive]
  • error 9
  • ./io.web:5229:11: error: redeclaration of 'template<class C> int Scan_Parse::vector_type_decl(Scanner_Node, int, int, C*)' may not have default arguments [-fpermissive]
  • error 10
  • ./io.web:5240:23: error: redeclaration of 'template<class C> int Scan_Parse::vector_type_plus_assign(Scanner_Node, Id_Map_Entry_Node, int, int, C*, bool)' may not have default arguments [-fpermissive]
  • error 11
  • ./io.web:5248:11: error: redeclaration of 'template<class C, class D> int Scan_Parse::vector_type_assign(Scanner_Node, Id_Map_Entry_Node, const Pointer_Vector<D>*, C*)' may not have default arguments [-fpermissive]
  • error 12
  • ./io.web:5370:54: error: redeclaration of 'template<class C> int Scan_Parse::reverse_func(void*, void*, C*)' may not have default arguments [-fpermissive]
  • error 13
  • ./io.web:5617:31: error: redeclaration of 'template<class C> void* Scan_Parse::get_conic_section_func(Pointer_Vector<Point>*, int, short unsigned int, C*, void*, bool, bool, real, bool)' may not have default arguments [-fpermissive]
  • error 14
  • ./io.web:5684:7: error: redeclaration of 'template<class C> int Scan_Parse::cull_func(void*, short unsigned int, Scanner_Node, real, C*)' may not have default arguments [-fpermissive]
  • error 15
  • ./io.web:5696:7: error: redeclaration of 'template<class C> int Scan_Parse::rectify_func(void*, Scanner_Node, bool, bool, bool, real, Transform*, C*)' may not have default arguments [-fpermissive]
  • error 16
  • ./io.web:5712:49: error: redeclaration of 'template<class C> void* Scan_Parse::in_cuboid_func(C*, void*)' may not have default arguments [-fpermissive]
  • error 17
  • ./io.web:5717:50: error: redeclaration of 'template<class C> void* Scan_Parse::out_cuboid_func(C*, void*)' may not have default arguments [-fpermissive]
  • error 18
  • ./io.web:6036:51: error: redeclaration of 'template<class C> void* Scan_Parse::is_whatever_func(C*, void*)' may not have default arguments [-fpermissive]
  • error 19
  • ./io.web:6053:7: error: redeclaration of 'template<class C, class D, class E> void* Scan_Parse::intersection_points_func(C*, D*, void*, E*)' may not have default arguments [-fpermissive]
  • error 20
  • ./io.web:6064:69: error: redeclaration of 'template<class C, class D> void* Scan_Parse::ellipse_like_intersection_func(C*, D*, void*)' may not have default arguments [-fpermissive]
  • error 21
  • ./io.web:6069:78: error: redeclaration of 'template<class C> void* Scan_Parse::ellipse_like_plane_intersection_func(C*, void*, void*)' may not have default arguments [-fpermissive]
  • error 22
  • ./io.web:6074:70: error: redeclaration of 'template<class C, class D> void* Scan_Parse::conic_section_intersection_func(C*, D*, void*)' may not have default arguments [-fpermissive]
  • error 23
  • ./io.web:6079:69: error: redeclaration of 'template<class C, class D> void* Scan_Parse::polygon_like_intersection_func(C*, D*, void*)' may not have default arguments [-fpermissive]
  • error 24
  • ./io.web:6087:18: error: redeclaration of 'template<class C> void* Scan_Parse::ellipsoid_like_plane_intersection_func(C*, Plane*, void*)' may not have default arguments [-fpermissive]
  • error 25
  • ./io.web:6103:50: error: redeclaration of 'template<class C> void* Scan_Parse::plane_cast_func(C*, void*)' may not have default arguments [-fpermissive]
  • error 26
  • ./io.web:6108:67: error: redeclaration of 'template<class C> void* Scan_Parse::plane_assignment_func(void*, C*, void*)' may not have default arguments [-fpermissive]
  • error 27
  • ./io.web:6117:60: error: redeclaration of 'template<class C> int Scan_Parse::show_func(C*, std::__cxx11::string, void*)' may not have default arguments [-fpermissive]
  • error 28
  • ./io.web:4940:56: error: redeclaration of 'template<class C> void* Scan_Parse::get_point_func(real, C*, void*)' may not have default arguments [-fpermissive]
  • error 29
  • ./io.web:4945:50: error: redeclaration of 'template<class C> void* Scan_Parse::get_center_func(C*, void*)' may not have default arguments [-fpermissive]
  • error 30
  • ./io.web:4950:75: error: redeclaration of 'template<class C> void* Scan_Parse::get_focus_func(C*, short unsigned int, void*)' may not have default arguments [-fpermissive]
  • error 31
  • ./io.web:4955:76: error: redeclaration of 'template<class C> void* Scan_Parse::get_vertex_func(C*, short unsigned int, void*)' may not have default arguments [-fpermissive]
  • error 32
  • ./io.web:5013:29: error: redeclaration of 'template<class C> std::__cxx11::string* Scan_Parse::sub_binary_number_string_func(C, bool, Scanner_Node)' may not have default arguments [-fpermissive]
  • error 33
  • ./io.web:5038:11: error: redeclaration of 'template<class C> int Scan_Parse::shape_decl_func(Scanner_Node, int, C*)' may not have default arguments [-fpermissive]
  • error 34
  • ./io.web:5167:57: error: redeclaration of 'template<class C> void* Scan_Parse::normal_func(C*, Scanner_Node)' may not have default arguments [-fpermissive]
  • error 35
  • ./io.web:5229:11: error: redeclaration of 'template<class C> int Scan_Parse::vector_type_decl(Scanner_Node, int, int, C*)' may not have default arguments [-fpermissive]
  • error 36
  • ./io.web:5240:23: error: redeclaration of 'template<class C> int Scan_Parse::vector_type_plus_assign(Scanner_Node, Id_Map_Entry_Node, int, int, C*, bool)' may not have default arguments [-fpermissive]
  • error 37
  • ./io.web:5248:11: error: redeclaration of 'template<class C, class D> int Scan_Parse::vector_type_assign(Scanner_Node, Id_Map_Entry_Node, const Pointer_Vector<D>*, C*)' may not have default arguments [-fpermissive]
  • error 38
  • ./io.web:5370:54: error: redeclaration of 'template<class C> int Scan_Parse::reverse_func(void*, void*, C*)' may not have default arguments [-fpermissive]
  • error 39
  • ./io.web:5450:31: error: redeclaration of 'template<class C> void* standardize_func(C*, void*)' may not have default arguments [-fpermissive]
  • error 40
  • ./io.web:5617:31: error: redeclaration of 'template<class C> void* Scan_Parse::get_conic_section_func(Pointer_Vector<Point>*, int, short unsigned int, C*, void*, bool, bool, real, bool)' may not have default arguments [-fpermissive]
  • error 41
  • ./io.web:5684:7: error: redeclaration of 'template<class C> int Scan_Parse::cull_func(void*, short unsigned int, Scanner_Node, real, C*)' may not have default arguments [-fpermissive]
  • error 42
  • ./io.web:5696:7: error: redeclaration of 'template<class C> int Scan_Parse::rectify_func(void*, Scanner_Node, bool, bool, bool, real, Transform*, C*)' may not have default arguments [-fpermissive]
  • error 43
  • ./io.web:5712:49: error: redeclaration of 'template<class C> void* Scan_Parse::in_cuboid_func(C*, void*)' may not have default arguments [-fpermissive]
  • error 44
  • ./io.web:5717:50: error: redeclaration of 'template<class C> void* Scan_Parse::out_cuboid_func(C*, void*)' may not have default arguments [-fpermissive]
  • error 45
  • ./io.web:6036:51: error: redeclaration of 'template<class C> void* Scan_Parse::is_whatever_func(C*, void*)' may not have default arguments [-fpermissive]
  • error 46
  • ./io.web:6053:7: error: redeclaration of 'template<class C, class D, class E> void* Scan_Parse::intersection_points_func(C*, D*, void*, E*)' may not have default arguments [-fpermissive]
  • error 47
  • ./io.web:6064:69: error: redeclaration of 'template<class C, class D> void* Scan_Parse::ellipse_like_intersection_func(C*, D*, void*)' may not have default arguments [-fpermissive]
  • error 48
  • ./io.web:6069:78: error: redeclaration of 'template<class C> void* Scan_Parse::ellipse_like_plane_intersection_func(C*, void*, void*)' may not have default arguments [-fpermissive]
  • error 49
  • ./io.web:6074:70: error: redeclaration of 'template<class C, class D> void* Scan_Parse::conic_section_intersection_func(C*, D*, void*)' may not have default arguments [-fpermissive]
  • error 50
  • ./io.web:6079:69: error: redeclaration of 'template<class C, class D> void* Scan_Parse::polygon_like_intersection_func(C*, D*, void*)' may not have default arguments [-fpermissive]
  • error 51
  • ./io.web:6087:18: error: redeclaration of 'template<class C> void* Scan_Parse::ellipsoid_like_plane_intersection_func(C*, Plane*, void*)' may not have default arguments [-fpermissive]
  • error 52
  • ./io.web:6103:50: error: redeclaration of 'template<class C> void* Scan_Parse::plane_cast_func(C*, void*)' may not have default arguments [-fpermissive]
  • error 53
  • ./io.web:6108:67: error: redeclaration of 'template<class C> void* Scan_Parse::plane_assignment_func(void*, C*, void*)' may not have default arguments [-fpermissive]
  • error 54
  • ./io.web:6117:60: error: redeclaration of 'template<class C> int Scan_Parse::show_func(C*, std::__cxx11::string, void*)' may not have default arguments [-fpermissive]
  • error 55
  • ./io.web:4940:56: error: redeclaration of 'template<class C> void* Scan_Parse::get_point_func(real, C*, void*)' may not have default arguments [-fpermissive]
  • error 56
  • ./io.web:4945:50: error: redeclaration of 'template<class C> void* Scan_Parse::get_center_func(C*, void*)' may not have default arguments [-fpermissive]
  • error 57
  • ./io.web:4950:75: error: redeclaration of 'template<class C> void* Scan_Parse::get_focus_func(C*, short unsigned int, void*)' may not have default arguments [-fpermissive]
  • error 58
  • ./io.web:4955:76: error: redeclaration of 'template<class C> void* Scan_Parse::get_vertex_func(C*, short unsigned int, void*)' may not have default arguments [-fpermissive]
  • error 59
  • ./io.web:5013:29: error: redeclaration of 'template<class C> std::__cxx11::string* Scan_Parse::sub_binary_number_string_func(C, bool, Scanner_Node)' may not have default arguments [-fpermissive]
  • error 60
  • ./io.web:5038:11: error: redeclaration of 'template<class C> int Scan_Parse::shape_decl_func(Scanner_Node, int, C*)' may not have default arguments [-fpermissive]
  • error 61
  • ./io.web:5167:57: error: redeclaration of 'template<class C> void* Scan_Parse::normal_func(C*, Scanner_Node)' may not have default arguments [-fpermissive]
  • error 62
  • ./io.web:5229:11: error: redeclaration of 'template<class C> int Scan_Parse::vector_type_decl(Scanner_Node, int, int, C*)' may not have default arguments [-fpermissive]
  • error 63
  • ./io.web:5240:23: error: redeclaration of 'template<class C> int Scan_Parse::vector_type_plus_assign(Scanner_Node, Id_Map_Entry_Node, int, int, C*, bool)' may not have default arguments [-fpermissive]
  • error 64
  • ./io.web:5248:11: error: redeclaration of 'template<class C, class D> int Scan_Parse::vector_type_assign(Scanner_Node, Id_Map_Entry_Node, const Pointer_Vector<D>*, C*)' may not have default arguments [-fpermissive]
  • error 65
  • ./io.web:5370:54: error: redeclaration of 'template<class C> int Scan_Parse::reverse_func(void*, void*, C*)' may not have default arguments [-fpermissive]
  • error 66
  • ./io.web:5450:31: error: redeclaration of 'template<class C> void* standardize_func(C*, void*)' may not have default arguments [-fpermissive]
  • error 67
  • ./io.web:5617:31: error: redeclaration of 'template<class C> void* Scan_Parse::get_conic_section_func(Pointer_Vector<Point>*, int, short unsigned int, C*, void*, bool, bool, real, bool)' may not have default arguments [-fpermissive]
  • error 68
  • ./io.web:5684:7: error: redeclaration of 'template<class C> int Scan_Parse::cull_func(void*, short unsigned int, Scanner_Node, real, C*)' may not have default arguments [-fpermissive]
  • error 69
  • ./io.web:5696:7: error: redeclaration of 'template<class C> int Scan_Parse::rectify_func(void*, Scanner_Node, bool, bool, bool, real, Transform*, C*)' may not have default arguments [-fpermissive]
  • error 70
  • ./io.web:5712:49: error: redeclaration of 'template<class C> void* Scan_Parse::in_cuboid_func(C*, void*)' may not have default arguments [-fpermissive]
  • error 71
  • ./io.web:5717:50: error: redeclaration of 'template<class C> void* Scan_Parse::out_cuboid_func(C*, void*)' may not have default arguments [-fpermissive]
  • error 72
  • ./io.web:6036:51: error: redeclaration of 'template<class C> void* Scan_Parse::is_whatever_func(C*, void*)' may not have default arguments [-fpermissive]
  • error 73
  • ./io.web:6053:7: error: redeclaration of 'template<class C, class D, class E> void* Scan_Parse::intersection_points_func(C*, D*, void*, E*)' may not have default arguments [-fpermissive]
  • error 74
  • ./io.web:6064:69: error: redeclaration of 'template<class C, class D> void* Scan_Parse::ellipse_like_intersection_func(C*, D*, void*)' may not have default arguments [-fpermissive]
  • error 75
  • ./io.web:6069:78: error: redeclaration of 'template<class C> void* Scan_Parse::ellipse_like_plane_intersection_func(C*, void*, void*)' may not have default arguments [-fpermissive]
  • error 76
  • ./io.web:6074:70: error: redeclaration of 'template<class C, class D> void* Scan_Parse::conic_section_intersection_func(C*, D*, void*)' may not have default arguments [-fpermissive]
  • error 77
  • ./io.web:6079:69: error: redeclaration of 'template<class C, class D> void* Scan_Parse::polygon_like_intersection_func(C*, D*, void*)' may not have default arguments [-fpermissive]
  • error 78
  • ./io.web:6087:18: error: redeclaration of 'template<class C> void* Scan_Parse::ellipsoid_like_plane_intersection_func(C*, Plane*, void*)' may not have default arguments [-fpermissive]
  • error 79
  • ./io.web:6103:50: error: redeclaration of 'template<class C> void* Scan_Parse::plane_cast_func(C*, void*)' may not have default arguments [-fpermissive]
  • error 80
  • ./io.web:6108:67: error: redeclaration of 'template<class C> void* Scan_Parse::plane_assignment_func(void*, C*, void*)' may not have default arguments [-fpermissive]
  • error 81
  • ./io.web:6117:60: error: redeclaration of 'template<class C> int Scan_Parse::show_func(C*, std::__cxx11::string, void*)' may not have default arguments [-fpermissive]
  • error 82
  • Makefile:693: recipe for target 'arc.lo' failed
  • error 83
  • make[2]: *** [arc.lo] Error 1
  • error 84
  • Makefile:451: recipe for target 'all-recursive' failed
  • error 85
  • make[1]: *** [all-recursive] Error 1
  • error 86
  • Makefile:382: recipe for target 'all' failed
  • error 87
  • error: Bad exit status from /tmp/B.c2a50e47-e333-4207-9941-d8bbac0e22cf/BUILD/tmp/rpm-tmp.27792 (%build)
  • error 88
  • RPM build errors:
  • error 89
  • error: No files produced.

Content:

request from: baggins
checking if we should skip the build
started at: Fri Dec 25 22:54:52 2015
fetching https://srcbuilder.pld-linux.org/th//srpms/0cb06240-0ae3-4732-9346-6aab22fa53e5/3DLDF-2.0.3-4.src.rpm
fetched 6944014 bytes, 4601.1 K/s
installing srpm: 3DLDF-2.0.3-4.src.rpm
+ install -d /tmp/B.c2a50e47-e333-4207-9941-d8bbac0e22cf/BUILD /tmp/B.c2a50e47-e333-4207-9941-d8bbac0e22cf/RPMS
+ LC_ALL=en_US.UTF-8
+ rpm -qp --changelog 3DLDF-2.0.3-4.src.rpm
* Fri Dec 25 2015 PLD Linux Team <feedback@pld-linux.org>
- For complete changelog see: http://git.pld-linux.org/?p=packages/3DLDF.git;a=log;h=master
* Fri Dec 25 2015 Jan Rękorajski <baggins@pld-linux.org> 7ec603f
- release 4 (by relup.sh) * Thu Dec 24 2015 Jan Rękorajski <baggins@pld-linux.org> 4aa6112
- release 3 (by relup.sh) + rpm -Uhv --nodeps --define '_topdir /tmp/B.c2a50e47-e333-4207-9941-d8bbac0e22cf' --define '_specdir %{_topdir}' --define '_sourcedir %{_specdir}' --define '_rpmdir %{_topdir}/RPMS' --define '_builddir %{_topdir}/BUILD' 3DLDF-2.0.3-4.src.rpm Preparing... ################################################## 3DLDF ################################################## + rm -f 3DLDF-2.0.3-4.src.rpm + install -m 700 -d /tmp/B.c2a50e47-e333-4207-9941-d8bbac0e22cf/BUILD/tmp + TMPDIR=/tmp/B.c2a50e47-e333-4207-9941-d8bbac0e22cf/BUILD/tmp + exec nice -n 0 rpmbuild -bp --short-circuit --nodeps --define '_topdir /tmp/B.c2a50e47-e333-4207-9941-d8bbac0e22cf' --define '_specdir %{_topdir}' --define '_sourcedir %{_specdir}' --define '_rpmdir %{_topdir}/RPMS' --define '_builddir %{_topdir}/BUILD' --target x32-pld-linux --define 'prep exit 0' /tmp/B.c2a50e47-e333-4207-9941-d8bbac0e22cf/3DLDF.spec Building target platforms: x32-pld-linux checking BuildConflict-ing packages no BuildConflicts found checking BR rpm: Building target platforms: x32-pld-linux no BR needed building RPM using: set -ex; : build-id: 0cb06240-0ae3-4732-9346-6aab22fa53e5; TMPDIR=/tmp/B.c2a50e47-e333-4207-9941-d8bbac0e22cf/BUILD/tmp exec nice -n 0 rpmbuild -bb --define '_smp_mflags -j9' --define '_make_opts -Otarget' --define '_pld_builder 1' --define '_topdir /tmp/B.c2a50e47-e333-4207-9941-d8bbac0e22cf' --define '_specdir %{_topdir}' --define '_sourcedir %{_specdir}' --define '_rpmdir %{_topdir}/RPMS' --define '_builddir %{_topdir}/BUILD' --target x32-pld-linux /tmp/B.c2a50e47-e333-4207-9941-d8bbac0e22cf/3DLDF.spec + : build-id: 0cb06240-0ae3-4732-9346-6aab22fa53e5 + TMPDIR=/tmp/B.c2a50e47-e333-4207-9941-d8bbac0e22cf/BUILD/tmp + exec nice -n 0 rpmbuild -bb --define '_smp_mflags -j9' --define '_make_opts -Otarget' --define '_pld_builder 1' --define '_topdir /tmp/B.c2a50e47-e333-4207-9941-d8bbac0e22cf' --define '_specdir %{_topdir}' --define '_sourcedir %{_specdir}' --define '_rpmdir %{_topdir}/RPMS' --define '_builddir %{_topdir}/BUILD' --target x32-pld-linux /tmp/B.c2a50e47-e333-4207-9941-d8bbac0e22cf/3DLDF.spec Building target platforms: x32-pld-linux Executing(%prep): /bin/sh -e /tmp/B.c2a50e47-e333-4207-9941-d8bbac0e22cf/BUILD/tmp/rpm-tmp.80733 + umask 022 + cd /tmp/B.c2a50e47-e333-4207-9941-d8bbac0e22cf/BUILD + cd /tmp/B.c2a50e47-e333-4207-9941-d8bbac0e22cf/BUILD + rm -rf 3DLDF-2.0.3 + /usr/bin/gzip -dc /tmp/B.c2a50e47-e333-4207-9941-d8bbac0e22cf/3DLDF-2.0.3.tar.gz + /bin/tar -xf - + STATUS=0 + '[' 0 -ne 0 ']' + cd 3DLDF-2.0.3 + /bin/id -u + '[' 1000 '=' 0 ']' + /bin/id -u + '[' 1000 '=' 0 ']' + /bin/chmod -Rf a+rX,u+w,g-w,o-w . + echo 'Patch #0 (3DLDF-info.patch):' Patch #0 (3DLDF-info.patch): + '[' -f /tmp/B.c2a50e47-e333-4207-9941-d8bbac0e22cf/3DLDF-info.patch ']' + /bin/cat /tmp/B.c2a50e47-e333-4207-9941-d8bbac0e22cf/3DLDF-info.patch + /usr/bin/patch -s -p1 + exit 0 Executing(%build): /bin/sh -e /tmp/B.c2a50e47-e333-4207-9941-d8bbac0e22cf/BUILD/tmp/rpm-tmp.27792 HOME=/home/users/builder PATH=/home/users/builder/GNUstep/Tools:/usr/local/bin:/usr/bin:/bin TMPDIR=/tmp/B.c2a50e47-e333-4207-9941-d8bbac0e22cf/BUILD/tmp + umask 022 + cd /tmp/B.c2a50e47-e333-4207-9941-d8bbac0e22cf/BUILD + cd 3DLDF-2.0.3 + ./configure 'LDFLAGS=-Wl,--as-needed -Wl,--no-copy-dt-needed-entries -Wl,-z,relro -Wl,-z,combreloc ' 'CFLAGS=-O2 -fwrapv -pipe -Wformat -Werror=format-security -gdwarf-4 -fno-debug-types-section -fvar-tracking-assignments -g2 -Wp,-D_FORTIFY_SOURCE=2 -fstack-protector-strong --param=ssp-buffer-size=4 -fPIC -mtune=generic -march=x86-64 -gdwarf-4 -fno-debug-types-section -fvar-tracking-assignments -g2 ' 'CXXFLAGS=-O2 -fwrapv -pipe -Wformat -Werror=format-security -gdwarf-4 -fno-debug-types-section -fvar-tracking-assignments -g2 -Wp,-D_FORTIFY_SOURCE=2 -fstack-protector-strong --param=ssp-buffer-size=4 -fPIC -mtune=generic -march=x86-64 -gdwarf-4 -fno-debug-types-section -fvar-tracking-assignments -g2 ' 'FFLAGS=-O2 -fwrapv -pipe -Wformat -Werror=format-security -gdwarf-4 -fno-debug-types-section -fvar-tracking-assignments -g2 -Wp,-D_FORTIFY_SOURCE=2 -fstack-protector-strong --param=ssp-buffer-size=4 -fPIC -mtune=generic -march=x86-64 -gdwarf-4 -fno-debug-types-section -fvar-tracking-assignments -g2 ' 'FCFLAGS=-O2 -fwrapv -pipe -Wformat -Werror=format-security -gdwarf-4 -fno-debug-types-section -fvar-tracking-assignments -g2 -Wp,-D_FORTIFY_SOURCE=2 -fstack-protector-strong --param=ssp-buffer-size=4 -fPIC -mtune=generic -march=x86-64 -gdwarf-4 -fno-debug-types-section -fvar-tracking-assignments -g2 ' 'CPPFLAGS=' 'CC=x86_64-pld-linux-gnux32-gcc' 'CXX=x86_64-pld-linux-gnux32-g++' '--host=x86_64-pld-linux-gnux32' '--build=x86_64-pld-linux-gnux32' '--prefix=/usr' '--exec-prefix=/usr' '--bindir=/usr/bin' '--sbindir=/usr/sbin' '--sysconfdir=/etc' '--datadir=/usr/share' '--includedir=/usr/include' '--libdir=/usr/libx32' '--libexecdir=/usr/libx32' '--localstatedir=/var' '--sharedstatedir=/var/lib' '--mandir=/usr/share/man' '--infodir=/usr/share/info' '--x-libraries=/usr/libx32' --disable-shared checking for a BSD-compatible install... /usr/bin/install -c checking whether build environment is sane... yes /tmp/B.c2a50e47-e333-4207-9941-d8bbac0e22cf/BUILD/3DLDF-2.0.3/missing: Unknown `--is-lightweight' option Try `/tmp/B.c2a50e47-e333-4207-9941-d8bbac0e22cf/BUILD/3DLDF-2.0.3/missing --help' for more information configure: WARNING: 'missing' script is too old or missing checking for a thread-safe mkdir -p... /bin/mkdir -p checking for gawk... gawk checking whether make sets $(MAKE)... yes checking whether make supports nested variables... yes checking build system type... x86_64-pld-linux-gnux32 checking host system type... x86_64-pld-linux-gnux32 checking how to print strings... print -r checking for style of include used by make... GNU checking for x86_64-pld-linux-gnux32-gcc... x86_64-pld-linux-gnux32-gcc checking whether the C compiler works... yes checking for C compiler default output file name... a.out checking for suffix of executables... checking whether we are cross compiling... no checking for suffix of object files... o checking whether we are using the GNU C compiler... yes checking whether x86_64-pld-linux-gnux32-gcc accepts -g... yes checking for x86_64-pld-linux-gnux32-gcc option to accept ISO C89... none needed checking whether x86_64-pld-linux-gnux32-gcc understands -c and -o together... yes checking dependency style of x86_64-pld-linux-gnux32-gcc... gcc3 checking for a sed that does not truncate output... /bin/sed checking for grep that handles long lines and -e... /bin/grep checking for egrep... /bin/grep -E checking for fgrep... /bin/grep -F checking for ld used by x86_64-pld-linux-gnux32-gcc... /usr/bin/ld checking if the linker (/usr/bin/ld) is GNU ld... yes checking for BSD- or MS-compatible name lister (nm)... /usr/bin/nm -B checking the name lister (/usr/bin/nm -B) interface... BSD nm checking whether ln -s works... yes checking the maximum length of command line arguments... 1572864 checking whether the shell understands some XSI constructs... yes checking whether the shell understands "+="... yes checking how to convert x86_64-pld-linux-gnux32 file names to x86_64-pld-linux-gnux32 format... func_convert_file_noop checking how to convert x86_64-pld-linux-gnux32 file names to toolchain format... func_convert_file_noop checking for /usr/bin/ld option to reload object files... -r checking for x86_64-pld-linux-gnux32-objdump... no checking for objdump... objdump checking how to recognize dependent libraries... pass_all checking for x86_64-pld-linux-gnux32-dlltool... no checking for dlltool... no checking how to associate runtime and link libraries... print -r -- checking for x86_64-pld-linux-gnux32-ar... no checking for ar... ar checking for archiver @FILE support... @ checking for x86_64-pld-linux-gnux32-strip... no checking for strip... strip checking for x86_64-pld-linux-gnux32-ranlib... no checking for ranlib... ranlib checking command to parse /usr/bin/nm -B output from x86_64-pld-linux-gnux32-gcc object... ok checking for sysroot... no checking for x86_64-pld-linux-gnux32-mt... no checking for mt... no checking if : is a manifest tool... no checking how to run the C preprocessor... x86_64-pld-linux-gnux32-gcc -E checking for ANSI C header files... yes checking for sys/types.h... yes checking for sys/stat.h... yes checking for stdlib.h... yes checking for string.h... yes checking for memory.h... yes checking for strings.h... yes checking for inttypes.h... yes checking for stdint.h... yes checking for unistd.h... yes checking for dlfcn.h... yes checking for objdir... .libs checking if x86_64-pld-linux-gnux32-gcc supports -fno-rtti -fno-exceptions... no checking for x86_64-pld-linux-gnux32-gcc option to produce PIC... -fPIC -DPIC checking if x86_64-pld-linux-gnux32-gcc PIC flag -fPIC -DPIC works... yes checking if x86_64-pld-linux-gnux32-gcc static flag -static works... yes checking if x86_64-pld-linux-gnux32-gcc supports -c -o file.o... yes checking if x86_64-pld-linux-gnux32-gcc supports -c -o file.o... (cached) yes checking whether the x86_64-pld-linux-gnux32-gcc linker (/usr/bin/ld -m elf_i386) supports shared libraries... yes checking dynamic linker characteristics... GNU/Linux ld.so checking how to hardcode library paths into programs... immediate checking whether stripping libraries is possible... yes checking if libtool supports shared libraries... yes checking whether to build shared libraries... no checking whether to build static libraries... yes checking whether we are using the GNU C++ compiler... yes checking whether x86_64-pld-linux-gnux32-g++ accepts -g... yes checking dependency style of x86_64-pld-linux-gnux32-g++... gcc3 checking how to run the C++ preprocessor... x86_64-pld-linux-gnux32-g++ -E checking for ld used by x86_64-pld-linux-gnux32-g++... /usr/bin/ld -m elf_i386 checking if the linker (/usr/bin/ld -m elf_i386) is GNU ld... yes checking whether the x86_64-pld-linux-gnux32-g++ linker (/usr/bin/ld -m elf_i386) supports shared libraries... yes checking for x86_64-pld-linux-gnux32-g++ option to produce PIC... -fPIC -DPIC checking if x86_64-pld-linux-gnux32-g++ PIC flag -fPIC -DPIC works... yes checking if x86_64-pld-linux-gnux32-g++ static flag -static works... yes checking if x86_64-pld-linux-gnux32-g++ supports -c -o file.o... yes checking if x86_64-pld-linux-gnux32-g++ supports -c -o file.o... (cached) yes checking whether the x86_64-pld-linux-gnux32-g++ linker (/usr/bin/ld -m elf_i386) supports shared libraries... yes checking dynamic linker characteristics... (cached) GNU/Linux ld.so checking how to hardcode library paths into programs... immediate checking for x86_64-pld-linux-gnux32-gcc... (cached) x86_64-pld-linux-gnux32-gcc checking whether we are using the GNU C compiler... (cached) yes checking whether x86_64-pld-linux-gnux32-gcc accepts -g... (cached) yes checking for x86_64-pld-linux-gnux32-gcc option to accept ISO C89... (cached) none needed checking whether x86_64-pld-linux-gnux32-gcc understands -c and -o together... (cached) yes checking dependency style of x86_64-pld-linux-gnux32-gcc... (cached) gcc3 checking whether make sets $(MAKE)... (cached) yes checking for bison... bison -y checking for flex... flex checking lex output file root... lex.yy checking lex library... -lfl checking whether yytext is a pointer... yes checking for sha224sum... 1 checking for sha1sum... 1 checking for md5sum... 1 checking for cksum... 1 checking for gzip... 1 checking for gsl_matrix_alloc in -lgsl... yes checking for ANSI C header files... (cached) yes checking errno.h usability... yes checking errno.h presence... yes checking for errno.h... yes checking float.h usability... yes checking float.h presence... yes checking for float.h... yes checking limits.h usability... yes checking limits.h presence... yes checking for limits.h... yes checking for stdlib.h... (cached) yes checking for unistd.h... (cached) yes checking pthread.h usability... yes checking pthread.h presence... yes checking for pthread.h... yes checking gsl/gsl_complex.h usability... yes checking gsl/gsl_complex.h presence... yes checking for gsl/gsl_complex.h... yes checking gsl/gsl_complex_math.h usability... yes checking gsl/gsl_complex_math.h presence... yes checking for gsl/gsl_complex_math.h... yes checking gsl/gsl_matrix.h usability... yes checking gsl/gsl_matrix.h presence... yes checking for gsl/gsl_matrix.h... yes checking for unsigned long long... yes checking for unsigned long... yes checking for unsigned int... yes checking for library containing trunc... -lm checking for floor... yes checking for sqrt... yes checking for trunc... yes checking whether byte ordering is bigendian... no Enabling conditional compilation of debugging output checking that generated files are newer than configure... done configure: creating ./config.status config.status: creating Makefile config.status: creating src/Makefile config.status: creating doc/Makefile config.status: creating doc/old_doc/Makefile config.status: creating examples/Makefile config.status: creating config.h config.status: executing depfiles commands config.status: executing libtool commands + /usr/bin/make -Otarget -j9 -j1 Makefile:881: warning: overriding recipe for target 'info-recursive' Makefile:451: warning: ignoring old recipe for target 'info-recursive' /usr/bin/make all-recursive make[1]: Entering directory '/tmp/B.c2a50e47-e333-4207-9941-d8bbac0e22cf/BUILD/3DLDF-2.0.3' Makefile:881: warning: overriding recipe for target 'info-recursive' Makefile:451: warning: ignoring old recipe for target 'info-recursive' make[1]: Leaving directory '/tmp/B.c2a50e47-e333-4207-9941-d8bbac0e22cf/BUILD/3DLDF-2.0.3' Making all in src make[2]: Entering directory '/tmp/B.c2a50e47-e333-4207-9941-d8bbac0e22cf/BUILD/3DLDF-2.0.3/src' ctangle arc.web This is CTANGLE, Version 3.64 (Web2C 7.5.7) *1*3*4*5*6*8*10*12*13*14*15*16*18*19*20*21*22*24*25*27*29*31*33*34*36*38*39*41*43*44*46*48*50*52*53*54*55*56*58*60*62 Writing the output files: (arc.c).....500. (arc.h).. Done. (No errors were found.) arc.c++ does not exist arc.h++ does not exist make[2]: Leaving directory '/tmp/B.c2a50e47-e333-4207-9941-d8bbac0e22cf/BUILD/3DLDF-2.0.3/src' make[2]: Entering directory '/tmp/B.c2a50e47-e333-4207-9941-d8bbac0e22cf/BUILD/3DLDF-2.0.3/src' ctangle circles.web This is CTANGLE, Version 3.64 (Web2C 7.5.7) *1*3*4*5*7*8*10*12*13*14*15*16*17*19*21*23*24*25*27*29*31*41*42*43*44*45*51*53*58*59*61*62*64*66*83*85*86*87*88*89*90 Writing the output files: (circles.c).....500.....1000.....1500. (circles.h).. Done. (No errors were found.) circles.c++ does not exist circles.h++ does not exist make[2]: Leaving directory '/tmp/B.c2a50e47-e333-4207-9941-d8bbac0e22cf/BUILD/3DLDF-2.0.3/src' make[2]: Entering directory '/tmp/B.c2a50e47-e333-4207-9941-d8bbac0e22cf/BUILD/3DLDF-2.0.3/src' ctangle cncsctlt.web This is CTANGLE, Version 3.64 (Web2C 7.5.7) *1*3*4*6*7*9*11*12*13*14*15*17*20*21*22*23*24*25*26*27*28*38*39*41*43*44*45*48*50*54*55*57*60*64*66*67*73*78*79*81*83*85*87*88*104*106*110*111*112*113*114*116*117*118*119*121*123*125 Writing the output files: (cncsctlt.c).....500.....1000.....1500.....2000.....2500.....3000... (cncsctlt.h)... Done. (No errors were found.) cncsctlt.c++ does not exist cncsctlt.h++ does not exist make[2]: Leaving directory '/tmp/B.c2a50e47-e333-4207-9941-d8bbac0e22cf/BUILD/3DLDF-2.0.3/src' make[2]: Entering directory '/tmp/B.c2a50e47-e333-4207-9941-d8bbac0e22cf/BUILD/3DLDF-2.0.3/src' ctangle colors.web This is CTANGLE, Version 3.64 (Web2C 7.5.7) *1*3*4*5*6*8*10*11*13*15*16*17*18*19*21*23*25*28*30*32*34*35*37*39*41*43*45*46*47*48*49*50*52*54*55*56*57*58 Writing the output files: (colors.c).....500... (colors.h).. Done. (No errors were found.) colors.c++ does not exist colors.h++ does not exist make[2]: Leaving directory '/tmp/B.c2a50e47-e333-4207-9941-d8bbac0e22cf/BUILD/3DLDF-2.0.3/src' make[2]: Entering directory '/tmp/B.c2a50e47-e333-4207-9941-d8bbac0e22cf/BUILD/3DLDF-2.0.3/src' ctangle complex.web This is CTANGLE, Version 3.64 (Web2C 7.5.7) *1*3*4*6*8*9*10*12*14*16*18*19*20*21*22*24*25*26*28*29*31*32*34*35*37*38*40*42*44*45*47*48*49*50*52*54*56*58 Writing the output files: (complex.c).....500.... (complex.h). Done. (No errors were found.) complex.c++ does not exist complex.h++ does not exist make[2]: Leaving directory '/tmp/B.c2a50e47-e333-4207-9941-d8bbac0e22cf/BUILD/3DLDF-2.0.3/src' make[2]: Entering directory '/tmp/B.c2a50e47-e333-4207-9941-d8bbac0e22cf/BUILD/3DLDF-2.0.3/src' ctangle cones.web This is CTANGLE, Version 3.64 (Web2C 7.5.7) *1*3*4*5*6*8*18*20*21*22*23*24*26*27*28*30*32*33*34*36*37*39*41*43*45*46*48*50*51*53*55*56*58*60*62*63*64*65*66*68*70*72 Writing the output files: (cones.c).....500.....1000.. (cones.h).. Done. (No errors were found.) cones.c++ does not exist cones.h++ does not exist make[2]: Leaving directory '/tmp/B.c2a50e47-e333-4207-9941-d8bbac0e22cf/BUILD/3DLDF-2.0.3/src' make[2]: Entering directory '/tmp/B.c2a50e47-e333-4207-9941-d8bbac0e22cf/BUILD/3DLDF-2.0.3/src' ctangle conicsct.web This is CTANGLE, Version 3.64 (Web2C 7.5.7) *1*3*4*5*7*8*10*11*12*21*26*27*41*43*44*46*47*48*49*51*53*54*55*56*58*62*64*65*67*69 Writing the output files: (conicsct.c).....500.....1000.... (conicsct.h).. Done. (No errors were found.) conicsct.c++ does not exist conicsct.h++ does not exist make[2]: Leaving directory '/tmp/B.c2a50e47-e333-4207-9941-d8bbac0e22cf/BUILD/3DLDF-2.0.3/src' make[2]: Entering directory '/tmp/B.c2a50e47-e333-4207-9941-d8bbac0e22cf/BUILD/3DLDF-2.0.3/src' ctangle crclslc.web This is CTANGLE, Version 3.64 (Web2C 7.5.7) *1*3*4*5*6*8*9*10*11*13*15*17 Writing the output files: (crclslc.c). (crclslc.h) Done. (No errors were found.) crclslc.c++ does not exist crclslc.h++ does not exist make[2]: Leaving directory '/tmp/B.c2a50e47-e333-4207-9941-d8bbac0e22cf/BUILD/3DLDF-2.0.3/src' make[2]: Entering directory '/tmp/B.c2a50e47-e333-4207-9941-d8bbac0e22cf/BUILD/3DLDF-2.0.3/src' ctangle creatnew.web This is CTANGLE, Version 3.64 (Web2C 7.5.7) *1*3*4*8*12 Writing the output files: (creatnew.c). (creatnew.h). Done. (No errors were found.) creatnew.c++ does not exist creatnew.h++ does not exist make[2]: Leaving directory '/tmp/B.c2a50e47-e333-4207-9941-d8bbac0e22cf/BUILD/3DLDF-2.0.3/src' make[2]: Entering directory '/tmp/B.c2a50e47-e333-4207-9941-d8bbac0e22cf/BUILD/3DLDF-2.0.3/src' ctangle cuboid.web This is CTANGLE, Version 3.64 (Web2C 7.5.7) *1*3*4*5*7*9*11*12*13*14*16*18*20*21*22*23*25*26*28*31 Writing the output files: (cuboid.c).....500.. (cuboid.h). Done. (No errors were found.) cuboid.c++ does not exist cuboid.h++ does not exist make[2]: Leaving directory '/tmp/B.c2a50e47-e333-4207-9941-d8bbac0e22cf/BUILD/3DLDF-2.0.3/src' make[2]: Entering directory '/tmp/B.c2a50e47-e333-4207-9941-d8bbac0e22cf/BUILD/3DLDF-2.0.3/src' ctangle curves.web This is CTANGLE, Version 3.64 (Web2C 7.5.7) *1*3*4*15*20*21*23*25*26*37*39*40*50*54 Writing the output files: (curves.c).....500.....1000.... (curves.h). Done. (No errors were found.) curves.c++ does not exist curves.h++ does not exist make[2]: Leaving directory '/tmp/B.c2a50e47-e333-4207-9941-d8bbac0e22cf/BUILD/3DLDF-2.0.3/src' make[2]: Entering directory '/tmp/B.c2a50e47-e333-4207-9941-d8bbac0e22cf/BUILD/3DLDF-2.0.3/src' ctangle cylinder.web This is CTANGLE, Version 3.64 (Web2C 7.5.7) *1*3*4*5*7*16*18*19*20*21*22*24*25*26*28*30*32*33*34*36*37*39*41*43*45*46*48*50*51*53*55*56*58*60*62*64*65*66*67*68*70*72*74 Writing the output files: (cylinder.c).....500.....1000. (cylinder.h).. Done. (No errors were found.) cylinder.c++ does not exist cylinder.h++ does not exist make[2]: Leaving directory '/tmp/B.c2a50e47-e333-4207-9941-d8bbac0e22cf/BUILD/3DLDF-2.0.3/src' make[2]: Entering directory '/tmp/B.c2a50e47-e333-4207-9941-d8bbac0e22cf/BUILD/3DLDF-2.0.3/src' ctangle dashptrn.web This is CTANGLE, Version 3.64 (Web2C 7.5.7) *1*2*3*5*6*8*10*11*12*13*15*17*19*20*21*22*23*26*27 Writing the output files: (dashptrn.c).. (dashptrn.h) Done. (No errors were found.) dashptrn.c++ does not exist dashptrn.h++ does not exist make[2]: Leaving directory '/tmp/B.c2a50e47-e333-4207-9941-d8bbac0e22cf/BUILD/3DLDF-2.0.3/src' make[2]: Entering directory '/tmp/B.c2a50e47-e333-4207-9941-d8bbac0e22cf/BUILD/3DLDF-2.0.3/src' ctangle ddchdrn.web This is CTANGLE, Version 3.64 (Web2C 7.5.7) *1*3*4*5*6*7*9*10*13*15*16*17*18*19*21*23*24*39*41 Writing the output files: (ddchdrn.c).....500.....1000.... (ddchdrn.h). Done. (No errors were found.) ddchdrn.c++ does not exist ddchdrn.h++ does not exist make[2]: Leaving directory '/tmp/B.c2a50e47-e333-4207-9941-d8bbac0e22cf/BUILD/3DLDF-2.0.3/src' make[2]: Entering directory '/tmp/B.c2a50e47-e333-4207-9941-d8bbac0e22cf/BUILD/3DLDF-2.0.3/src' ctangle deftfncs.web This is CTANGLE, Version 3.64 (Web2C 7.5.7) *1*2*3*6 Writing the output files: (deftfncs.c). (deftfncs.h) Done. (No errors were found.) deftfncs.c++ does not exist deftfncs.h++ does not exist make[2]: Leaving directory '/tmp/B.c2a50e47-e333-4207-9941-d8bbac0e22cf/BUILD/3DLDF-2.0.3/src' make[2]: Entering directory '/tmp/B.c2a50e47-e333-4207-9941-d8bbac0e22cf/BUILD/3DLDF-2.0.3/src' ctangle ellipses.web This is CTANGLE, Version 3.64 (Web2C 7.5.7) *1*3*5*6*8*9*11*13*15*16*17*18*19*21*23*33*42*43*45*46*47*48*49*50*55*57*58*63*68*73*75*77*79*81*83*84*89*94*96*98*100*101*103*105*108*124*125*126*129*131*135*152*154*156*161*163*165*166*167*168*169*170*171 Writing the output files: (ellipses.c).....500.....1000.....1500.....2000.....2500.....3000.....3500 (ellipses.h).... Done. (No errors were found.) ellipses.c++ does not exist ellipses.h++ does not exist make[2]: Leaving directory '/tmp/B.c2a50e47-e333-4207-9941-d8bbac0e22cf/BUILD/3DLDF-2.0.3/src' make[2]: Entering directory '/tmp/B.c2a50e47-e333-4207-9941-d8bbac0e22cf/BUILD/3DLDF-2.0.3/src' ctangle ellpsoid.web This is CTANGLE, Version 3.64 (Web2C 7.5.7) *1*3*4*5*6*8*17*19*20*21*22*23*25*26*27*29*31*32*33*35*36*38*40*42*44*45*47*49*50*52*54*55*57*59*61*62*64*69*71*72*74*76*77*78*79*80*82*84*86 Writing the output files: (ellpsoid.c).....500.....1000.....1500.....2000.....2500. (ellpsoid.h).. Done. (No errors were found.) ellpsoid.c++ does not exist ellpsoid.h++ does not exist make[2]: Leaving directory '/tmp/B.c2a50e47-e333-4207-9941-d8bbac0e22cf/BUILD/3DLDF-2.0.3/src' make[2]: Entering directory '/tmp/B.c2a50e47-e333-4207-9941-d8bbac0e22cf/BUILD/3DLDF-2.0.3/src' ctangle ellpsslc.web This is CTANGLE, Version 3.64 (Web2C 7.5.7) *1*3*4*5*6*8*9*10*11*13*15*17 Writing the output files: (ellpsslc.c). (ellpsslc.h) Done. (No errors were found.) ellpsslc.c++ does not exist ellpsslc.h++ does not exist make[2]: Leaving directory '/tmp/B.c2a50e47-e333-4207-9941-d8bbac0e22cf/BUILD/3DLDF-2.0.3/src' make[2]: Entering directory '/tmp/B.c2a50e47-e333-4207-9941-d8bbac0e22cf/BUILD/3DLDF-2.0.3/src' ctangle figures.web This is CTANGLE, Version 3.64 (Web2C 7.5.7) *1*3*6 Writing the output files: (figures.c). (figures.h) Done. (No errors were found.) figures.c++ does not exist figures.h++ does not exist make[2]: Leaving directory '/tmp/B.c2a50e47-e333-4207-9941-d8bbac0e22cf/BUILD/3DLDF-2.0.3/src' make[2]: Entering directory '/tmp/B.c2a50e47-e333-4207-9941-d8bbac0e22cf/BUILD/3DLDF-2.0.3/src' ctangle glyphs.web This is CTANGLE, Version 3.64 (Web2C 7.5.7) *1*3*4*5*7*9*10*11*12*13*15*16*17*19*21*23*25*26*28*30*31*33*35*36*38*40*42*43*44*45*46*48*50*52 Writing the output files: (glyphs.c).... (glyphs.h). Done. (No errors were found.) glyphs.c++ does not exist glyphs.h++ does not exist make[2]: Leaving directory '/tmp/B.c2a50e47-e333-4207-9941-d8bbac0e22cf/BUILD/3DLDF-2.0.3/src' make[2]: Entering directory '/tmp/B.c2a50e47-e333-4207-9941-d8bbac0e22cf/BUILD/3DLDF-2.0.3/src' ctangle gsltmplt.web This is CTANGLE, Version 3.64 (Web2C 7.5.7) *1 Writing the output files: (gsltmplt.c)... (gsltmplt.h)... Done. (No errors were found.) gsltmplt.c++ does not exist gsltmplt.h++ does not exist make[2]: Leaving directory '/tmp/B.c2a50e47-e333-4207-9941-d8bbac0e22cf/BUILD/3DLDF-2.0.3/src' make[2]: Entering directory '/tmp/B.c2a50e47-e333-4207-9941-d8bbac0e22cf/BUILD/3DLDF-2.0.3/src' ctangle helices.web This is CTANGLE, Version 3.64 (Web2C 7.5.7) *1*3*5*6*8*10*12*13*14*15*16*18*19*20*21*22*24*25*27*29*31*33*34*36*38*39*41*43*44*46*48*50*51*52*53*54*56*58*60 Writing the output files: (helices.c).....500.. (helices.h).. Done. (No errors were found.) helices.c++ does not exist helices.h++ does not exist make[2]: Leaving directory '/tmp/B.c2a50e47-e333-4207-9941-d8bbac0e22cf/BUILD/3DLDF-2.0.3/src' make[2]: Entering directory '/tmp/B.c2a50e47-e333-4207-9941-d8bbac0e22cf/BUILD/3DLDF-2.0.3/src' ctangle hyprbola.web This is CTANGLE, Version 3.64 (Web2C 7.5.7) *1*3*4*5*6*8*13*15*16*17*18*19*21*22*23*27*28*30*40*41*43*45*49*50*51*53*55*56*58*60*62*64*65*67*69*70*72*74*75*77*79*85*87*88*96*98*100*101*102*103*104*106*108*110 Writing the output files: (hyprbola.c).....500.....1000.....1500. (hyprbola.h).. Done. (No errors were found.) hyprbola.c++ does not exist hyprbola.h++ does not exist make[2]: Leaving directory '/tmp/B.c2a50e47-e333-4207-9941-d8bbac0e22cf/BUILD/3DLDF-2.0.3/src' make[2]: Entering directory '/tmp/B.c2a50e47-e333-4207-9941-d8bbac0e22cf/BUILD/3DLDF-2.0.3/src' ctangle imetfncs.web This is CTANGLE, Version 3.64 (Web2C 7.5.7) *1*2*3*4*12*13*14*54*61*62*76*92*103*109*110*116*117*118*119*120*121*122 Writing the output files: (imetfncs.c).....500.....1000.....1500.....2000.....2500.....3000.....3500.....4000.....4500 (imetfncs.h) Done. (No errors were found.) imetfncs.c++ does not exist imetfncs.h++ does not exist make[2]: Leaving directory '/tmp/B.c2a50e47-e333-4207-9941-d8bbac0e22cf/BUILD/3DLDF-2.0.3/src' make[2]: Entering directory '/tmp/B.c2a50e47-e333-4207-9941-d8bbac0e22cf/BUILD/3DLDF-2.0.3/src' ctangle io.web This is CTANGLE, Version 3.64 (Web2C 7.5.7) *1*3*4*5*6*7*9*11*12*13*16*23*24*25*27*29*31*32*35*37*38*39*45*46*47*48*49*50*51*52*53*54*55*56*57*58*60*61*62*63*64*65*66*67*68*69*70*71*72*73*74*75*76*77*78*79*80*82*83*85*86*87*88*89*90*92*94*95*96*97*98*99*101*103*105*106*107*108*109*110*111*112*113*114*115*116*117*118*119*120*121*122*123*125*126*128*130*131*133*135*137*138*139*141*143*144*146*147*148*149*150*151*152*153*154*155*157*169*170*171*172*173*175*176*177*178*179*180*181*182*183*184*189*190*191*192*193*194*195*196*197*198*200*201*202*203*204*205 Writing the output files: (io.c).....500.....1000.....1500.....2000.....2500.....3000.....3500.....4000.....4500... (io.h).....500.....1000.....1500.....2000.....2500.....3000.....3500 Done. (No errors were found.) io.c++ does not exist io.h++ does not exist make[2]: Leaving directory '/tmp/B.c2a50e47-e333-4207-9941-d8bbac0e22cf/BUILD/3DLDF-2.0.3/src' make[2]: Entering directory '/tmp/B.c2a50e47-e333-4207-9941-d8bbac0e22cf/BUILD/3DLDF-2.0.3/src' ctangle lines.web This is CTANGLE, Version 3.64 (Web2C 7.5.7) *1*3*4*5*6*8*10*12*13*15*16*18*20*21*23*25*26*27*34*35*36 Writing the output files: (lines.c).....500. (lines.h) Done. (No errors were found.) lines.c++ does not exist lines.h++ does not exist make[2]: Leaving directory '/tmp/B.c2a50e47-e333-4207-9941-d8bbac0e22cf/BUILD/3DLDF-2.0.3/src' make[2]: Entering directory '/tmp/B.c2a50e47-e333-4207-9941-d8bbac0e22cf/BUILD/3DLDF-2.0.3/src' ctangle loader.web This is CTANGLE, Version 3.64 (Web2C 7.5.7) *1*3 Writing the output files: (loader.c) (loader.h). Done. (No errors were found.) loader.c++ does not exist loader.h++ does not exist make[2]: Leaving directory '/tmp/B.c2a50e47-e333-4207-9941-d8bbac0e22cf/BUILD/3DLDF-2.0.3/src' make[2]: Entering directory '/tmp/B.c2a50e47-e333-4207-9941-d8bbac0e22cf/BUILD/3DLDF-2.0.3/src' ctangle matrices.web This is CTANGLE, Version 3.64 (Web2C 7.5.7) *1*3*4*6*8*9*10*12*16*23*25*26*28*29*36*39*42*45*48*49*55*56*58*60*62*64*66*67*68*72*74*80*81*82*83*85*87*89*93 Writing the output files: (matrices.c).....500.....1000.....1500.....2000.....2500.....3000.....3500... (matrices.h).. Done. (No errors were found.) matrices.c++ does not exist matrices.h++ does not exist make[2]: Leaving directory '/tmp/B.c2a50e47-e333-4207-9941-d8bbac0e22cf/BUILD/3DLDF-2.0.3/src' make[2]: Entering directory '/tmp/B.c2a50e47-e333-4207-9941-d8bbac0e22cf/BUILD/3DLDF-2.0.3/src' ctangle nurbs.web This is CTANGLE, Version 3.64 (Web2C 7.5.7) *1*3*5*6*7*9*11*12*14*15*16*17*18*19*20*21*22*23*24*25*26*27*28*29*30*31*32*33*34*35*36*37*38*39*40*41*42*43*44*45*46*47*48*49*50*51*52*53*54*56*57*58*59*60*61*62*63*65*67*69*70*72*74*75*76*78*80*82*84*86*88*90*92*94*96 Writing the output files: (nurbs.c).....500.....1000.... (nurbs.h).....500.. Done. (No errors were found.) nurbs.c++ does not exist nurbs.h++ does not exist make[2]: Leaving directory '/tmp/B.c2a50e47-e333-4207-9941-d8bbac0e22cf/BUILD/3DLDF-2.0.3/src' make[2]: Entering directory '/tmp/B.c2a50e47-e333-4207-9941-d8bbac0e22cf/BUILD/3DLDF-2.0.3/src' ctangle origami.web This is CTANGLE, Version 3.64 (Web2C 7.5.7) *1*3*4*5*6*8 Writing the output files: (origami.c) (origami.h) Done. (No errors were found.) origami.c++ does not exist origami.h++ does not exist make[2]: Leaving directory '/tmp/B.c2a50e47-e333-4207-9941-d8bbac0e22cf/BUILD/3DLDF-2.0.3/src' make[2]: Entering directory '/tmp/B.c2a50e47-e333-4207-9941-d8bbac0e22cf/BUILD/3DLDF-2.0.3/src' ctangle parabola.web This is CTANGLE, Version 3.64 (Web2C 7.5.7) *1*3*4*5*6*8*17*19*20*21*22*23*25*26*27*30*33*34*36*37*39*41*42*44*46*48*50*51*53*55*56*58*60*61*63*65*67*68*70*78*79*80*82*84*85*86*87*88*90*92*94 Writing the output files: (parabola.c).....500.....1000.... (parabola.h).. Done. (No errors were found.) parabola.c++ does not exist parabola.h++ does not exist make[2]: Leaving directory '/tmp/B.c2a50e47-e333-4207-9941-d8bbac0e22cf/BUILD/3DLDF-2.0.3/src' make[2]: Entering directory '/tmp/B.c2a50e47-e333-4207-9941-d8bbac0e22cf/BUILD/3DLDF-2.0.3/src' ctangle parabold.web This is CTANGLE, Version 3.64 (Web2C 7.5.7) *1*3*4*5*6*8*10*12*13*14*15*16*18*19*20*21*23*25*26*27*29*30*32*34*36*38*39*41*43*44*46*48*49*51*53*55*56*58*59*60*61*62*64*66*68 Writing the output files: (parabold.c).....500.. (parabold.h).. Done. (No errors were found.) parabold.c++ does not exist parabold.h++ does not exist make[2]: Leaving directory '/tmp/B.c2a50e47-e333-4207-9941-d8bbac0e22cf/BUILD/3DLDF-2.0.3/src' make[2]: Entering directory '/tmp/B.c2a50e47-e333-4207-9941-d8bbac0e22cf/BUILD/3DLDF-2.0.3/src' ctangle paraellp.web This is CTANGLE, Version 3.64 (Web2C 7.5.7) *1*3*4*5*6*8*10*12*13*14*15*16*17*19*21*22*23*25*27*28 Writing the output files: (paraellp.c)... (paraellp.h). Done. (No errors were found.) paraellp.c++ does not exist paraellp.h++ does not exist make[2]: Leaving directory '/tmp/B.c2a50e47-e333-4207-9941-d8bbac0e22cf/BUILD/3DLDF-2.0.3/src' make[2]: Entering directory '/tmp/B.c2a50e47-e333-4207-9941-d8bbac0e22cf/BUILD/3DLDF-2.0.3/src' ctangle parahypr.web This is CTANGLE, Version 3.64 (Web2C 7.5.7) *1*3*4*5*6*8*10*12*13*14*15*16*17*19*21*22*23*25*27*28 Writing the output files: (parahypr.c)... (parahypr.h). Done. (No errors were found.) parahypr.c++ does not exist parahypr.h++ does not exist make[2]: Leaving directory '/tmp/B.c2a50e47-e333-4207-9941-d8bbac0e22cf/BUILD/3DLDF-2.0.3/src' make[2]: Entering directory '/tmp/B.c2a50e47-e333-4207-9941-d8bbac0e22cf/BUILD/3DLDF-2.0.3/src' ctangle paths.web This is CTANGLE, Version 3.64 (Web2C 7.5.7) *1*3*6*7*14*15*16*18*19*21*23*24*26*28*29*31*35*37*38*41*43*44*46*48*49*51*53*55*57*59*61*63*65*66*68*69*70*71*72*73*74*75*76*77*78*79*80*81*82*83*84*85*86*87*88*89*90*91*92*93*94*95*96*97*98*99*100*101*102*103*104*105*106*107*108*109*110*137*139*141*152*163*164*165*166*168*170*172*173*174*176*178*180*182*186*187*188*193*195*200*201*204*205*206*215*216*217*219*220*221*223*224*230*236*237*243*244*250*256*257*262*263*264*266*271*276*281*283*285*287*288*290*292*294*296*298*300*302*304*306*308*310*312*314*319*322*328*336*339*342*344*345*346*349*351*352*353*355*357*361*368*370*372*374*375*376*377*378*379*386*387*389*395*396*398*400*402*404*405*410*411*416*417*419*423*425*427*429*430*435*437*439*440*442*444*445*457*458*459*460*461*462*463*464*465*473*475*477*478*480*481*484*485*486 Writing the output files: (paths.c).....500.....1000.....1500.....2000.....2500.....3000.....3500.....4000.....4500.....5000.....5500.....6000.....6500.....7000.....7500.....8000.....8500.....9000.....9500.... (paths.h).....500.....1000... Done. (No errors were found.) paths.c++ does not exist paths.h++ does not exist make[2]: Leaving directory '/tmp/B.c2a50e47-e333-4207-9941-d8bbac0e22cf/BUILD/3DLDF-2.0.3/src' make[2]: Entering directory '/tmp/B.c2a50e47-e333-4207-9941-d8bbac0e22cf/BUILD/3DLDF-2.0.3/src' ctangle pctfncs0.web This is CTANGLE, Version 3.64 (Web2C 7.5.7) *1*3*4*28 Writing the output files: (pctfncs0.c).....500.... (pctfncs0.h) Done. (No errors were found.) pctfncs0.c++ does not exist pctfncs0.h++ does not exist make[2]: Leaving directory '/tmp/B.c2a50e47-e333-4207-9941-d8bbac0e22cf/BUILD/3DLDF-2.0.3/src' make[2]: Entering directory '/tmp/B.c2a50e47-e333-4207-9941-d8bbac0e22cf/BUILD/3DLDF-2.0.3/src' ctangle pens.web This is CTANGLE, Version 3.64 (Web2C 7.5.7) *1*2*3*4*5*6*7*9*11*12*13*14*16*18*20*22*23*24*25*26*29*30*32*34 Writing the output files: (pens.c)... (pens.h). Done. (No errors were found.) pens.c++ does not exist pens.h++ does not exist make[2]: Leaving directory '/tmp/B.c2a50e47-e333-4207-9941-d8bbac0e22cf/BUILD/3DLDF-2.0.3/src' make[2]: Entering directory '/tmp/B.c2a50e47-e333-4207-9941-d8bbac0e22cf/BUILD/3DLDF-2.0.3/src' ctangle pictures.web This is CTANGLE, Version 3.64 (Web2C 7.5.7) *1*3*4*5*6*7*9*10*11*12*16*17*20*22*23*24*25*27*29*33*41*43*44*48*53*58 Writing the output files: (pictures.c).... (pictures.h).. Done. (No errors were found.) pictures.c++ does not exist pictures.h++ does not exist make[2]: Leaving directory '/tmp/B.c2a50e47-e333-4207-9941-d8bbac0e22cf/BUILD/3DLDF-2.0.3/src' make[2]: Entering directory '/tmp/B.c2a50e47-e333-4207-9941-d8bbac0e22cf/BUILD/3DLDF-2.0.3/src' ctangle planes.web This is CTANGLE, Version 3.64 (Web2C 7.5.7) *1*3*4*5*7*9*11*13*14*16*18*19*21*23*24*25*28*29*30*31*39*40*54*55*56*59*60*65*67*69 Writing the output files: (planes.c).....500.... (planes.h). Done. (No errors were found.) planes.c++ does not exist planes.h++ does not exist make[2]: Leaving directory '/tmp/B.c2a50e47-e333-4207-9941-d8bbac0e22cf/BUILD/3DLDF-2.0.3/src' make[2]: Entering directory '/tmp/B.c2a50e47-e333-4207-9941-d8bbac0e22cf/BUILD/3DLDF-2.0.3/src' ctangle plyhdslc.web This is CTANGLE, Version 3.64 (Web2C 7.5.7) *1*3*4*5*6*8*9*10*11*13*15*17 Writing the output files: (plyhdslc.c). (plyhdslc.h) Done. (No errors were found.) plyhdslc.c++ does not exist plyhdslc.h++ does not exist make[2]: Leaving directory '/tmp/B.c2a50e47-e333-4207-9941-d8bbac0e22cf/BUILD/3DLDF-2.0.3/src' make[2]: Entering directory '/tmp/B.c2a50e47-e333-4207-9941-d8bbac0e22cf/BUILD/3DLDF-2.0.3/src' ctangle pntrvcf0.web This is CTANGLE, Version 3.64 (Web2C 7.5.7) *1*2*3*11*18 Writing the output files: (pntrvcf0.c).....500... (pntrvcf0.h) Done. (No errors were found.) pntrvcf0.c++ does not exist pntrvcf0.h++ does not exist make[2]: Leaving directory '/tmp/B.c2a50e47-e333-4207-9941-d8bbac0e22cf/BUILD/3DLDF-2.0.3/src' make[2]: Entering directory '/tmp/B.c2a50e47-e333-4207-9941-d8bbac0e22cf/BUILD/3DLDF-2.0.3/src' ctangle pntrvctr.web This is CTANGLE, Version 3.64 (Web2C 7.5.7) *1*2*3*4*5*6*8*10*11*12*18*20*22*23*25*27*29*30*32*34*36*38*39*41*43*45*46*48*50*52*54*55*56*58 Writing the output files: (pntrvctr.c).....500.... (pntrvctr.h).....500.... Done. (No errors were found.) pntrvctr.c++ does not exist pntrvctr.h++ does not exist make[2]: Leaving directory '/tmp/B.c2a50e47-e333-4207-9941-d8bbac0e22cf/BUILD/3DLDF-2.0.3/src' make[2]: Entering directory '/tmp/B.c2a50e47-e333-4207-9941-d8bbac0e22cf/BUILD/3DLDF-2.0.3/src' ctangle points.web This is CTANGLE, Version 3.64 (Web2C 7.5.7) *1*3*5*6*7*8*9*12*14*16*17*19*21*23*25*27*29*31*33*36*38*39*41*43*45*47*48*49*50*52*53*55*57*59*61*63*64*65*66*68*79*113*114*117*119*120*122*123*124*125*126*127*128*129*130*131*133*135*137*139*141*142*143*144*145*146*147*148*149*150*151*152*153*154*155*156*157*158*159*160*161*162*163*164*165*166*167*168*169*170*171*172*173*174*175*176*177*178*179*180*181*182*201*212*213*220*229*233*234*240*242*243*244*245*246*247*251*252*254*258*260*261*262*263*265*267*269*271*273*275*277*279*281*283*285*287*289*291*293*294*295*296*297*298*299*301*302*304*305*307*309*310*314*321*322*323*326*328*329*331*333*334*335*336*337*338*340*341*343*345*347*349*351*352*354*356*358*360*362*364*366*370*371*377*378*379*380*381*382*383*384*392*394*395*397*399*401*402*403*416*417*418*420*422*424*426*427*428*431*432*433*434*435*436*437*438*439*441*443*444*445*447*449*450*452*453*454*455*457*459*460*461*467*469*471*472*473*474*475*476*477*479*480*482*484*485*486*487*489 Writing the output files: (points.c).....500.....1000.....1500.....2000.....2500.....3000.....3500.....4000.....4500.....5000.....5500.....6000.....6500.....7000. (points.h).....500.....1000.....1500... Done. (No errors were found.) points.c++ does not exist points.h++ does not exist make[2]: Leaving directory '/tmp/B.c2a50e47-e333-4207-9941-d8bbac0e22cf/BUILD/3DLDF-2.0.3/src' make[2]: Entering directory '/tmp/B.c2a50e47-e333-4207-9941-d8bbac0e22cf/BUILD/3DLDF-2.0.3/src' ctangle polygons.web This is CTANGLE, Version 3.64 (Web2C 7.5.7) *1*3*4*6*8*10*11*12*13*14*18*20*21*24*25*37*39*44*78*87*88*93*94*118*119*122*123*124*125*127*128*130*131*134*138*139*140*141*142*144*145*146*147*149*160*161*162*163*164*165 Writing the output files: (polygons.c).....500.....1000.....1500.....2000.....2500.....3000.....3500. (polygons.h)... Done. (No errors were found.) polygons.c++ does not exist polygons.h++ does not exist make[2]: Leaving directory '/tmp/B.c2a50e47-e333-4207-9941-d8bbac0e22cf/BUILD/3DLDF-2.0.3/src' make[2]: Entering directory '/tmp/B.c2a50e47-e333-4207-9941-d8bbac0e22cf/BUILD/3DLDF-2.0.3/src' ctangle polyhed.web This is CTANGLE, Version 3.64 (Web2C 7.5.7) *1*3*4*5*7*17*18*22*26*28*29*30*35*36*42*44*45*46*47*49*51*61*62*63*64*65*67*68*79*81*82*83*84*86*96*97*98*99*100*102*103*105*107*108*109*110*112*114*124*125*126*127*128*129*130*132*133*137*139*140*141*142*144*145*146*147*148*149*151*152*173*175*176*177*178*180*181*182*184*186 Writing the output files: (polyhed.c).....500.....1000.....1500.....2000.....2500.....3000.....3500.....4000.. (polyhed.h).... Done. (No errors were found.) polyhed.c++ does not exist polyhed.h++ does not exist make[2]: Leaving directory '/tmp/B.c2a50e47-e333-4207-9941-d8bbac0e22cf/BUILD/3DLDF-2.0.3/src' make[2]: Entering directory '/tmp/B.c2a50e47-e333-4207-9941-d8bbac0e22cf/BUILD/3DLDF-2.0.3/src' ctangle predctes.web This is CTANGLE, Version 3.64 (Web2C 7.5.7) *1*3*4*6*7*8*10*11*13*14*16*17*18*20*21*23 Writing the output files: (predctes.c).. (predctes.h) Done. (No errors were found.) predctes.c++ does not exist predctes.h++ does not exist make[2]: Leaving directory '/tmp/B.c2a50e47-e333-4207-9941-d8bbac0e22cf/BUILD/3DLDF-2.0.3/src' make[2]: Entering directory '/tmp/B.c2a50e47-e333-4207-9941-d8bbac0e22cf/BUILD/3DLDF-2.0.3/src' ctangle primes.web This is CTANGLE, Version 3.64 (Web2C 7.5.7) *1*3*5*6*8*10*12*14 Writing the output files: (primes.c).....500. (primes.h) Done. (No errors were found.) primes.c++ does not exist primes.h++ does not exist make[2]: Leaving directory '/tmp/B.c2a50e47-e333-4207-9941-d8bbac0e22cf/BUILD/3DLDF-2.0.3/src' make[2]: Entering directory '/tmp/B.c2a50e47-e333-4207-9941-d8bbac0e22cf/BUILD/3DLDF-2.0.3/src' ctangle prrfnc0.web This is CTANGLE, Version 3.64 (Web2C 7.5.7) *1*3*4*5*6*7*8*9*10*11*12*13*14*15*16*17*18*19*20*21*22*23*24*25*27*28*29*30*31*32*33*34*35*36*37*38*39*40*41*42*43*44*45*46*48*49*50*51*52*53*54*55*56*74*75*76*77*78*80*81*82*83*84*85*86*87*88*89*90*91*92*93*94*95*96*97*98*99*100*101*102*103*104*105*107*109*110*111*112*113*114*115*119 Writing the output files: (prrfnc0.c).....500.....1000.....1500.....2000.....2500.....3000.....3500.....4000.... (prrfnc0.h) Done. (No errors were found.) prrfnc0.c++ does not exist prrfnc0.h++ does not exist make[2]: Leaving directory '/tmp/B.c2a50e47-e333-4207-9941-d8bbac0e22cf/BUILD/3DLDF-2.0.3/src' make[2]: Entering directory '/tmp/B.c2a50e47-e333-4207-9941-d8bbac0e22cf/BUILD/3DLDF-2.0.3/src' ctangle rectangs.web This is CTANGLE, Version 3.64 (Web2C 7.5.7) *1*3*4*5*7*8*12*13*15*17*18*19*20*21*23*25*26*36*37*38*39*41*43*44*46*48*49*50*51*52*53*54*55*59*60 Writing the output files: (rectangs.c).....500.... (rectangs.h). Done. (No errors were found.) rectangs.c++ does not exist rectangs.h++ does not exist make[2]: Leaving directory '/tmp/B.c2a50e47-e333-4207-9941-d8bbac0e22cf/BUILD/3DLDF-2.0.3/src' make[2]: Entering directory '/tmp/B.c2a50e47-e333-4207-9941-d8bbac0e22cf/BUILD/3DLDF-2.0.3/src' ctangle rhtchdrn.web This is CTANGLE, Version 3.64 (Web2C 7.5.7) *1*3*4*5*6*7*9*11*13*14*15*16*20*21*29*30*33 Writing the output files: (rhtchdrn.c).....500.....1000.....1500. (rhtchdrn.h). Done. (No errors were found.) rhtchdrn.c++ does not exist rhtchdrn.h++ does not exist make[2]: Leaving directory '/tmp/B.c2a50e47-e333-4207-9941-d8bbac0e22cf/BUILD/3DLDF-2.0.3/src' make[2]: Entering directory '/tmp/B.c2a50e47-e333-4207-9941-d8bbac0e22cf/BUILD/3DLDF-2.0.3/src' ctangle scan.web This is CTANGLE, Version 3.64 (Web2C 7.5.7) *1*3*14*20*27*78*80 Writing the output files: (scan.c).....500.....1000.....1500.....2000.... (scan.h) Done. (No errors were found.) scan.c++ does not exist scan.h++ does not exist make[2]: Leaving directory '/tmp/B.c2a50e47-e333-4207-9941-d8bbac0e22cf/BUILD/3DLDF-2.0.3/src' make[2]: Entering directory '/tmp/B.c2a50e47-e333-4207-9941-d8bbac0e22cf/BUILD/3DLDF-2.0.3/src' ctangle scanprse.web This is CTANGLE, Version 3.64 (Web2C 7.5.7) *1*3*4*5*7*8*9*11*12*22*36*59*85*87*89*90*98*99*106*107*122*138*145*147*154*166*170*206*207*221*222*238*240*241*251*252*253*254*267*268*282*283*287*288*291*292*293*294*304*305*306*307*311*312*313*314*315*316*317*318*319*320*321*322*323*324*325*326*327*328*330*331*332*333*334*335*336*337*339*340*341*342*343*344*345*346*347*348*349*350 Writing the output files: (scanprse.c).....500.....1000.....1500.....2000.....2500.....3000.....3500.....4000.....4500.....5000.....5500.....6000.....6500.....7000.....7500.....8000.....8500.....9000.....9500... (scanprse.h).....500.....1000.....1500.....2000.....2500.....3000.....3500.....4000.....4500.....5000.....5500 Done. (No errors were found.) scanprse.c++ does not exist scanprse.h++ does not exist make[2]: Leaving directory '/tmp/B.c2a50e47-e333-4207-9941-d8bbac0e22cf/BUILD/3DLDF-2.0.3/src' make[2]: Entering directory '/tmp/B.c2a50e47-e333-4207-9941-d8bbac0e22cf/BUILD/3DLDF-2.0.3/src' ctangle scanprsf.web This is CTANGLE, Version 3.64 (Web2C 7.5.7) *1*3*4*5*9*22*35*57*107*129*160*178*194*211*215*220*232*237*250*251*269*274*275*290*292*307*309*321*322*358*389*390*396*406*410*414*419*422*425*426*427*428*432*438*443*444*449*454*455*459*460*461*480*481*482*494 Writing the output files: (scanprsf.c).....500.....1000.....1500.....2000.....2500.....3000.....3500.....4000.....4500.....5000.....5500.....6000.....6500.....7000.....7500.....8000.....8500.....9000.....9500.....10000.....10500.....11000.....11500.....12000.....12500.....13000.....13500.....14000.....14500.....15000.....15500.....16000.....16500.....17000.....17500.....18000.....18500.....19000 (scanprsf.h) Done. (No errors were found.) scanprsf.c++ does not exist scanprsf.h++ does not exist make[2]: Leaving directory '/tmp/B.c2a50e47-e333-4207-9941-d8bbac0e22cf/BUILD/3DLDF-2.0.3/src' make[2]: Entering directory '/tmp/B.c2a50e47-e333-4207-9941-d8bbac0e22cf/BUILD/3DLDF-2.0.3/src' ctangle sctpcrt.web This is CTANGLE, Version 3.64 (Web2C 7.5.7) *1*3*4*5*11*14*15*16*17*18*19*20*22*23*24*25*26*27*29*30*31*32*33*34*35*36*37*38*39*40*41*42*43*44*45*46*47*48*49*50*51*52*53*54*55*56*57*58*59*60*61*62*63*64*65*66*67*68*69*73*74*76*88*89*93*95*97*99*100*103*104*105*106*107*108*109*119*129*134 Writing the output files: (sctpcrt.c).....500.....1000.....1500.....2000.....2500.....3000.....3500.....4000.. (sctpcrt.h) Done. (No errors were found.) sctpcrt.c++ does not exist sctpcrt.h++ does not exist make[2]: Leaving directory '/tmp/B.c2a50e47-e333-4207-9941-d8bbac0e22cf/BUILD/3DLDF-2.0.3/src' make[2]: Entering directory '/tmp/B.c2a50e47-e333-4207-9941-d8bbac0e22cf/BUILD/3DLDF-2.0.3/src' ctangle sctpfncs.web This is CTANGLE, Version 3.64 (Web2C 7.5.7) *1*3*8*16*20*29*31*37*43*53*98 Writing the output files: (sctpfncs.c).....500.....1000.....1500.....2000.....2500.....3000. (sctpfncs.h) Done. (No errors were found.) sctpfncs.c++ does not exist sctpfncs.h++ does not exist make[2]: Leaving directory '/tmp/B.c2a50e47-e333-4207-9941-d8bbac0e22cf/BUILD/3DLDF-2.0.3/src' make[2]: Entering directory '/tmp/B.c2a50e47-e333-4207-9941-d8bbac0e22cf/BUILD/3DLDF-2.0.3/src' ctangle shapes.web This is CTANGLE, Version 3.64 (Web2C 7.5.7) *1*2*3*5*7*11*15*21*22*24 Writing the output files: (shapes.c).....500 (shapes.h)... Done. (No errors were found.) shapes.c++ does not exist shapes.h++ does not exist make[2]: Leaving directory '/tmp/B.c2a50e47-e333-4207-9941-d8bbac0e22cf/BUILD/3DLDF-2.0.3/src' make[2]: Entering directory '/tmp/B.c2a50e47-e333-4207-9941-d8bbac0e22cf/BUILD/3DLDF-2.0.3/src' ctangle solfaced.web This is CTANGLE, Version 3.64 (Web2C 7.5.7) *1*3*4*5 Writing the output files: (solfaced.c).. (solfaced.h) Done. (No errors were found.) solfaced.c++ does not exist solfaced.h++ does not exist make[2]: Leaving directory '/tmp/B.c2a50e47-e333-4207-9941-d8bbac0e22cf/BUILD/3DLDF-2.0.3/src' make[2]: Entering directory '/tmp/B.c2a50e47-e333-4207-9941-d8bbac0e22cf/BUILD/3DLDF-2.0.3/src' ctangle solids.web This is CTANGLE, Version 3.64 (Web2C 7.5.7) *1*3*5*6*8*10*11*12*13*15*19*21*22*23*25*27*28*30*32*34*36*38*40*42*44*45*47*55*56*57*58*59*60*61*62*63*64*65*66*67*68*69*70*71*72*73*74*75*76*77*78*79*80*81*82*83*84*85*86*87*88*89*90*91*92*93*94*95*96*97*98*99*100*101*102*103*104*105*106*107*108*110*111*112*114*116*118*120*122*124*126*127*129*131*133*135*136*138*140*142*144*145*196*208*209*211*213*215*217*219*221*223*224*225*226*228*230*232*234*236*238*240*248*250*251*252*258*265*272*273*279*280*286*287*293*294*295*296*297*298*299*300*301*303*305 Writing the output files: (solids.c).....500.....1000.....1500.....2000.....2500.....3000.....3500.....4000.....4500.....5000.....5500.....6000.....6500... (solids.h).....500.....1000. Done. (No errors were found.) solids.c++ does not exist solids.h++ does not exist make[2]: Leaving directory '/tmp/B.c2a50e47-e333-4207-9941-d8bbac0e22cf/BUILD/3DLDF-2.0.3/src' make[2]: Entering directory '/tmp/B.c2a50e47-e333-4207-9941-d8bbac0e22cf/BUILD/3DLDF-2.0.3/src' ctangle spheres.web This is CTANGLE, Version 3.64 (Web2C 7.5.7) *1*3*4*5*6*8*21*22*23*24*25*27*28*29*31*32*34*35*37*38*40*42*43*45*47*49*51*52*54*56*57*59*61*62*64*66*68*69*71*73*75*77*78*81*82*83*84*85*87*89*91*93 Writing the output files: (spheres.c).....500.....1000.....1500 (spheres.h).. Done. (No errors were found.) spheres.c++ does not exist spheres.h++ does not exist make[2]: Leaving directory '/tmp/B.c2a50e47-e333-4207-9941-d8bbac0e22cf/BUILD/3DLDF-2.0.3/src' make[2]: Entering directory '/tmp/B.c2a50e47-e333-4207-9941-d8bbac0e22cf/BUILD/3DLDF-2.0.3/src' ctangle sphrdevl.web This is CTANGLE, Version 3.64 (Web2C 7.5.7) *1*3*4*5*6*7*9*11*13*14*16*19*20*26*27*29*31*33*35*36*38*40*41*43*45*47*48*49*50*51*53*55*57*59 Writing the output files: (sphrdevl.c).....500.... (sphrdevl.h). Done. (No errors were found.) sphrdevl.c++ does not exist sphrdevl.h++ does not exist make[2]: Leaving directory '/tmp/B.c2a50e47-e333-4207-9941-d8bbac0e22cf/BUILD/3DLDF-2.0.3/src' make[2]: Entering directory '/tmp/B.c2a50e47-e333-4207-9941-d8bbac0e22cf/BUILD/3DLDF-2.0.3/src' ctangle transfor.web This is CTANGLE, Version 3.64 (Web2C 7.5.7) *1*3*4*5*6*8*10*12*13*14*16*17*19*21*22*24*26*28*30*32*34*37*39*40*42*44*45*47*49*50*52*53*55*60*61*62*63*64*65*66*68*75*76*82*84*85*87*89 Writing the output files: (transfor.c).....500.... (transfor.h).. Done. (No errors were found.) transfor.c++ does not exist transfor.h++ does not exist make[2]: Leaving directory '/tmp/B.c2a50e47-e333-4207-9941-d8bbac0e22cf/BUILD/3DLDF-2.0.3/src' make[2]: Entering directory '/tmp/B.c2a50e47-e333-4207-9941-d8bbac0e22cf/BUILD/3DLDF-2.0.3/src' ctangle triangle.web This is CTANGLE, Version 3.64 (Web2C 7.5.7) *1*3*4*5*6*7*9*10*12*17*19*21*22*23*25*27 Writing the output files: (triangle.c).... (triangle.h). Done. (No errors were found.) triangle.c++ does not exist triangle.h++ does not exist make[2]: Leaving directory '/tmp/B.c2a50e47-e333-4207-9941-d8bbac0e22cf/BUILD/3DLDF-2.0.3/src' make[2]: Entering directory '/tmp/B.c2a50e47-e333-4207-9941-d8bbac0e22cf/BUILD/3DLDF-2.0.3/src' ctangle utility.web This is CTANGLE, Version 3.64 (Web2C 7.5.7) *1*3*4*14 Writing the output files: (utility.c) (utility.h) Done. (No errors were found.) utility.c++ does not exist utility.h++ does not exist make[2]: Leaving directory '/tmp/B.c2a50e47-e333-4207-9941-d8bbac0e22cf/BUILD/3DLDF-2.0.3/src' make[2]: Entering directory '/tmp/B.c2a50e47-e333-4207-9941-d8bbac0e22cf/BUILD/3DLDF-2.0.3/src' ctangle main.web This is CTANGLE, Version 3.64 (Web2C 7.5.7) *1*3*4*7*8*9*10*12*26 Writing the output files: (main.c).....500.....1000. (main.h) Done. (No errors were found.) main.c++ does not exist main.h++ does not exist make[2]: Leaving directory '/tmp/B.c2a50e47-e333-4207-9941-d8bbac0e22cf/BUILD/3DLDF-2.0.3/src' make[2]: Entering directory '/tmp/B.c2a50e47-e333-4207-9941-d8bbac0e22cf/BUILD/3DLDF-2.0.3/src' ctangle pspglb.web This is CTANGLE, Version 3.64 (Web2C 7.5.7) *1*3*4*5*11*16*20*36*60*81*82*83*93*96*101*102*103*115*117*119*133*134*135*136*137*138*141*143*174*179 Writing the output files: (pspglb.c).....500.....1000.....1500.....2000.....2500... (pspglb.h).....500.....1000.....1500.... Done. (No errors were found.) pspglb.c++ does not exist pspglb.h++ does not exist make[2]: Leaving directory '/tmp/B.c2a50e47-e333-4207-9941-d8bbac0e22cf/BUILD/3DLDF-2.0.3/src' make[2]: Entering directory '/tmp/B.c2a50e47-e333-4207-9941-d8bbac0e22cf/BUILD/3DLDF-2.0.3/src' x86_64-pld-linux-gnux32-g++ -DHAVE_CONFIG_H -I. -I.. -O2 -fwrapv -pipe -Wformat -Werror=format-security -gdwarf-4 -fno-debug-types-section -fvar-tracking-assignments -g2 -Wp,-D_FORTIFY_SOURCE=2 -fstack-protector-strong --param=ssp-buffer-size=4 -fPIC -mtune=generic -march=x86-64 -gdwarf-4 -fno-debug-types-section -fvar-tracking-assignments -g2 -o prbsnflx prbsnflx.c++ make[2]: Leaving directory '/tmp/B.c2a50e47-e333-4207-9941-d8bbac0e22cf/BUILD/3DLDF-2.0.3/src' make[2]: Entering directory '/tmp/B.c2a50e47-e333-4207-9941-d8bbac0e22cf/BUILD/3DLDF-2.0.3/src' ctangle parser.w This is CTANGLE, Version 3.64 (Web2C 7.5.7) *1*2*3*4*5*6*7*9*10*11*12*13*14*15*16*17*18*19*20*21*22*23*24*25*26*27*28*29*30*31*32*33*34*37*38*42*43*44*45*46*47*48*49*50*51*52*53*54*55*56*57*59*61*62*63*66*70*72*73*74*76*87*88*89*90*95*96*99*100*101*102*103*104*105*106*107*108*109*110*111*112*113*114*115*116*117*118*119*120*121*122*123*124*125*126*127*128*129*130*131*132*133*134*135*136*137*138*139*140*141*142*143*144*145*146*147*148*149*150*151*152*153*154*155*156*157*158*159*164*165*166*167*168*169*170*171*172*173*174*175*176*177*178*179*180*181*182*183*184*185*186*187*188*189*190*191*192*193*194*195*196*197*198*199*200*201*203*204*206*207*208*209*210*211*212*213*214*215*216*217*218*219*220*221*222*223*224*225*226*227*228*229*230*232*233*240*241*242*243*244*245*246*247*252*256*260*261*262*263*264*265*266*267*268*269*270*271*272*273*274*275*276*277*278*279*280*281*282*283*284*285*286*287*288*289*290*291*292*293*294*295*296*297*298*299*300*301*302*303*304*305*306*307*308*309*310*311*312*317*318*323*324*329*330*335*336*341*342*347*348*353*354*359*360*365*366*367*372*377*378*383*388*389*394*395*400*401*406*407*412*413*418*419*424*425*430*431*436*437*442*443*448*449*453*454*459*460*465*466*471*472*477*478*483*484*489*490*495*496*501*502*503*504*505*506*507*508*509*510*511*512*513*514*515*516*517*518*519*520*521*522*523*524*530*536*542*549*550*557*564*570*577*578*582*583*590*597*603*610*611*617*621*625*628*629*633*637*638*639*640*641*647*648*651*654*655*659*660*661*662*663*668*669*674*675*680*681*686*687*692*693*698*699*704*709*710*711*716*721*722*727*728*733*738*739*741*744*745*750*755*756*758*761*762*764*767*768*770*773*774*775*780*781*786*791*792*797*802*803*808*813*814*816*819*820*822*825*826*831*836*837*842*843*844*845*847*848*849*850*851*852*853*854*855*856*857*859*860*862*863*865*868*869*874*875*877*878*879*880*881*882*883*884*885*886*887*888*889*890*891*892*893*894*895*896*897*898*899*900*901*902*905*906*907*910*911*912*913*914*915*916*917*918*919*920*921*922*923*924*925*926*927*928*929*930*931*932*933*934*935*936*937*938*939*940*941*942*943*944*945*946*947*948*949*950*951*952*953*954*955*956*957*958*959*960*961*962*963*964*965*966*967*968*969*970*971*972*973*974*975*976*977*978*979*980*981*982*983*984*985*986*987*988*989*990*991*992*993*994*995*996*997*998*999*1000*1001*1002*1003*1004*1005*1006*1007*1008*1010*1013*1014*1016*1017*1019*1020*1022*1024*1025*1026*1028*1030*1031*1032*1033*1034*1036*1041*1043*1045*1047*1049*1051*1053*1056*1058*1061*1064*1067*1069*1071*1077*1078*1079*1080*1081*1082*1083*1085*1087*1089*1091*1093*1095*1097*1098*1099*1100*1101*1102*1103*1104*1105*1106*1107*1109*1112*1113*1115*1116*1117*1118*1119*1120*1121*1122*1123*1124*1125*1126*1127*1128*1130*1131*1132*1133*1134*1135*1136*1137*1138*1139*1140*1141*1142*1143*1144*1145*1146*1147*1148*1149*1150*1151*1152*1153*1154*1155*1156*1157*1158*1159*1160*1161*1162*1163*1164*1165*1166*1167*1168*1169*1170*1171*1172*1173*1174*1175*1176*1177*1178*1179*1180*1181*1182*1183*1184*1185*1186*1187*1188*1189*1190*1191*1192*1193*1194*1195*1196*1200*1201*1203*1205*1207*1209*1211*1213*1215*1217*1219*1221*1223*1225*1227*1229*1231*1233*1235*1237*1239*1240*1241*1242*1243*1244*1245*1246*1247*1248*1249*1251*1253*1255*1257*1259*1260*1264*1268*1269*1270*1271*1272*1273*1274*1275*1276*1277*1278*1279*1280*1281*1282*1283*1284*1285*1286*1287*1288*1289*1290*1291*1295*1296*1297*1298*1299*1300*1301*1302*1303*1304*1305*1306*1307*1310*1313*1316*1317*1318*1319*1321*1323*1324*1326*1327*1329*1330*1339*1340*1341*1342*1343*1344*1345*1346*1347*1348*1349*1350*1351*1352*1353*1354*1355*1356*1357*1358*1360*1362*1364*1366*1368*1370*1372*1374*1376*1378*1380*1382*1384*1386*1388*1390*1392*1394*1395*1396*1397*1398*1404*1405*1406*1407*1408*1409*1410*1411*1412*1413*1414*1415*1416*1417*1418*1419*1420*1421*1422*1423*1424*1425*1426*1427*1428*1429*1430*1431*1432*1433*1434*1435*1436*1437*1438*1439*1440*1441*1442*1443*1444*1445*1446*1447*1448*1449*1450*1451*1452*1453*1454*1455*1456*1457*1458*1459*1460*1461*1462*1463*1464*1465*1466*1467*1468*1469*1470*1473*1479*1480*1483*1484*1485*1486*1487*1488*1489*1490*1491*1492*1493*1494*1502*1503*1511*1512*1513*1514*1515*1516*1517*1518*1519*1520*1521*1522*1523*1524*1525*1526*1527*1528*1529*1530*1531*1532*1533*1534*1535*1536*1537*1538*1539*1540*1541*1542*1543*1544*1545*1546*1547*1548*1549*1550*1551*1552*1553*1554*1555*1556*1557*1558*1559*1560*1561*1562*1563*1564*1565*1566*1567*1571*1572*1582*1583*1584*1585*1586*1587*1588*1589*1590*1591*1592*1593*1594*1595*1596*1601*1602*1603*1604*1605*1606*1607*1608*1609*1610*1611*1612*1613*1614*1615*1616*1617*1618*1619*1620*1621*1622*1623*1624*1625*1626*1627*1628*1629*1630*1631*1632*1633*1634*1635*1636*1637*1638*1639*1640*1641*1642*1643*1644*1645*1646*1647*1648*1649*1650*1651*1652*1653*1654*1655*1656*1657*1658*1659*1660*1661*1662*1663*1664*1665*1666*1667*1668*1669*1670*1671*1672*1673*1674*1675*1676*1677*1678*1679*1680*1681*1682*1683*1684*1685*1686*1687*1688*1689*1690*1691*1692*1693*1694*1695*1696*1697*1698*1699*1700*1701*1702*1703*1704*1705*1706*1707*1708*1709*1710*1711*1712*1713*1714*1715*1716*1717*1718*1719*1720*1721*1723*1725*1727*1729*1731*1733*1734*1735*1736*1737*1738*1739*1740*1741*1742*1743*1745*1747*1749*1750*1752*1754*1755*1757*1759*1761*1763*1764*1766*1768*1770*1772*1774*1776*1778*1780*1782*1783*1784*1785*1786*1787*1788*1789*1790*1791*1792*1793*1794*1796*1798*1800*1801*1802*1803*1805*1806*1807*1808*1809*1810*1811*1813*1814*1815*1816*1817*1818*1819*1820*1821*1822*1823*1824*1825*1826*1827*1828*1829*1830*1831*1832*1833*1834*1835*1836*1837*1838*1839*1840*1841*1842*1843*1844*1845*1846*1847*1848*1849*1850*1851*1852*1853*1854*1855*1856*1857*1858*1859*1860*1861*1862*1863*1864*1865*1866*1867*1868*1869*1870*1871*1872*1873*1874*1875*1876*1877*1878*1879*1880*1881*1882*1883*1884*1885*1886*1887*1888*1889*1890*1891*1892*1893*1894*1895*1896*1897*1898*1899*1900*1901*1902*1903*1904*1905*1906*1907*1908*1909*1910*1911*1912*1913*1914*1915*1916*1917*1918*1919*1920*1921*1922*1924*1925*1926*1927*1928*1929*1930*1931*1932*1933*1934*1935*1936*1937*1938*1939*1940*1941*1942*1943*1944*1945*1946*1947*1948*1949*1950*1951*1952*1953*1954*1955*1956*1957*1958*1963*1964*1967*1968*1971*1972*1975*1976*1977*1978*1979*1980*1981*1982*1983*1984*1989*1990*1991*1992*1995*1996*1997*1998*2009*2017*2018*2019*2020*2021*2022*2023*2024*2027*2028*2029*2030*2031*2032*2033*2034*2037*2039*2040*2041*2042*2043*2044*2045*2046*2047*2051*2053*2055*2056*2057*2058*2059*2060*2061*2062*2063*2064*2065*2066*2067*2068*2069*2070*2071*2072*2073*2074*2075*2076*2077*2078*2079*2080*2081*2082*2083*2084*2085*2086*2087*2088*2089*2090*2091*2092*2093*2094*2095*2096*2097*2098*2099*2100*2101*2102*2103*2104*2105*2106*2107*2108*2109*2110*2111*2112*2113*2114*2115*2116*2117*2119*2121*2122*2123*2124*2125*2126*2127*2128*2129*2130*2131*2132*2133*2134*2135*2136*2137*2138*2139*2140*2141*2143*2144*2145*2146*2147*2148*2149*2150*2151*2152*2153*2154*2155*2159*2160*2161*2162*2163*2164*2165*2166*2167*2169*2175*2176*2177*2178*2179*2180*2181*2182*2183*2184*2185*2186*2187*2188*2189*2190*2191*2192*2193*2194*2195*2196*2197*2198*2199*2200*2201*2202*2203*2204*2205*2206*2207*2208*2209*2210*2211*2212*2213*2214*2215*2216*2217*2218*2219*2220*2221*2222*2223*2224*2225*2226*2227*2228*2229*2230*2231*2232*2233*2234*2235*2236*2237*2238*2239*2240*2241*2242*2243*2244*2245*2246*2247*2248*2249*2250*2251*2254*2257*2258*2259*2260*2261*2266*2267*2268*2269*2270*2271*2272*2273*2274*2275*2276*2277*2278*2279*2290*2291*2292*2293*2301*2303*2304*2305*2306*2307*2308*2309*2310*2311*2312*2315*2316*2317*2320*2323*2327*2328*2330*2335*2336*2337*2338*2339*2340*2341*2342*2343*2344*2348*2369*2371*2372*2373*2375*2376*2377*2378*2379*2380*2381*2382*2383*2384*2385*2386*2387*2388*2389*2390*2392*2393*2394*2395*2396*2400*2401*2402*2403*2404*2405*2406*2407*2408*2409*2410*2411*2415*2416*2417*2418*2419*2420*2421*2424*2425*2426*2427*2428*2429*2430*2431*2435*2436*2437*2438*2439*2440*2441*2442*2443*2444*2445*2446*2447*2448*2451*2452*2453*2454*2455*2456*2457*2458*2459*2460*2464*2466*2467*2469*2470*2471*2472*2473*2474*2476*2480*2481*2482*2483*2484*2485*2486*2487*2488*2489*2490*2491*2492*2496*2497*2498*2503*2505*2508*2509*2510*2512*2514*2515*2516*2517*2518*2519*2520*2521*2525*2526*2527*2528*2529*2530*2531*2532*2533*2534*2535*2536*2537*2538*2539*2540*2545*2548*2554*2559*2560*2561*2562*2563*2564*2565*2566*2567*2568*2571*2574*2575*2576*2577*2578*2579*2580*2587*2591*2593*2594*2595*2599*2600*2601*2608*2609*2610*2611*2612*2613*2614*2615*2616*2617*2618*2619*2620*2621*2622*2623*2624*2625*2626*2627*2628*2629*2630*2631*2632*2633*2634*2635*2636*2637*2638*2639*2640*2641*2642*2643*2644*2645*2646*2647*2648*2649*2650*2651*2652*2653*2654*2655*2656*2657*2658*2659*2660*2661*2662*2663*2664*2665*2666*2667*2668*2669*2670*2671*2672*2673*2674*2675*2676*2677*2678*2679*2680*2681*2682*2683*2684*2685*2686*2687*2688*2693*2694*2695*2696*2703*2706*2707*2708*2714*2715*2716*2717*2718*2719*2720*2721*2725*2729*2730*2731*2732*2733*2734*2735*2736*2739*2740*2742*2743*2747*2748*2751*2754*2755*2756*2757*2758*2762*2763*2764*2765*2766*2767*2768*2769*2770*2771*2772*2773*2774*2775*2776*2777*2778*2779*2780*2785*2786*2787*2792*2793*2794*2795*2796*2797*2798*2799*2800*2801*2802*2803*2809*2810*2811*2812*2816*2818*2819*2820*2822*2823*2824*2825*2827*2828*2829*2830*2831*2832*2833*2834*2835*2836*2837*2838*2839*2840*2841*2842*2843*2844*2845*2847*2848*2849*2852*2853*2854*2855*2856*2857*2858*2862*2864*2865*2866*2868*2869*2870*2871*2872*2873*2874*2875*2876*2880*2881*2882*2883*2884*2888*2889*2890*2891*2892*2893*2894*2895*2896*2897*2898*2899*2900*2901*2902*2903*2904*2905*2906*2907*2908*2909*2910*2911*2912*2913*2914*2915*2916*2917*2918*2919*2920*2921*2922*2923*2927*2928*2929*2930*2931*2932*2933*2934*2935*2936*2937*2938*2939*2940*2944*2945*2946*2947*2948*2949*2950*2951*2952*2953*2954*2955*2956*2957*2958*2959*2960*2961*2962*2963*2964*2965*2966*2967*2968*2969*2970*2974*2975*2976*2977*2978*2979*2980*2981*2982*2983*2984*2985*2989*2990*2991*2992*2993*2994*2995*2996*2997*2998*2999*3000*3004*3005*3006*3007*3008*3009*3010*3011*3012*3013*3014*3015*3016*3017*3018*3019*3023*3024*3025*3026*3027*3028*3029*3030*3031*3032*3033*3034*3035*3036*3037*3038*3039*3040*3041*3046*3047*3048*3049*3053*3054*3056*3057*3058*3062*3063*3064*3065*3066*3067*3068*3069*3073*3075*3076*3077*3079*3081*3082*3083*3084*3085*3089*3090*3091*3092*3093*3094*3095*3096*3097*3098*3099*3100*3104*3105*3106*3107*3108*3109*3110*3111*3112*3113*3114*3115*3119*3120*3121*3122*3123*3124*3125*3126*3127*3128*3129*3130*3131*3132*3136*3137*3138*3139*3140*3141*3142*3143*3144*3146*3149*3153*3155*3156*3157*3161*3162*3163*3164*3165*3166*3167*3168*3169*3170*3171*3172*3173*3174*3175*3176*3180*3181*3182*3183*3184*3185*3186*3187*3188*3189*3190*3191*3195*3196*3197*3198*3199*3200*3201*3202*3203*3204*3205*3206*3210*3211*3212*3213*3214*3215*3216*3217*3218*3219*3220*3221*3225*3226*3227*3228*3229*3230*3231*3232*3233*3234*3235*3236*3240*3241*3242*3243*3244*3245*3246*3247*3248*3249*3250*3251*3252*3253*3254*3255*3256*3257*3258*3259*3260*3264*3265*3266*3267*3268*3269*3270*3271*3272*3273*3274*3278*3279*3280*3281*3282*3283*3284*3285*3286*3287*3290*3291*3292*3293*3295*3296*3297*3298*3299*3302*3303*3304*3305*3306*3308*3309*3310*3311*3312*3313*3314*3315*3316*3317*3318*3319*3320*3321*3323*3324*3325*3328*3329*3330*3331*3333*3334*3335*3336*3337*3340*3341*3342*3343*3345*3346*3347*3348*3349*3352*3353*3354*3355*3357*3358*3359*3360*3361*3364*3365*3366*3367*3369*3370*3371*3372*3373*3376*3377*3378*3379*3381*3382*3383*3384*3385*3388*3389*3390*3391*3393*3394*3395*3396*3397*3400*3401*3402*3403*3405*3406*3407*3408*3409*3412*3413*3414*3415*3416*3418*3419*3420*3421*3422*3425*3426*3427*3428*3429*3430*3431*3432*3433*3434*3435*3436*3437*3438*3439*3440*3444*3445*3446*3447*3448*3449*3450*3451*3452*3453*3454*3457*3458*3459*3460*3462*3463*3464*3465*3466*3467*3468*3469*3470*3471*3472*3473*3474*3475*3476*3477*3478*3479*3480*3481*3482*3483*3484*3485*3486*3487*3488*3489*3490*3491*3492*3493*3494*3495*3496*3497*3498*3499*3500*3501*3502*3503*3504*3505*3508*3509*3510*3511*3513*3514*3515*3516*3517*3520*3521*3522*3523*3524*3528*3529*3531*3533*3534*3535*3536*3537*3540*3541*3542*3543*3547*3549*3550*3551*3552*3553*3556*3557*3558*3559*3563*3565*3566*3567*3568*3569*3572*3573*3574*3575*3577*3578*3579*3580*3581*3584*3585*3586*3587*3589*3590*3591*3592*3593*3596*3597*3598*3599*3601*3602*3603*3604*3605*3608*3609*3610*3611*3613*3614*3615*3616*3617*3620*3621*3622*3623*3625*3626*3627*3628*3629*3632*3633*3634*3635*3636*3637*3638*3639*3640*3642*3643*3644*3645*3646*3647*3648*3650*3651*3652*3653*3655*3656*3657*3658*3659*3662*3663*3664*3665*3668*3670*3671*3672*3673*3674*3677*3678*3679*3680*3681*3682*3683*3684*3685*3686*3690*3692*3693*3694*3695*3696*3699*3700*3701*3702*3706*3708*3709*3710*3711*3712*3715*3716*3717*3718*3720*3721*3722*3723*3724*3727*3728*3729*3730*3732*3733*3734*3735*3736*3739*3740*3741*3742*3744*3746*3747*3748*3749*3750*3753*3754*3755*3756*3760*3762*3763*3764*3765*3766*3769*3770*3771*3772*3774*3775*3776*3777*3778*3781*3782*3783*3784*3786*3787*3788*3789*3790*3793*3794*3795*3796*3798*3799*3800*3801*3802*3805*3806*3807*3808*3810*3811*3812*3813*3814*3817*3818*3819*3820*3822*3823*3824*3825*3826*3829*3830*3831*3832*3834*3835*3836*3837*3838*3841*3842*3843*3844*3846*3847*3848*3850*3851*3852*3853*3854*3855*3856*3857*3858*3859*3860*3861*3862*3863*3864*3865*3866*3867*3868*3869*3870*3871*3872*3873*3874*3875*3876*3877*3878*3879*3880*3881*3882*3883*3884*3885*3886*3887*3888*3889*3890*3891*3892*3893*3894*3895*3896*3897*3898*3899*3900*3901*3902*3903*3904*3905*3906*3907*3908*3909*3910*3911*3912*3913*3914*3915*3916*3917*3918*3919*3920*3921*3922*3923*3924*3925*3926*3927*3928*3929*3930*3931*3932*3933*3934*3935*3936*3937*3938*3939*3940*3941*3942*3943*3944*3945*3947*3948*3950*3951*3955*3956*3958*3959*3960*3961*3962*3963*3966*3967*3968*3969*3970*3971*3972*3975*3976*3977*3978*3979*3980*3981*3982*3983*3984*3985*3986*3987*3988*3989*3990*3991*3992*3993*3994*3995*3996*3997*3998*3999*4000*4001*4003*4004*4005*4006*4007*4008*4009*4010*4011*4012*4013*4014*4015*4016*4017*4018*4019*4020*4021*4022*4023*4024*4025*4026*4027*4028*4029*4030*4031*4032*4033*4034*4035*4036*4037*4038*4039*4040*4041*4042*4043*4044*4045*4046*4047*4048*4049*4050*4051*4052*4053*4054*4055*4056*4057*4058*4059*4060*4061*4062*4063*4064*4065*4066*4067*4068*4069*4070*4071*4072*4073*4074*4075*4076*4077*4078*4079*4080*4081*4082*4083*4084*4085*4086*4087*4088*4089*4090*4091*4092*4093*4094*4095*4096*4097*4098*4099*4100*4101*4102*4103*4104*4105*4106*4107*4108*4109*4110*4111*4112*4113*4114*4115*4116*4117*4118*4119*4120*4121*4122*4123*4124*4125*4136*4137*4138*4139*4141*4142*4146*4147*4148*4152*4156*4157*4158*4159*4160*4161*4162*4163*4164*4165*4166*4167*4168*4169*4170*4171*4172*4173*4174*4180*4182 Writing the output files: (parser.c).....500.....1000.....1500.....2000.....2500.....3000.....3500.....4000.....4500.....5000.....5500.....6000.....6500.....7000.....7500.....8000.....8500.....9000.....9500.....10000.....10500.....11000.....11500.....12000.....12500.....13000.....13500.....14000.....14500.....15000.....15500.....16000.....16500.....17000.....17500.....18000.....18500.....19000.....19500.....20000.....20500.....21000.....21500.....22000.....22500.....23000.....23500.....24000.....24500.....25000.....25500.....26000.....26500.....27000.....27500.....28000.....28500.....29000.....29500.....30000.....30500.....31000.....31500.....32000.....32500.....33000.....33500.....34000.....34500.....35000.....35500.....36000.....36500.....37000.....37500.....38000.....38500.....39000.....39500.....40000.....40500.....41000.....41500.....42000.....42500.....43000.....43500.....44000.....44500.....45000.....45500.....46000.....46500.....47000.....47500.....48000.....48500.....49000.....49500.....50000.....50500.....51000.....51500.....52000.....52500.....53000.....53500.....54000.....54500.....55000.....55500.....56000.....56500.....57000.....57500.....58000.....58500.....59000.....59500.....60000.....60500.....61000.....61500.....62000.....62500.....63000.....63500.....64000.....64500.....65000.....65500.....66000.....66500.....67000.....67500.....68000.....68500.....69000.....69500.....70000.....70500.....71000.....71500.....72000.....72500.....73000.....73500.....74000.....74500.....75000.....75500.....76000.....76500.....77000.....77500.....78000.....78500.....79000. (parser_1.h++). Done. (No errors were found.) ./prbsnflx parser.c parser.y rm parser.c ./check_scan_parse_output.sh parser.y parser.y++ parser.y++ does not exist touch parser.y++ make[2]: Leaving directory '/tmp/B.c2a50e47-e333-4207-9941-d8bbac0e22cf/BUILD/3DLDF-2.0.3/src' make[2]: Entering directory '/tmp/B.c2a50e47-e333-4207-9941-d8bbac0e22cf/BUILD/3DLDF-2.0.3/src' bison -y --debug -d -o parser.cxx parser.y++ parser.y++:152.1-12: warning: deprecated directive, use '%pure-parser' [-Wdeprecated] %pure_parser ^^^^^^^^^^^^ parser.y++: warning: 731 shift/reduce conflicts [-Wconflicts-sr] parser.y++: warning: 1 reduce/reduce conflict [-Wconflicts-rr] ./check_scan_parse_output.sh parser.cxx parser.c++ parser.c++ does not exist ./check_scan_parse_output.sh parser.hxx parser.h++ parser.h++ does not exist touch parser.h++ make[2]: Leaving directory '/tmp/B.c2a50e47-e333-4207-9941-d8bbac0e22cf/BUILD/3DLDF-2.0.3/src' make[2]: Entering directory '/tmp/B.c2a50e47-e333-4207-9941-d8bbac0e22cf/BUILD/3DLDF-2.0.3/src' /bin/sh ../libtool --tag=CXX --mode=compile x86_64-pld-linux-gnux32-g++ -DHAVE_CONFIG_H -I. -I.. -O2 -fwrapv -pipe -Wformat -Werror=format-security -gdwarf-4 -fno-debug-types-section -fvar-tracking-assignments -g2 -Wp,-D_FORTIFY_SOURCE=2 -fstack-protector-strong --param=ssp-buffer-size=4 -fPIC -mtune=generic -march=x86-64 -gdwarf-4 -fno-debug-types-section -fvar-tracking-assignments -g2 -MT arc.lo -MD -MP -MF .deps/arc.Tpo -c -o arc.lo arc.c++ libtool: compile: x86_64-pld-linux-gnux32-g++ -DHAVE_CONFIG_H -I. -I.. -O2 -fwrapv -pipe -Wformat -Werror=format-security -gdwarf-4 -fno-debug-types-section -fvar-tracking-assignments -g2 -Wp,-D_FORTIFY_SOURCE=2 -fstack-protector-strong --param=ssp-buffer-size=4 -fPIC -mtune=generic -march=x86-64 -gdwarf-4 -fno-debug-types-section -fvar-tracking-assignments -g2 -MT arc.lo -MD -MP -MF .deps/arc.Tpo -c arc.c++ -o arc.o In file included from ./arc.web:68:0: ./pspglb.web:5082:48: error: redeclaration of 'template<class C> int Scan_Parse::show_func(C*, std::__cxx11::string, void*)' may not have default arguments [-fpermissive] show_func(C* c, string text = "", void* parameter = 0); ^ In file included from ./arc.web:69:0: ./io.web:4940:56: error: redeclaration of 'template<class C> void* Scan_Parse::get_point_func(real, C*, void*)' may not have default arguments [-fpermissive] Scan_Parse::get_point_func(real r, C* c, void* parameter = 0); ^ ./io.web:4945:50: error: redeclaration of 'template<class C> void* Scan_Parse::get_center_func(C*, void*)' may not have default arguments [-fpermissive] Scan_Parse::get_center_func(C* c, void* parameter = 0); ^ ./io.web:4950:75: error: redeclaration of 'template<class C> void* Scan_Parse::get_focus_func(C*, short unsigned int, void*)' may not have default arguments [-fpermissive] Scan_Parse::get_focus_func(C* c, const unsigned short s = 0, void* parameter = 0); ^ ./io.web:4955:76: error: redeclaration of 'template<class C> void* Scan_Parse::get_vertex_func(C*, short unsigned int, void*)' may not have default arguments [-fpermissive] Scan_Parse::get_vertex_func(C* c, const unsigned short s = 0, void* parameter = 0); ^ In file included from ./arc.web:69:0: ./io.web:5013:29: error: redeclaration of 'template<class C> std::__cxx11::string* Scan_Parse::sub_binary_number_string_func(C, bool, Scanner_Node)' may not have default arguments [-fpermissive] Scanner_Node scanner_node = 0); ^ In file included from ./arc.web:69:0: ./io.web:5038:11: error: redeclaration of 'template<class C> int Scan_Parse::shape_decl_func(Scanner_Node, int, C*)' may not have default arguments [-fpermissive] C* dummy = 0); ^ In file included from ./arc.web:69:0: ./io.web:5167:57: error: redeclaration of 'template<class C> void* Scan_Parse::normal_func(C*, Scanner_Node)' may not have default arguments [-fpermissive] Scan_Parse::normal_func(C* c, Scanner_Node scanner_node = 0); ^ In file included from ./arc.web:69:0: ./io.web:5229:11: error: redeclaration of 'template<class C> int Scan_Parse::vector_type_decl(Scanner_Node, int, int, C*)' may not have default arguments [-fpermissive] C* dummy = 0); ^ ./io.web:5240:23: error: redeclaration of 'template<class C> int Scan_Parse::vector_type_plus_assign(Scanner_Node, Id_Map_Entry_Node, int, int, C*, bool)' may not have default arguments [-fpermissive] bool copy_object = true); ^ ./io.web:5248:11: error: redeclaration of 'template<class C, class D> int Scan_Parse::vector_type_assign(Scanner_Node, Id_Map_Entry_Node, const Pointer_Vector<D>*, C*)' may not have default arguments [-fpermissive] C* dummy = 0); ^ ./io.web:5370:54: error: redeclaration of 'template<class C> int Scan_Parse::reverse_func(void*, void*, C*)' may not have default arguments [-fpermissive] Scan_Parse::reverse_func(void* v, void* parameter, C* c = 0); ^ In file included from ./arc.web:69:0: ./io.web:5617:31: error: redeclaration of 'template<class C> void* Scan_Parse::get_conic_section_func(Pointer_Vector<Point>*, int, short unsigned int, C*, void*, bool, bool, real, bool)' may not have default arguments [-fpermissive] bool ignore_extra_points = true); ^ In file included from ./arc.web:69:0: ./io.web:5684:7: error: redeclaration of 'template<class C> int Scan_Parse::cull_func(void*, short unsigned int, Scanner_Node, real, C*)' may not have default arguments [-fpermissive] C* c = 0); ^ ./io.web:5696:7: error: redeclaration of 'template<class C> int Scan_Parse::rectify_func(void*, Scanner_Node, bool, bool, bool, real, Transform*, C*)' may not have default arguments [-fpermissive] C* c = 0); ^ In file included from ./arc.web:69:0: ./io.web:5712:49: error: redeclaration of 'template<class C> void* Scan_Parse::in_cuboid_func(C*, void*)' may not have default arguments [-fpermissive] Scan_Parse::in_cuboid_func(C* c, void* parameter = 0); ^ ./io.web:5717:50: error: redeclaration of 'template<class C> void* Scan_Parse::out_cuboid_func(C*, void*)' may not have default arguments [-fpermissive] Scan_Parse::out_cuboid_func(C* c, void* parameter = 0); ^ In file included from ./arc.web:69:0: ./io.web:6036:51: error: redeclaration of 'template<class C> void* Scan_Parse::is_whatever_func(C*, void*)' may not have default arguments [-fpermissive] Scan_Parse::is_whatever_func(C* c, void* parameter = 0); ^ ./io.web:6053:7: error: redeclaration of 'template<class C, class D, class E> void* Scan_Parse::intersection_points_func(C*, D*, void*, E*)' may not have default arguments [-fpermissive] E* e = 0); ^ ./io.web:6064:69: error: redeclaration of 'template<class C, class D> void* Scan_Parse::ellipse_like_intersection_func(C*, D*, void*)' may not have default arguments [-fpermissive] Scan_Parse::ellipse_like_intersection_func(C* c, D* d, void* parameter = 0); ^ ./io.web:6069:78: error: redeclaration of 'template<class C> void* Scan_Parse::ellipse_like_plane_intersection_func(C*, void*, void*)' may not have default arguments [-fpermissive] Scan_Parse::ellipse_like_plane_intersection_func(C* c, void* w, void* parameter = 0); ^ ./io.web:6074:70: error: redeclaration of 'template<class C, class D> void* Scan_Parse::conic_section_intersection_func(C*, D*, void*)' may not have default arguments [-fpermissive] Scan_Parse::conic_section_intersection_func(C* c, D* d, void* parameter = 0); ^ ./io.web:6079:69: error: redeclaration of 'template<class C, class D> void* Scan_Parse::polygon_like_intersection_func(C*, D*, void*)' may not have default arguments [-fpermissive] Scan_Parse::polygon_like_intersection_func(C* c, D* d, void* parameter = 0); ^ ./io.web:6087:18: error: redeclaration of 'template<class C> void* Scan_Parse::ellipsoid_like_plane_intersection_func(C*, Plane*, void*)' may not have default arguments [-fpermissive] void* parameter = 0); ^ ./io.web:6103:50: error: redeclaration of 'template<class C> void* Scan_Parse::plane_cast_func(C*, void*)' may not have default arguments [-fpermissive] Scan_Parse::plane_cast_func(C* c, void* parameter = 0); ^ ./io.web:6108:67: error: redeclaration of 'template<class C> void* Scan_Parse::plane_assignment_func(void*, C*, void*)' may not have default arguments [-fpermissive] Scan_Parse::plane_assignment_func(void* entry, C* c, void* parameter = 0); ^ ./io.web:6117:60: error: redeclaration of 'template<class C> int Scan_Parse::show_func(C*, std::__cxx11::string, void*)' may not have default arguments [-fpermissive] Scan_Parse::show_func(C* c, string text = "", void* parameter = 0); ^ In file included from ./arc.web:69:0: ./io.web:4940:56: error: redeclaration of 'template<class C> void* Scan_Parse::get_point_func(real, C*, void*)' may not have default arguments [-fpermissive] Scan_Parse::get_point_func(real r, C* c, void* parameter = 0); ^ ./io.web:4945:50: error: redeclaration of 'template<class C> void* Scan_Parse::get_center_func(C*, void*)' may not have default arguments [-fpermissive] Scan_Parse::get_center_func(C* c, void* parameter = 0); ^ ./io.web:4950:75: error: redeclaration of 'template<class C> void* Scan_Parse::get_focus_func(C*, short unsigned int, void*)' may not have default arguments [-fpermissive] Scan_Parse::get_focus_func(C* c, const unsigned short s = 0, void* parameter = 0); ^ ./io.web:4955:76: error: redeclaration of 'template<class C> void* Scan_Parse::get_vertex_func(C*, short unsigned int, void*)' may not have default arguments [-fpermissive] Scan_Parse::get_vertex_func(C* c, const unsigned short s = 0, void* parameter = 0); ^ In file included from ./arc.web:69:0: ./io.web:5013:29: error: redeclaration of 'template<class C> std::__cxx11::string* Scan_Parse::sub_binary_number_string_func(C, bool, Scanner_Node)' may not have default arguments [-fpermissive] Scanner_Node scanner_node = 0); ^ In file included from ./arc.web:69:0: ./io.web:5038:11: error: redeclaration of 'template<class C> int Scan_Parse::shape_decl_func(Scanner_Node, int, C*)' may not have default arguments [-fpermissive] C* dummy = 0); ^ In file included from ./arc.web:69:0: ./io.web:5167:57: error: redeclaration of 'template<class C> void* Scan_Parse::normal_func(C*, Scanner_Node)' may not have default arguments [-fpermissive] Scan_Parse::normal_func(C* c, Scanner_Node scanner_node = 0); ^ In file included from ./arc.web:69:0: ./io.web:5229:11: error: redeclaration of 'template<class C> int Scan_Parse::vector_type_decl(Scanner_Node, int, int, C*)' may not have default arguments [-fpermissive] C* dummy = 0); ^ ./io.web:5240:23: error: redeclaration of 'template<class C> int Scan_Parse::vector_type_plus_assign(Scanner_Node, Id_Map_Entry_Node, int, int, C*, bool)' may not have default arguments [-fpermissive] bool copy_object = true); ^ ./io.web:5248:11: error: redeclaration of 'template<class C, class D> int Scan_Parse::vector_type_assign(Scanner_Node, Id_Map_Entry_Node, const Pointer_Vector<D>*, C*)' may not have default arguments [-fpermissive] C* dummy = 0); ^ ./io.web:5370:54: error: redeclaration of 'template<class C> int Scan_Parse::reverse_func(void*, void*, C*)' may not have default arguments [-fpermissive] Scan_Parse::reverse_func(void* v, void* parameter, C* c = 0); ^ In file included from ./arc.web:69:0: ./io.web:5450:31: error: redeclaration of 'template<class C> void* standardize_func(C*, void*)' may not have default arguments [-fpermissive] standardize_func(C* c, void* v = 0); ^ In file included from ./arc.web:69:0: ./io.web:5617:31: error: redeclaration of 'template<class C> void* Scan_Parse::get_conic_section_func(Pointer_Vector<Point>*, int, short unsigned int, C*, void*, bool, bool, real, bool)' may not have default arguments [-fpermissive] bool ignore_extra_points = true); ^ In file included from ./arc.web:69:0: ./io.web:5684:7: error: redeclaration of 'template<class C> int Scan_Parse::cull_func(void*, short unsigned int, Scanner_Node, real, C*)' may not have default arguments [-fpermissive] C* c = 0); ^ ./io.web:5696:7: error: redeclaration of 'template<class C> int Scan_Parse::rectify_func(void*, Scanner_Node, bool, bool, bool, real, Transform*, C*)' may not have default arguments [-fpermissive] C* c = 0); ^ In file included from ./arc.web:69:0: ./io.web:5712:49: error: redeclaration of 'template<class C> void* Scan_Parse::in_cuboid_func(C*, void*)' may not have default arguments [-fpermissive] Scan_Parse::in_cuboid_func(C* c, void* parameter = 0); ^ ./io.web:5717:50: error: redeclaration of 'template<class C> void* Scan_Parse::out_cuboid_func(C*, void*)' may not have default arguments [-fpermissive] Scan_Parse::out_cuboid_func(C* c, void* parameter = 0); ^ In file included from ./arc.web:69:0: ./io.web:6036:51: error: redeclaration of 'template<class C> void* Scan_Parse::is_whatever_func(C*, void*)' may not have default arguments [-fpermissive] Scan_Parse::is_whatever_func(C* c, void* parameter = 0); ^ ./io.web:6053:7: error: redeclaration of 'template<class C, class D, class E> void* Scan_Parse::intersection_points_func(C*, D*, void*, E*)' may not have default arguments [-fpermissive] E* e = 0); ^ ./io.web:6064:69: error: redeclaration of 'template<class C, class D> void* Scan_Parse::ellipse_like_intersection_func(C*, D*, void*)' may not have default arguments [-fpermissive] Scan_Parse::ellipse_like_intersection_func(C* c, D* d, void* parameter = 0); ^ ./io.web:6069:78: error: redeclaration of 'template<class C> void* Scan_Parse::ellipse_like_plane_intersection_func(C*, void*, void*)' may not have default arguments [-fpermissive] Scan_Parse::ellipse_like_plane_intersection_func(C* c, void* w, void* parameter = 0); ^ ./io.web:6074:70: error: redeclaration of 'template<class C, class D> void* Scan_Parse::conic_section_intersection_func(C*, D*, void*)' may not have default arguments [-fpermissive] Scan_Parse::conic_section_intersection_func(C* c, D* d, void* parameter = 0); ^ ./io.web:6079:69: error: redeclaration of 'template<class C, class D> void* Scan_Parse::polygon_like_intersection_func(C*, D*, void*)' may not have default arguments [-fpermissive] Scan_Parse::polygon_like_intersection_func(C* c, D* d, void* parameter = 0); ^ ./io.web:6087:18: error: redeclaration of 'template<class C> void* Scan_Parse::ellipsoid_like_plane_intersection_func(C*, Plane*, void*)' may not have default arguments [-fpermissive] void* parameter = 0); ^ ./io.web:6103:50: error: redeclaration of 'template<class C> void* Scan_Parse::plane_cast_func(C*, void*)' may not have default arguments [-fpermissive] Scan_Parse::plane_cast_func(C* c, void* parameter = 0); ^ ./io.web:6108:67: error: redeclaration of 'template<class C> void* Scan_Parse::plane_assignment_func(void*, C*, void*)' may not have default arguments [-fpermissive] Scan_Parse::plane_assignment_func(void* entry, C* c, void* parameter = 0); ^ ./io.web:6117:60: error: redeclaration of 'template<class C> int Scan_Parse::show_func(C*, std::__cxx11::string, void*)' may not have default arguments [-fpermissive] Scan_Parse::show_func(C* c, string text = "", void* parameter = 0); ^ In file included from ./arc.web:69:0: ./io.web:4940:56: error: redeclaration of 'template<class C> void* Scan_Parse::get_point_func(real, C*, void*)' may not have default arguments [-fpermissive] Scan_Parse::get_point_func(real r, C* c, void* parameter = 0); ^ ./io.web:4945:50: error: redeclaration of 'template<class C> void* Scan_Parse::get_center_func(C*, void*)' may not have default arguments [-fpermissive] Scan_Parse::get_center_func(C* c, void* parameter = 0); ^ ./io.web:4950:75: error: redeclaration of 'template<class C> void* Scan_Parse::get_focus_func(C*, short unsigned int, void*)' may not have default arguments [-fpermissive] Scan_Parse::get_focus_func(C* c, const unsigned short s = 0, void* parameter = 0); ^ ./io.web:4955:76: error: redeclaration of 'template<class C> void* Scan_Parse::get_vertex_func(C*, short unsigned int, void*)' may not have default arguments [-fpermissive] Scan_Parse::get_vertex_func(C* c, const unsigned short s = 0, void* parameter = 0); ^ In file included from ./arc.web:69:0: ./io.web:5013:29: error: redeclaration of 'template<class C> std::__cxx11::string* Scan_Parse::sub_binary_number_string_func(C, bool, Scanner_Node)' may not have default arguments [-fpermissive] Scanner_Node scanner_node = 0); ^ In file included from ./arc.web:69:0: ./io.web:5038:11: error: redeclaration of 'template<class C> int Scan_Parse::shape_decl_func(Scanner_Node, int, C*)' may not have default arguments [-fpermissive] C* dummy = 0); ^ In file included from ./arc.web:69:0: ./io.web:5167:57: error: redeclaration of 'template<class C> void* Scan_Parse::normal_func(C*, Scanner_Node)' may not have default arguments [-fpermissive] Scan_Parse::normal_func(C* c, Scanner_Node scanner_node = 0); ^ In file included from ./arc.web:69:0: ./io.web:5229:11: error: redeclaration of 'template<class C> int Scan_Parse::vector_type_decl(Scanner_Node, int, int, C*)' may not have default arguments [-fpermissive] C* dummy = 0); ^ ./io.web:5240:23: error: redeclaration of 'template<class C> int Scan_Parse::vector_type_plus_assign(Scanner_Node, Id_Map_Entry_Node, int, int, C*, bool)' may not have default arguments [-fpermissive] bool copy_object = true); ^ ./io.web:5248:11: error: redeclaration of 'template<class C, class D> int Scan_Parse::vector_type_assign(Scanner_Node, Id_Map_Entry_Node, const Pointer_Vector<D>*, C*)' may not have default arguments [-fpermissive] C* dummy = 0); ^ ./io.web:5370:54: error: redeclaration of 'template<class C> int Scan_Parse::reverse_func(void*, void*, C*)' may not have default arguments [-fpermissive] Scan_Parse::reverse_func(void* v, void* parameter, C* c = 0); ^ In file included from ./arc.web:69:0: ./io.web:5450:31: error: redeclaration of 'template<class C> void* standardize_func(C*, void*)' may not have default arguments [-fpermissive] standardize_func(C* c, void* v = 0); ^ In file included from ./arc.web:69:0: ./io.web:5617:31: error: redeclaration of 'template<class C> void* Scan_Parse::get_conic_section_func(Pointer_Vector<Point>*, int, short unsigned int, C*, void*, bool, bool, real, bool)' may not have default arguments [-fpermissive] bool ignore_extra_points = true); ^ In file included from ./arc.web:69:0: ./io.web:5684:7: error: redeclaration of 'template<class C> int Scan_Parse::cull_func(void*, short unsigned int, Scanner_Node, real, C*)' may not have default arguments [-fpermissive] C* c = 0); ^ ./io.web:5696:7: error: redeclaration of 'template<class C> int Scan_Parse::rectify_func(void*, Scanner_Node, bool, bool, bool, real, Transform*, C*)' may not have default arguments [-fpermissive] C* c = 0); ^ In file included from ./arc.web:69:0: ./io.web:5712:49: error: redeclaration of 'template<class C> void* Scan_Parse::in_cuboid_func(C*, void*)' may not have default arguments [-fpermissive] Scan_Parse::in_cuboid_func(C* c, void* parameter = 0); ^ ./io.web:5717:50: error: redeclaration of 'template<class C> void* Scan_Parse::out_cuboid_func(C*, void*)' may not have default arguments [-fpermissive] Scan_Parse::out_cuboid_func(C* c, void* parameter = 0); ^ In file included from ./arc.web:69:0: ./io.web:6036:51: error: redeclaration of 'template<class C> void* Scan_Parse::is_whatever_func(C*, void*)' may not have default arguments [-fpermissive] Scan_Parse::is_whatever_func(C* c, void* parameter = 0); ^ ./io.web:6053:7: error: redeclaration of 'template<class C, class D, class E> void* Scan_Parse::intersection_points_func(C*, D*, void*, E*)' may not have default arguments [-fpermissive] E* e = 0); ^ ./io.web:6064:69: error: redeclaration of 'template<class C, class D> void* Scan_Parse::ellipse_like_intersection_func(C*, D*, void*)' may not have default arguments [-fpermissive] Scan_Parse::ellipse_like_intersection_func(C* c, D* d, void* parameter = 0); ^ ./io.web:6069:78: error: redeclaration of 'template<class C> void* Scan_Parse::ellipse_like_plane_intersection_func(C*, void*, void*)' may not have default arguments [-fpermissive] Scan_Parse::ellipse_like_plane_intersection_func(C* c, void* w, void* parameter = 0); ^ ./io.web:6074:70: error: redeclaration of 'template<class C, class D> void* Scan_Parse::conic_section_intersection_func(C*, D*, void*)' may not have default arguments [-fpermissive] Scan_Parse::conic_section_intersection_func(C* c, D* d, void* parameter = 0); ^ ./io.web:6079:69: error: redeclaration of 'template<class C, class D> void* Scan_Parse::polygon_like_intersection_func(C*, D*, void*)' may not have default arguments [-fpermissive] Scan_Parse::polygon_like_intersection_func(C* c, D* d, void* parameter = 0); ^ ./io.web:6087:18: error: redeclaration of 'template<class C> void* Scan_Parse::ellipsoid_like_plane_intersection_func(C*, Plane*, void*)' may not have default arguments [-fpermissive] void* parameter = 0); ^ ./io.web:6103:50: error: redeclaration of 'template<class C> void* Scan_Parse::plane_cast_func(C*, void*)' may not have default arguments [-fpermissive] Scan_Parse::plane_cast_func(C* c, void* parameter = 0); ^ ./io.web:6108:67: error: redeclaration of 'template<class C> void* Scan_Parse::plane_assignment_func(void*, C*, void*)' may not have default arguments [-fpermissive] Scan_Parse::plane_assignment_func(void* entry, C* c, void* parameter = 0); ^ ./io.web:6117:60: error: redeclaration of 'template<class C> int Scan_Parse::show_func(C*, std::__cxx11::string, void*)' may not have default arguments [-fpermissive] Scan_Parse::show_func(C* c, string text = "", void* parameter = 0); ^ Makefile:693: recipe for target 'arc.lo' failed make[2]: *** [arc.lo] Error 1 make[2]: Leaving directory '/tmp/B.c2a50e47-e333-4207-9941-d8bbac0e22cf/BUILD/3DLDF-2.0.3/src' Makefile:451: recipe for target 'all-recursive' failed make[1]: *** [all-recursive] Error 1 Makefile:382: recipe for target 'all' failed make: *** [all] Error 2 error: Bad exit status from /tmp/B.c2a50e47-e333-4207-9941-d8bbac0e22cf/BUILD/tmp/rpm-tmp.27792 (%build) RPM build errors: Bad exit status from /tmp/B.c2a50e47-e333-4207-9941-d8bbac0e22cf/BUILD/tmp/rpm-tmp.27792 (%build) ended at: Fri Dec 25 22:55:09 2015, done in 0:00:12.783158 error: No files produced. + chmod -R u+rwX /tmp/B.c2a50e47-e333-4207-9941-d8bbac0e22cf/BUILD + rm -rf /tmp/B.c2a50e47-e333-4207-9941-d8bbac0e22cf/tmp /tmp/B.c2a50e47-e333-4207-9941-d8bbac0e22cf/BUILD + rm -rf /tmp/B.c2a50e47-e333-4207-9941-d8bbac0e22cf Begin-PLD-Builder-Info Build-Time: user:12.15s sys:1.35s real:17.59s (faults io:0 non-io:595225) End-PLD-Builder-Info
[Back to list of logs] [View rpm -qa of builder]